PHP-7.1.2 test report
| From: | Marcin Żyrkowski TRONEL | Date: | Fri, 17 Mar 2017 10:18:21 +0000 |
| Subject: | PHP-7.1.2 test report | ||
| Groups: | php.qa.reports | ||
| Request: | Send a blank email to php-qa-reports+get-33956@lists.php.net to get a copy of this message | ||
===================================================================== EXPECTED FAILED TEST SUMMARY --------------------------------------------------------------------- Test open_basedir configuration [tests/security/open_basedir_linkinfo.phpt] XFAIL REASON: BUG: open_basedir cannot delete symlink to prohibited file. See also bugs 48111 and 52176. Inconsistencies when accessing protected members [Zend/tests/access_modifiers_008.phpt] XFAIL REASON: Discussion: http://marc.info/?l=php-internals&m=120221184420957&w=2 Inconsistencies when accessing protected members - 2 [Zend/tests/access_modifiers_009.phpt] XFAIL REASON: Discussion: http://marc.info/?l=php-internals&m=120221184420957&w=2 Bug #48770 (call_user_func_array() fails to call parent from inheriting class) [Zend/tests/bug48770.phpt] XFAIL REASON: See Bug #48770 Bug #48770 (call_user_func_array() fails to call parent from inheriting class) [Zend/tests/bug48770_2.phpt] XFAIL REASON: See Bug #48770 Bug #48770 (call_user_func_array() fails to call parent from inheriting class) [Zend/tests/bug48770_3.phpt] XFAIL REASON: See Bug #48770 Initial value of static var in method depends on the include time of the class definition [Zend/tests/method_static_var.phpt] XFAIL REASON: Maybe not a bug DateTime::add() -- fall type2 type3 [ext/date/tests/DateTime_add-fall-type2-type3.phpt] XFAIL REASON: Various bugs exist DateTime::add() -- fall type3 type2 [ext/date/tests/DateTime_add-fall-type3-type2.phpt] XFAIL REASON: Various bugs exist DateTime::add() -- fall type3 type3 [ext/date/tests/DateTime_add-fall-type3-type3.phpt] XFAIL REASON: Various bugs exist DateTime::add() -- spring type2 type3 [ext/date/tests/DateTime_add-spring-type2-type3.phpt] XFAIL REASON: Various bugs exist DateTime::add() -- spring type3 type2 [ext/date/tests/DateTime_add-spring-type3-type2.phpt] XFAIL REASON: Various bugs exist DateTime::add() -- spring type3 type3 [ext/date/tests/DateTime_add-spring-type3-type3.phpt] XFAIL REASON: Various bugs exist DateTime::diff() -- fall type2 type3 [ext/date/tests/DateTime_diff-fall-type2-type3.phpt] XFAIL REASON: Various bugs exist DateTime::diff() -- fall type3 type2 [ext/date/tests/DateTime_diff-fall-type3-type2.phpt] XFAIL REASON: Various bugs exist DateTime::diff() -- fall type3 type3 [ext/date/tests/DateTime_diff-fall-type3-type3.phpt] XFAIL REASON: Various bugs exist DateTime::diff() -- spring type2 type3 [ext/date/tests/DateTime_diff-spring-type2-type3.phpt] XFAIL REASON: Various bugs exist DateTime::diff() -- spring type3 type2 [ext/date/tests/DateTime_diff-spring-type3-type2.phpt] XFAIL REASON: Various bugs exist DateTime::diff() -- spring type3 type3 [ext/date/tests/DateTime_diff-spring-type3-type3.phpt] XFAIL REASON: Various bugs exist DateTime::sub() -- fall type2 type3 [ext/date/tests/DateTime_sub-fall-type2-type3.phpt] XFAIL REASON: Various bugs exist DateTime::sub() -- fall type3 type2 [ext/date/tests/DateTime_sub-fall-type3-type2.phpt] XFAIL REASON: Various bugs exist DateTime::sub() -- fall type3 type3 [ext/date/tests/DateTime_sub-fall-type3-type3.phpt] XFAIL REASON: Various bugs exist DateTime::sub() -- spring type2 type3 [ext/date/tests/DateTime_sub-spring-type2-type3.phpt] XFAIL REASON: Various bugs exist DateTime::sub() -- spring type3 type2 [ext/date/tests/DateTime_sub-spring-type3-type2.phpt] XFAIL REASON: Various bugs exist DateTime::sub() -- spring type3 type3 [ext/date/tests/DateTime_sub-spring-type3-type3.phpt] XFAIL REASON: Various bugs exist Bug #55407 (Impossible to prototype DateTime::createFromFormat) [ext/date/tests/bug55407.phpt] XFAIL REASON: Bug #55407 RFC: DateTime and Daylight Saving Time Transitions (zone type 3, bd2) [ext/date/tests/rfc-datetime_and_daylight_saving_time-type3-bd2.phpt] XFAIL REASON: Still not quite right RFC: DateTime and Daylight Saving Time Transitions (zone type 3, fs) [ext/date/tests/rfc-datetime_and_daylight_saving_time-type3-fs.phpt] XFAIL REASON: Still not quite right Bug #42718 (unsafe_raw filter not applied when configured as default filter) [ext/filter/tests/bug42718.phpt] XFAIL REASON: FILTER_UNSAFE_RAW not applied when configured as default filter, even with flags Bug #67296 (filter_input doesn't validate variables) [ext/filter/tests/bug49184.phpt] XFAIL REASON: See Bug #49184 Bug #67167: filter_var(null,FILTER_VALIDATE_BOOLEAN,FILTER_NULL_ON_FAILURE) returns null [ext/filter/tests/bug67167.02.phpt] XFAIL REASON: Requires php_zval_filter to not use convert_to_string for all filters. Phar: bug #69958: Segfault in Phar::convertToData on invalid file [ext/phar/tests/bug69958.phpt] XFAIL REASON: Still has memory leaks, see https://bugs.php.net/bug.php?id=70005 updateTimestamp never called when session data is empty [ext/session/tests/bug71162.phpt] XFAIL REASON: Current session module is designed to write empty session always. In addition, current session module only supports SessionHandlerInterface only from PHP 7.0. Bug #70219 Use after free vulnerability in session deserializer [ext/standard/tests/serialize/bug70219.phpt] XFAIL REASON: Unfinished merge, needs fix. Bug #70470 (Built-in server truncates headers spanning over TCP packets) [sapi/cli/tests/bug70470.phpt] XFAIL REASON: bug is not fixed yet ===================================================================== ===================================================================== FAILED TEST SUMMARY --------------------------------------------------------------------- SimpleXML: Simple document [ext/simplexml/tests/001-mb.phpt] int stream_socket_sendto ( resource $socket , string $data [, int $flags = 0 [, string $address ]] ); [ext/standard/tests/streams/stream_socket_sendto.phpt] ===================================================================== ===================================================================== TEST RESULT SUMMARY --------------------------------------------------------------------- Exts skipped : 48 Exts tested : 26 --------------------------------------------------------------------- Number of tests : 15301 10237 Tests skipped : 5064 ( 33.1%) -------- Tests warned : 0 ( 0.0%) ( 0.0%) Tests failed : 2 ( 0.0%) ( 0.0%) Expected fail : 35 ( 0.2%) ( 0.3%) Tests passed : 10200 ( 66.7%) ( 99.6%) --------------------------------------------------------------------- Time taken : 625 seconds ===================================================================== ===================================================================== EXPECTED FAILED TEST SUMMARY --------------------------------------------------------------------- Test open_basedir configuration [tests/security/open_basedir_linkinfo.phpt] XFAIL REASON: BUG: open_basedir cannot delete symlink to prohibited file. See also bugs 48111 and 52176. Inconsistencies when accessing protected members [Zend/tests/access_modifiers_008.phpt] XFAIL REASON: Discussion: http://marc.info/?l=php-internals&m=120221184420957&w=2 Inconsistencies when accessing protected members - 2 [Zend/tests/access_modifiers_009.phpt] XFAIL REASON: Discussion: http://marc.info/?l=php-internals&m=120221184420957&w=2 Bug #48770 (call_user_func_array() fails to call parent from inheriting class) [Zend/tests/bug48770.phpt] XFAIL REASON: See Bug #48770 Bug #48770 (call_user_func_array() fails to call parent from inheriting class) [Zend/tests/bug48770_2.phpt] XFAIL REASON: See Bug #48770 Bug #48770 (call_user_func_array() fails to call parent from inheriting class) [Zend/tests/bug48770_3.phpt] XFAIL REASON: See Bug #48770 Initial value of static var in method depends on the include time of the class definition [Zend/tests/method_static_var.phpt] XFAIL REASON: Maybe not a bug DateTime::add() -- fall type2 type3 [ext/date/tests/DateTime_add-fall-type2-type3.phpt] XFAIL REASON: Various bugs exist DateTime::add() -- fall type3 type2 [ext/date/tests/DateTime_add-fall-type3-type2.phpt] XFAIL REASON: Various bugs exist DateTime::add() -- fall type3 type3 [ext/date/tests/DateTime_add-fall-type3-type3.phpt] XFAIL REASON: Various bugs exist DateTime::add() -- spring type2 type3 [ext/date/tests/DateTime_add-spring-type2-type3.phpt] XFAIL REASON: Various bugs exist DateTime::add() -- spring type3 type2 [ext/date/tests/DateTime_add-spring-type3-type2.phpt] XFAIL REASON: Various bugs exist DateTime::add() -- spring type3 type3 [ext/date/tests/DateTime_add-spring-type3-type3.phpt] XFAIL REASON: Various bugs exist DateTime::diff() -- fall type2 type3 [ext/date/tests/DateTime_diff-fall-type2-type3.phpt] XFAIL REASON: Various bugs exist DateTime::diff() -- fall type3 type2 [ext/date/tests/DateTime_diff-fall-type3-type2.phpt] XFAIL REASON: Various bugs exist DateTime::diff() -- fall type3 type3 [ext/date/tests/DateTime_diff-fall-type3-type3.phpt] XFAIL REASON: Various bugs exist DateTime::diff() -- spring type2 type3 [ext/date/tests/DateTime_diff-spring-type2-type3.phpt] XFAIL REASON: Various bugs exist DateTime::diff() -- spring type3 type2 [ext/date/tests/DateTime_diff-spring-type3-type2.phpt] XFAIL REASON: Various bugs exist DateTime::diff() -- spring type3 type3 [ext/date/tests/DateTime_diff-spring-type3-type3.phpt] XFAIL REASON: Various bugs exist DateTime::sub() -- fall type2 type3 [ext/date/tests/DateTime_sub-fall-type2-type3.phpt] XFAIL REASON: Various bugs exist DateTime::sub() -- fall type3 type2 [ext/date/tests/DateTime_sub-fall-type3-type2.phpt] XFAIL REASON: Various bugs exist DateTime::sub() -- fall type3 type3 [ext/date/tests/DateTime_sub-fall-type3-type3.phpt] XFAIL REASON: Various bugs exist DateTime::sub() -- spring type2 type3 [ext/date/tests/DateTime_sub-spring-type2-type3.phpt] XFAIL REASON: Various bugs exist DateTime::sub() -- spring type3 type2 [ext/date/tests/DateTime_sub-spring-type3-type2.phpt] XFAIL REASON: Various bugs exist DateTime::sub() -- spring type3 type3 [ext/date/tests/DateTime_sub-spring-type3-type3.phpt] XFAIL REASON: Various bugs exist Bug #55407 (Impossible to prototype DateTime::createFromFormat) [ext/date/tests/bug55407.phpt] XFAIL REASON: Bug #55407 RFC: DateTime and Daylight Saving Time Transitions (zone type 3, bd2) [ext/date/tests/rfc-datetime_and_daylight_saving_time-type3-bd2.phpt] XFAIL REASON: Still not quite right RFC: DateTime and Daylight Saving Time Transitions (zone type 3, fs) [ext/date/tests/rfc-datetime_and_daylight_saving_time-type3-fs.phpt] XFAIL REASON: Still not quite right Bug #42718 (unsafe_raw filter not applied when configured as default filter) [ext/filter/tests/bug42718.phpt] XFAIL REASON: FILTER_UNSAFE_RAW not applied when configured as default filter, even with flags Bug #67296 (filter_input doesn't validate variables) [ext/filter/tests/bug49184.phpt] XFAIL REASON: See Bug #49184 Bug #67167: filter_var(null,FILTER_VALIDATE_BOOLEAN,FILTER_NULL_ON_FAILURE) returns null [ext/filter/tests/bug67167.02.phpt] XFAIL REASON: Requires php_zval_filter to not use convert_to_string for all filters. Phar: bug #69958: Segfault in Phar::convertToData on invalid file [ext/phar/tests/bug69958.phpt] XFAIL REASON: Still has memory leaks, see https://bugs.php.net/bug.php?id=70005 updateTimestamp never called when session data is empty [ext/session/tests/bug71162.phpt] XFAIL REASON: Current session module is designed to write empty session always. In addition, current session module only supports SessionHandlerInterface only from PHP 7.0. Bug #70219 Use after free vulnerability in session deserializer [ext/standard/tests/serialize/bug70219.phpt] XFAIL REASON: Unfinished merge, needs fix. Bug #70470 (Built-in server truncates headers spanning over TCP packets) [sapi/cli/tests/bug70470.phpt] XFAIL REASON: bug is not fixed yet ===================================================================== ===================================================================== FAILED TEST SUMMARY --------------------------------------------------------------------- SimpleXML: Simple document [ext/simplexml/tests/001-mb.phpt] int stream_socket_sendto ( resource $socket , string $data [, int $flags = 0 [, string $address ]] ); [ext/standard/tests/streams/stream_socket_sendto.phpt] ===================================================================== ================================================================================ /home/zyrmar1/deleme/php-7.1.2/ext/simplexml/tests/001-mb.phpt ================================================================================ Warning: simplexml_load_file(): /home/zyrmar1/deleme/php-7.1.2/ext/simplexml/tests/sxeç§ã¯ã¬ã©ã¹ãé£ã¹ããã¾ã.xml:4: I/O warning : failed to load external entity "sxe.ent" in /home/zyrmar1/deleme/php-7.1.2/ext/simplexml/tests/001-mb.php on line 3 Warning: simplexml_load_file(): %incent; in /home/zyrmar1/deleme/php-7.1.2/ext/simplexml/tests/001-mb.php on line 3 Warning: simplexml_load_file(): ^ in /home/zyrmar1/deleme/php-7.1.2/ext/simplexml/tests/001-mb.php on line 3 Warning: simplexml_load_file(): %incent; in /home/zyrmar1/deleme/php-7.1.2/ext/simplexml/tests/001-mb.php on line 3 Warning: simplexml_load_file(): ^ in /home/zyrmar1/deleme/php-7.1.2/ext/simplexml/tests/001-mb.php on line 3 object(SimpleXMLElement)#1 (2) { ["@attributes"]=> array(1) { ["id"]=> string(5) "elem1" } ["elem1"]=> object(SimpleXMLElement)#2 (3) { ["@attributes"]=> array(1) { ["attr1"]=> string(5) "first" } ["comment"]=> object(SimpleXMLElement)#3 (0) { } ["elem2"]=> object(SimpleXMLElement)#4 (1) { ["elem3"]=> object(SimpleXMLElement)#5 (1) { ["elem4"]=> object(SimpleXMLElement)#6 (1) { ["test"]=> object(SimpleXMLElement)#7 (0) { } } } } } } ===DONE=== ================================================================================ 001+ Warning: simplexml_load_file(): /home/zyrmar1/deleme/php-7.1.2/ext/simplexml/tests/sxeç§ã¯ã¬ã©ã¹ãé£ã¹ããã¾ã.xml:4: I/O warning : failed to load external entity "sxe.ent" in /home/zyrmar1/deleme/php-7.1.2/ext/simplexml/tests/001-mb.php on line 3 002+ 003+ Warning: simplexml_load_file(): %incent; in /home/zyrmar1/deleme/php-7.1.2/ext/simplexml/tests/001-mb.php on line 3 004+ 005+ Warning: simplexml_load_file(): ^ in /home/zyrmar1/deleme/php-7.1.2/ext/simplexml/tests/001-mb.php on line 3 006+ 007+ Warning: simplexml_load_file(): %incent; in /home/zyrmar1/deleme/php-7.1.2/ext/simplexml/tests/001-mb.php on line 3 008+ 009+ Warning: simplexml_load_file(): ^ in /home/zyrmar1/deleme/php-7.1.2/ext/simplexml/tests/001-mb.php on line 3 ================================================================================ ================================================================================ /home/zyrmar1/deleme/php-7.1.2/ext/standard/tests/streams/stream_socket_sendto.phpt ================================================================================ Notice: fwrite(): send of 23 bytes failed with errno=32 Broken pipe in /home/zyrmar1/deleme/php-7.1.2/ext/standard/tests/streams/stream_socket_sendto.php on line 9 Warning: stream_socket_sendto() expects at least 2 parameters, 0 given in /home/zyrmar1/deleme/php-7.1.2/ext/standard/tests/streams/stream_socket_sendto.php on line 10 bool(false) Warning: stream_socket_sendto() expects at least 2 parameters, 1 given in /home/zyrmar1/deleme/php-7.1.2/ext/standard/tests/streams/stream_socket_sendto.php on line 11 bool(false) Warning: stream_socket_sendto(): Broken pipe in /home/zyrmar1/deleme/php-7.1.2/ext/standard/tests/streams/stream_socket_sendto.php on line 12 int(-1) Warning: stream_socket_sendto(): Broken pipe in /home/zyrmar1/deleme/php-7.1.2/ext/standard/tests/streams/stream_socket_sendto.php on line 13 int(-1) Warning: stream_socket_sendto(): Broken pipe in /home/zyrmar1/deleme/php-7.1.2/ext/standard/tests/streams/stream_socket_sendto.php on line 14 int(-1) Warning: stream_socket_sendto(): Broken pipe in /home/zyrmar1/deleme/php-7.1.2/ext/standard/tests/streams/stream_socket_sendto.php on line 15 int(-1) ================================================================================ 017+ Warning: stream_socket_sendto(): Broken pipe 018+ in /home/zyrmar1/deleme/php-7.1.2/ext/standard/tests/streams/stream_socket_sendto.php on line 14 019+ int(-1) 017- Warning: stream_socket_sendto(): php_network_getaddresses: getaddrinfo failed: Name or service not known in %s on line %i 019- Warning: stream_socket_sendto(): Failed to resolve %s: php_network_getaddresses: getaddrinfo failed: Name or service not known in %s on line %i 020- 021- Warning: stream_socket_sendto(): Failed to parse %s into a valid network address in %s on line %i 021+ Warning: stream_socket_sendto(): Broken pipe 022+ in /home/zyrmar1/deleme/php-7.1.2/ext/standard/tests/streams/stream_socket_sendto.php on line 15 023+ int(-1) 022- bool(%s) 023- 024- Warning: stream_socket_sendto(): php_network_getaddresses: getaddrinfo failed: Name or service not known in %s on line %i 025- 026- Warning: stream_socket_sendto(): Failed to resolve %s: php_network_getaddresses: getaddrinfo failed: Name or service not known in %s on line %i 027- 028- Warning: stream_socket_sendto(): Failed to parse %s into a valid network address in %s on line %i 029- bool(%s) ================================================================================ ================================================================================ BUILD ENVIRONMENT ================================================================================ OS: Linux - Linux vereo.pl 2.6.35.14-106.fc14.x86_64 #1 SMP Wed Nov 23 13:07:52 UTC 2011 x86_64 Autoconf: autoconf (GNU Autoconf) 2.66 Copyright (C) 2010 Free Software Foundation, Inc. License GPLv3+/Autoconf: GNU GPL version 3 or later <http://gnu.org/licenses/gpl.html>, <http://gnu.org/licenses/exceptions.html> This is free software: you are free to change and redistribute it. There is NO WARRANTY, to the extent permitted by law. Written by David J. MacKenzie and Akim Demaille. Bundled Libtool: ltmain.sh (GNU libtool) 1.5.26 (1.1220.2.492 2008/01/30 06:40:56) Copyright (C) 2008 Free Software Foundation, Inc. This is free software; see the source for copying conditions. There is NO warranty; not even for MERCHANTABILITY or FITNESS FOR A PARTICULAR PURPOSE. System Libtool: N/A Compiler: Using built-in specs. COLLECT_GCC=cc COLLECT_LTO_WRAPPER=/usr/libexec/gcc/x86_64-redhat-linux/4.5.1/lto-wrapper Target: x86_64-redhat-linux Configured with: ../configure --prefix=/usr --mandir=/usr/share/man --infodir=/usr/share/info --with-bugurl=http://bugzilla.redhat.com/bugzilla --enable-bootstrap --enable-shared --enable-threads=posix --enable-checking=release --with-system-zlib --enable-__cxa_atexit --disable-libunwind-exceptions --enable-gnu-unique-object --enable-linker-build-id --enable-languages=c,c++,objc,obj-c++,java,fortran,ada,lto --enable-plugin --enable-java-awt=gtk --disable-dssi --with-java-home=/usr/lib/jvm/java-1.5.0-gcj-1.5.0.0/jre --enable-libgcj-multifile --enable-java-maintainer-mode --with-ecj-jar=/usr/share/java/eclipse-ecj.jar --disable-libjava-multilib --with-ppl --with-cloog --with-tune=generic --with-arch_32=i686 --build=x86_64-redhat-linux Thread model: posix gcc version 4.5.1 20100924 (Red Hat 4.5.1-4) (GCC) Bison: Libraries: linux-vdso.so.1 => (0x00007fff661ff000) libcrypt.so.1 => /lib64/libcrypt.so.1 (0x0000003e11e00000) libresolv.so.2 => /lib64/libresolv.so.2 (0x0000003e10a00000) librt.so.1 => /lib64/librt.so.1 (0x0000003e0fe00000) libm.so.6 => /lib64/libm.so.6 (0x0000003562a00000) libdl.so.2 => /lib64/libdl.so.2 (0x0000003e0f200000) libnsl.so.1 => /lib64/libnsl.so.1 (0x0000003e13600000) libxml2.so.2 => /usr/lib64/libxml2.so.2 (0x0000003bca200000) libz.so.1 => /lib64/libz.so.1 (0x0000003e0f600000) libc.so.6 => /lib64/libc.so.6 (0x0000003e0ea00000) libfreebl3.so => /lib64/libfreebl3.so (0x0000003e11a00000) libpthread.so.0 => /lib64/libpthread.so.0 (0x0000003e0ee00000) /lib64/ld-linux-x86-64.so.2 (0x0000003e0e600000) ================================================================================ PHPINFO ================================================================================ phpinfo() PHP Version => 7.1.2 System => Linux vereo.pl 2.6.35.14-106.fc14.x86_64 #1 SMP Wed Nov 23 13:07:52 UTC 2011 x86_64 Build Date => Mar 17 2017 10:47:05 Configure Command => './configure' '--prefix=/opt/php-7.1.2' Server API => Command Line Interface Virtual Directory Support => disabled Configuration File (php.ini) Path => /opt/php-7.1.2/lib Loaded Configuration File => (none) Scan this dir for additional .ini files => (none) Additional .ini files parsed => (none) PHP API => 20160303 PHP Extension => 20160303 Zend Extension => 320160303 Zend Extension Build => API320160303,NTS PHP Extension Build => API20160303,NTS Debug Build => no Thread Safety => disabled Zend Signal Handling => enabled Zend Memory Manager => enabled Zend Multibyte Support => disabled IPv6 Support => enabled DTrace Support => disabled Registered PHP Streams => php, file, glob, data, http, ftp, phar Registered Stream Socket Transports => tcp, udp, unix, udg Registered Stream Filters => convert.iconv.*, string.rot13, string.toupper, string.tolower, string.strip_tags, convert.*, consumed, dechunk This program makes use of the Zend Scripting Language Engine: Zend Engine v3.1.0, Copyright (c) 1998-2017 Zend Technologies _______________________________________________________________________ Configuration Core PHP Version => 7.1.2 Directive => Local Value => Master Value allow_url_fopen => On => On allow_url_include => Off => Off arg_separator.input => & => & arg_separator.output => & => & auto_append_file => no value => no value auto_globals_jit => On => On auto_prepend_file => no value => no value browscap => no value => no value default_charset => UTF-8 => UTF-8 default_mimetype => text/html => text/html disable_classes => no value => no value disable_functions => no value => no value display_errors => STDERR => STDERR display_startup_errors => Off => Off doc_root => no value => no value docref_ext => no value => no value docref_root => no value => no value enable_dl => On => On enable_post_data_reading => On => On error_append_string => no value => no value error_log => no value => no value error_prepend_string => no value => no value error_reporting => no value => no value expose_php => On => On extension_dir => /opt/php-7.1.2/lib/php/extensions/no-debug-non-zts-20160303 => /opt/php-7.1.2/lib/php/extensions/no-debug-non-zts-20160303 file_uploads => On => On hard_timeout => 2 => 2 highlight.comment => <font style="color: #FF8000">#FF8000</font> => <font style="color: #FF8000">#FF8000</font> highlight.default => <font style="color: #0000BB">#0000BB</font> => <font style="color: #0000BB">#0000BB</font> highlight.html => <font style="color: #000000">#000000</font> => <font style="color: #000000">#000000</font> highlight.keyword => <font style="color: #007700">#007700</font> => <font style="color: #007700">#007700</font> highlight.string => <font style="color: #DD0000">#DD0000</font> => <font style="color: #DD0000">#DD0000</font> html_errors => Off => Off ignore_repeated_errors => Off => Off ignore_repeated_source => Off => Off ignore_user_abort => Off => Off implicit_flush => On => On include_path => .:/opt/php-7.1.2/lib/php => .:/opt/php-7.1.2/lib/php input_encoding => no value => no value internal_encoding => no value => no value log_errors => Off => Off log_errors_max_len => 1024 => 1024 mail.add_x_header => Off => Off mail.force_extra_parameters => no value => no value mail.log => no value => no value max_execution_time => 0 => 0 max_file_uploads => 20 => 20 max_input_nesting_level => 64 => 64 max_input_time => -1 => -1 max_input_vars => 1000 => 1000 memory_limit => 128M => 128M open_basedir => no value => no value output_buffering => 0 => 0 output_encoding => no value => no value output_handler => no value => no value post_max_size => 8M => 8M precision => 14 => 14 realpath_cache_size => 4096K => 4096K realpath_cache_ttl => 120 => 120 register_argc_argv => On => On report_memleaks => On => On report_zend_debug => Off => Off request_order => no value => no value sendmail_from => no value => no value sendmail_path => /usr/sbin/sendmail -t -i => /usr/sbin/sendmail -t -i serialize_precision => -1 => -1 short_open_tag => On => On SMTP => localhost => localhost smtp_port => 25 => 25 sql.safe_mode => Off => Off sys_temp_dir => no value => no value track_errors => Off => Off unserialize_callback_func => no value => no value upload_max_filesize => 2M => 2M upload_tmp_dir => no value => no value user_dir => no value => no value user_ini.cache_ttl => 300 => 300 user_ini.filename => .user.ini => .user.ini variables_order => EGPCS => EGPCS xmlrpc_error_number => 0 => 0 xmlrpc_errors => Off => Off zend.assertions => 1 => 1 zend.detect_unicode => On => On zend.enable_gc => On => On zend.multibyte => Off => Off zend.script_encoding => no value => no value zend.signal_check => Off => Off ctype ctype functions => enabled date date/time support => enabled "Olson" Timezone Database Version => 2016.10 Timezone Database => internal Default timezone => UTC Directive => Local Value => Master Value date.default_latitude => 31.7667 => 31.7667 date.default_longitude => 35.2333 => 35.2333 date.sunrise_zenith => 90.583333 => 90.583333 date.sunset_zenith => 90.583333 => 90.583333 date.timezone => no value => no value dom DOM/XML => enabled DOM/XML API Version => 20031129 libxml Version => 2.7.7 HTML Support => enabled XPath Support => enabled XPointer Support => enabled Schema Support => enabled RelaxNG Support => enabled fileinfo fileinfo support => enabled version => 1.0.5 libmagic => 522 filter Input Validation and Filtering => enabled Revision => $Id: cdc5e15bb616f10210b94ecd8789e66c927a375f $ Directive => Local Value => Master Value filter.default => unsafe_raw => unsafe_raw filter.default_flags => no value => no value hash hash support => enabled Hashing Engines => md2 md4 md5 sha1 sha224 sha256 sha384 sha512/224 sha512/256 sha512 sha3-224 sha3-256 sha3-384 sha3-512 ripemd128 ripemd160 ripemd256 ripemd320 whirlpool tiger128,3 tiger160,3 tiger192,3 tiger128,4 tiger160,4 tiger192,4 snefru snefru256 gost gost-crypto adler32 crc32 crc32b fnv132 fnv1a32 fnv164 fnv1a64 joaat haval128,3 haval160,3 haval192,3 haval224,3 haval256,3 haval128,4 haval160,4 haval192,4 haval224,4 haval256,4 haval128,5 haval160,5 haval192,5 haval224,5 haval256,5 iconv iconv support => enabled iconv implementation => glibc iconv library version => 2.13 Directive => Local Value => Master Value iconv.input_encoding => no value => no value iconv.internal_encoding => no value => no value iconv.output_encoding => no value => no value json json support => enabled json version => 1.5.0 libxml libXML support => active libXML Compiled Version => 2.7.7 libXML Loaded Version => 20707 libXML streams => enabled pcre PCRE (Perl Compatible Regular Expressions) Support => enabled PCRE Library Version => 8.38 2015-11-23 PCRE JIT Support => enabled Directive => Local Value => Master Value pcre.backtrack_limit => 1000000 => 1000000 pcre.jit => 1 => 1 pcre.recursion_limit => 100000 => 100000 PDO PDO support => enabled PDO drivers => sqlite pdo_sqlite PDO Driver for SQLite 3.x => enabled SQLite Library => 3.15.1 Phar Phar: PHP Archive support => enabled Phar EXT version => 2.0.2 Phar API version => 1.1.1 SVN revision => $Id: 59c11f4e29768bfbbf6f41cb469abd81d8655850 $ Phar-based phar archives => enabled Tar-based phar archives => enabled ZIP-based phar archives => enabled gzip compression => disabled (install ext/zlib) bzip2 compression => disabled (install pecl/bz2) OpenSSL support => disabled (install ext/openssl) Phar based on pear/PHP_Archive, original concept by Davey Shafik. Phar fully realized by Gregory Beaver and Marcus Boerger. Portions of tar implementation Copyright (c) 2003-2009 Tim Kientzle. Directive => Local Value => Master Value phar.cache_list => no value => no value phar.readonly => On => On phar.require_hash => On => On posix Revision => $Id: b691ca925e7a085e6929579c4eba8fed0732e0ef $ Reflection Reflection => enabled Version => $Id: a06522d025b0af3e6ba10a0f6964086b7e6f5458 $ session Session Support => enabled Registered save handlers => files user Registered serializer handlers => php_serialize php php_binary Directive => Local Value => Master Value session.auto_start => Off => Off session.cache_expire => 180 => 180 session.cache_limiter => nocache => nocache session.cookie_domain => no value => no value session.cookie_httponly => Off => Off session.cookie_lifetime => 0 => 0 session.cookie_path => / => / session.cookie_secure => Off => Off session.gc_divisor => 100 => 100 session.gc_maxlifetime => 1440 => 1440 session.gc_probability => 1 => 1 session.lazy_write => On => On session.name => PHPSESSID => PHPSESSID session.referer_check => no value => no value session.save_handler => files => files session.save_path => no value => no value session.serialize_handler => php => php session.sid_bits_per_character => 4 => 4 session.sid_length => 32 => 32 session.upload_progress.cleanup => On => On session.upload_progress.enabled => On => On session.upload_progress.freq => 1% => 1% session.upload_progress.min_freq => 1 => 1 session.upload_progress.name => PHP_SESSION_UPLOAD_PROGRESS => PHP_SESSION_UPLOAD_PROGRESS session.upload_progress.prefix => upload_progress_ => upload_progress_ session.use_cookies => On => On session.use_only_cookies => On => On session.use_strict_mode => Off => Off session.use_trans_sid => 0 => 0 SimpleXML Simplexml support => enabled Revision => $Id: 7e5516dcdf2fe6ded7970eaeb6abd8d07df39a2a $ Schema support => enabled SPL SPL support => enabled Interfaces => Countable, OuterIterator, RecursiveIterator, SeekableIterator, SplObserver, SplSubject Classes => AppendIterator, ArrayIterator, ArrayObject, BadFunctionCallException, BadMethodCallException, CachingIterator, CallbackFilterIterator, DirectoryIterator, DomainException, EmptyIterator, FilesystemIterator, FilterIterator, GlobIterator, InfiniteIterator, InvalidArgumentException, IteratorIterator, LengthException, LimitIterator, LogicException, MultipleIterator, NoRewindIterator, OutOfBoundsException, OutOfRangeException, OverflowException, ParentIterator, RangeException, RecursiveArrayIterator, RecursiveCachingIterator, RecursiveCallbackFilterIterator, RecursiveDirectoryIterator, RecursiveFilterIterator, RecursiveIteratorIterator, RecursiveRegexIterator, RecursiveTreeIterator, RegexIterator, RuntimeException, SplDoublyLinkedList, SplFileInfo, SplFileObject, SplFixedArray, SplHeap, SplMinHeap, SplMaxHeap, SplObjectStorage, SplPriorityQueue, SplQueue, SplStack, SplTempFileObject, UnderflowException, UnexpectedValueException sqlite3 SQLite3 support => enabled SQLite3 module version => 0.7-dev SQLite Library => 3.15.1 Directive => Local Value => Master Value sqlite3.extension_dir => no value => no value standard Dynamic Library Support => enabled Path to sendmail => /usr/sbin/sendmail -t -i Directive => Local Value => Master Value assert.active => 1 => 1 assert.bail => 0 => 0 assert.callback => no value => no value assert.exception => 0 => 0 assert.quiet_eval => 0 => 0 assert.warning => 1 => 1 auto_detect_line_endings => 0 => 0 default_socket_timeout => 60 => 60 from => no value => no value session.trans_sid_hosts => no value => no value session.trans_sid_tags => a=href,area=href,frame=src,form= => a=href,area=href,frame=src,form= url_rewriter.hosts => no value => no value url_rewriter.tags => form= => form= user_agent => no value => no value tokenizer Tokenizer Support => enabled xml XML Support => active XML Namespace Support => active libxml2 Version => 2.7.7 xmlreader XMLReader => enabled xmlwriter XMLWriter => enabled Additional Modules Module Name Environment Variable => Value VNCDESKTOP => vereo.pl:1 (zyrmar1) HOSTNAME => vereo.pl TEST_PHP_SRCDIR => /home/zyrmar1/deleme/php-7.1.2 SHELL => /bin/bash TERM => xterm MAKEFLAGS => HISTSIZE => 1000 SSH_CLIENT => deleted TEST_PHPDBG_EXECUTABLE => /home/zyrmar1/deleme/php-7.1.2/sapi/phpdbg/phpdbg WINDOWID => 6291490 SSH_TTY => deleted XTERM_SHELL => /bin/bash USER => zyrmar1 SVN_EDITOR => vnc LS_COLORS => rs=0:di=01;34:ln=01;36:mh=00:pi=40;33:so=01;35:do=01;35:bd=40;33;01:cd=40;33;01:or=40;31;01:mi=01;05;37;41:su=37;41:sg=30;43:ca=30;41:tw=30;42:ow=34;42:st=37;44:ex=01;32:*.tar=01;31:*...tgz=01;31:*.arj=01;31:*.taz=01;31:*.lzh=01;31:*.lzma=01;31:*.tlz=01;31:*.txz=01;31:*.zip=01;31:*.z=01;31:*.Z=01;31:*.dz=01;31:*.gz=01;31:*.lz=01;31:*.xz=01;31:*.bz2=01;31:*.tbz=01;31:*.tbz2=01;31:*.bz=01;31:*.tz=01;31:*.deb=01;31:*.rpm=01;31:*.jar=01;31:*.war=01;31:*.ear=01;31:*.sar=01;31:*.rar=01;31:*.ace=01;31:*.zoo=01;31:*.cpio=01;31:*.7z=01;31:*.rz=01;31:*.jpg=01;35:*...jpeg=01;35:*.gif=01;35:*.bmp=01;35:*.pbm=01;35:*.pgm=01;35:*.ppm=01;35:*.tga=01;35:*.xbm=01;35:*.xpm=01;35:*.tif=01;35:*.tiff=01;35:*.png=01;35:*.svg=01;35:*.svgz=01;35:*.mng=01;35:*.pcx=01;35:*.mov=01;35:*.mpg=01;35:*.mpeg=01;35:*.m2v=01;35:*.mkv=01;35:*.ogm=01;35:*.mp4=01;35:*.m4v=01;35:*.mp4v=01;35:*.vob=01;35:*.qt=01;35:*.nuv=01;35:*.wmv=01;35:*.asf=01;35:*.rm=01;35:*.rmvb=01;35:*.flc=01;35:*.avi=01;35:*.fli=01;35:*.flv=01;35:*.gl=01;35:*.dl=01;35:*.xcf=01;35:*.xwd=01;35:*.yuv=01;35:*.cgm=01;35:*.emf=01;35:*.axv=01;35:*.anx=01;35:*.ogv=01;35:*.ogx=01;35:*...aac=01;36:*.au=01;36:*.flac=01;36:*.mid=01;36:*.midi=01;36:*.mka=01;36:*.mp3=01;36:*.mpc=01;36:*.ogg=01;36:*.ra=01;36:*.wav=01;36:*.axa=01;36:*.oga=01;36:*.spx=01;36:*.xspf=01;36: SSH_AUTH_SOCK => deleted MAKELEVEL => 1 MFLAGS => PATH => /usr/local/bin:/bin:/usr/bin:/usr/local/sbin:/usr/sbin:/sbin:/home/zyrmar1/bin:/home/zyrmar1/bin MAIL => /var/spool/mail/zyrmar1 _ => /home/zyrmar1/deleme/php-7.1.2/sapi/cli/php PWD => /home/zyrmar1/deleme/php-7.1.2 LANG => en_US.UTF-8 TEST_PHP_EXECUTABLE => /home/zyrmar1/deleme/php-7.1.2/sapi/cli/php HISTCONTROL => ignoredups XTERM_VERSION => X.Org 6.8.99.903(261) XTERM_LOCALE => en_US.UTF-8 HOME => /home/zyrmar1 SHLVL => 6 LOGNAME => zyrmar1 SSH_CONNECTION => deleted LESSOPEN => ||/usr/bin/lesspipe.sh %s DISPLAY => :1.0 CC => cc G_BROKEN_FILENAMES => 1 PHP Variables Variable => Value $_SERVER['VNCDESKTOP'] => vereo.pl:1 (zyrmar1) $_SERVER['HOSTNAME'] => vereo.pl $_SERVER['TEST_PHP_SRCDIR'] => /home/zyrmar1/deleme/php-7.1.2 $_SERVER['SHELL'] => /bin/bash $_SERVER['TERM'] => xterm $_SERVER['MAKEFLAGS'] => $_SERVER['HISTSIZE'] => 1000 $_SERVER['SSH_CLIENT'] => deleted $_SERVER['TEST_PHPDBG_EXECUTABLE'] => /home/zyrmar1/deleme/php-7.1.2/sapi/phpdbg/phpdbg $_SERVER['WINDOWID'] => 6291490 $_SERVER['SSH_TTY'] => deleted $_SERVER['XTERM_SHELL'] => /bin/bash $_SERVER['USER'] => zyrmar1 $_SERVER['SVN_EDITOR'] => vnc $_SERVER['LS_COLORS'] => rs=0:di=01;34:ln=01;36:mh=00:pi=40;33:so=01;35:do=01;35:bd=40;33;01:cd=40;33;01:or=40;31;01:mi=01;05;37;41:su=37;41:sg=30;43:ca=30;41:tw=30;42:ow=34;42:st=37;44:ex=01;32:*.tar=01;31:*...tgz=01;31:*.arj=01;31:*.taz=01;31:*.lzh=01;31:*.lzma=01;31:*.tlz=01;31:*.txz=01;31:*.zip=01;31:*.z=01;31:*.Z=01;31:*.dz=01;31:*.gz=01;31:*.lz=01;31:*.xz=01;31:*.bz2=01;31:*.tbz=01;31:*.tbz2=01;31:*.bz=01;31:*.tz=01;31:*.deb=01;31:*.rpm=01;31:*.jar=01;31:*.war=01;31:*.ear=01;31:*.sar=01;31:*.rar=01;31:*.ace=01;31:*.zoo=01;31:*.cpio=01;31:*.7z=01;31:*.rz=01;31:*.jpg=01;35:*...jpeg=01;35:*.gif=01;35:*.bmp=01;35:*.pbm=01;35:*.pgm=01;35:*.ppm=01;35:*.tga=01;35:*.xbm=01;35:*.xpm=01;35:*.tif=01;35:*.tiff=01;35:*.png=01;35:*.svg=01;35:*.svgz=01;35:*.mng=01;35:*.pcx=01;35:*.mov=01;35:*.mpg=01;35:*.mpeg=01;35:*.m2v=01;35:*.mkv=01;35:*.ogm=01;35:*.mp4=01;35:*.m4v=01;35:*.mp4v=01;35:*.vob=01;35:*.qt=01;35:*.nuv=01;35:*.wmv=01;35:*.asf=01;35:*.rm=01;35:*.rmvb=01;35:*.flc=01;35:*.avi=01;35:*.fli=01;35:*.flv=01;35:*.gl=01;35:*.dl=01;35:*.xcf=01;35:*.xwd=01;35:*.yuv=01;35:*.cgm=01;35:*.emf=01;35:*.axv=01;35:*.anx=01;35:*.ogv=01;35:*.ogx=01;35:*...aac=01;36:*.au=01;36:*.flac=01;36:*.mid=01;36:*.midi=01;36:*.mka=01;36:*.mp3=01;36:*.mpc=01;36:*.ogg=01;36:*.ra=01;36:*.wav=01;36:*.axa=01;36:*.oga=01;36:*.spx=01;36:*.xspf=01;36: $_SERVER['SSH_AUTH_SOCK'] => deleted $_SERVER['MAKELEVEL'] => 1 $_SERVER['MFLAGS'] => $_SERVER['PATH'] => /usr/local/bin:/bin:/usr/bin:/usr/local/sbin:/usr/sbin:/sbin:/home/zyrmar1/bin:/home/zyrmar1/bin $_SERVER['MAIL'] => /var/spool/mail/zyrmar1 $_SERVER['_'] => /home/zyrmar1/deleme/php-7.1.2/sapi/cli/php $_SERVER['PWD'] => /home/zyrmar1/deleme/php-7.1.2 $_SERVER['LANG'] => en_US.UTF-8 $_SERVER['TEST_PHP_EXECUTABLE'] => /home/zyrmar1/deleme/php-7.1.2/sapi/cli/php $_SERVER['HISTCONTROL'] => ignoredups $_SERVER['XTERM_VERSION'] => X.Org 6.8.99.903(261) $_SERVER['XTERM_LOCALE'] => en_US.UTF-8 $_SERVER['HOME'] => /home/zyrmar1 $_SERVER['SHLVL'] => 6 $_SERVER['LOGNAME'] => zyrmar1 $_SERVER['SSH_CONNECTION'] => deleted $_SERVER['LESSOPEN'] => ||/usr/bin/lesspipe.sh %s $_SERVER['DISPLAY'] => :1.0 $_SERVER['CC'] => cc $_SERVER['G_BROKEN_FILENAMES'] => 1 $_SERVER['PHP_SELF'] => $_SERVER['SCRIPT_NAME'] => $_SERVER['SCRIPT_FILENAME'] => $_SERVER['PATH_TRANSLATED'] => $_SERVER['DOCUMENT_ROOT'] => $_SERVER['REQUEST_TIME_FLOAT'] => 1489745695.274 $_SERVER['REQUEST_TIME'] => 1489745695 $_SERVER['argv'] => Array ( ) $_SERVER['argc'] => 0 $_ENV['VNCDESKTOP'] => vereo.pl:1 (zyrmar1) $_ENV['HOSTNAME'] => vereo.pl $_ENV['TEST_PHP_SRCDIR'] => /home/zyrmar1/deleme/php-7.1.2 $_ENV['SHELL'] => /bin/bash $_ENV['TERM'] => xterm $_ENV['MAKEFLAGS'] => $_ENV['HISTSIZE'] => 1000 $_ENV['SSH_CLIENT'] => deleted $_ENV['TEST_PHPDBG_EXECUTABLE'] => /home/zyrmar1/deleme/php-7.1.2/sapi/phpdbg/phpdbg $_ENV['WINDOWID'] => 6291490 $_ENV['SSH_TTY'] => deleted $_ENV['XTERM_SHELL'] => /bin/bash $_ENV['USER'] => zyrmar1 $_ENV['SVN_EDITOR'] => vnc $_ENV['LS_COLORS'] => rs=0:di=01;34:ln=01;36:mh=00:pi=40;33:so=01;35:do=01;35:bd=40;33;01:cd=40;33;01:or=40;31;01:mi=01;05;37;41:su=37;41:sg=30;43:ca=30;41:tw=30;42:ow=34;42:st=37;44:ex=01;32:*.tar=01;31:*...tgz=01;31:*.arj=01;31:*.taz=01;31:*.lzh=01;31:*.lzma=01;31:*.tlz=01;31:*.txz=01;31:*.zip=01;31:*.z=01;31:*.Z=01;31:*.dz=01;31:*.gz=01;31:*.lz=01;31:*.xz=01;31:*.bz2=01;31:*.tbz=01;31:*.tbz2=01;31:*.bz=01;31:*.tz=01;31:*.deb=01;31:*.rpm=01;31:*.jar=01;31:*.war=01;31:*.ear=01;31:*.sar=01;31:*.rar=01;31:*.ace=01;31:*.zoo=01;31:*.cpio=01;31:*.7z=01;31:*.rz=01;31:*.jpg=01;35:*...jpeg=01;35:*.gif=01;35:*.bmp=01;35:*.pbm=01;35:*.pgm=01;35:*.ppm=01;35:*.tga=01;35:*.xbm=01;35:*.xpm=01;35:*.tif=01;35:*.tiff=01;35:*.png=01;35:*.svg=01;35:*.svgz=01;35:*.mng=01;35:*.pcx=01;35:*.mov=01;35:*.mpg=01;35:*.mpeg=01;35:*.m2v=01;35:*.mkv=01;35:*.ogm=01;35:*.mp4=01;35:*.m4v=01;35:*.mp4v=01;35:*.vob=01;35:*.qt=01;35:*.nuv=01;35:*.wmv=01;35:*.asf=01;35:*.rm=01;35:*.rmvb=01;35:*.flc=01;35:*.avi=01;35:*.fli=01;35:*.flv=01;35:*.gl=01;35:*.dl=01;35:*.xcf=01;35:*.xwd=01;35:*.yuv=01;35:*.cgm=01;35:*.emf=01;35:*.axv=01;35:*.anx=01;35:*.ogv=01;35:*.ogx=01;35:*...aac=01;36:*.au=01;36:*.flac=01;36:*.mid=01;36:*.midi=01;36:*.mka=01;36:*.mp3=01;36:*.mpc=01;36:*.ogg=01;36:*.ra=01;36:*.wav=01;36:*.axa=01;36:*.oga=01;36:*.spx=01;36:*.xspf=01;36: $_ENV['SSH_AUTH_SOCK'] => deleted $_ENV['MAKELEVEL'] => 1 $_ENV['MFLAGS'] => $_ENV['PATH'] => /usr/local/bin:/bin:/usr/bin:/usr/local/sbin:/usr/sbin:/sbin:/home/zyrmar1/bin:/home/zyrmar1/bin $_ENV['MAIL'] => /var/spool/mail/zyrmar1 $_ENV['_'] => /home/zyrmar1/deleme/php-7.1.2/sapi/cli/php $_ENV['PWD'] => /home/zyrmar1/deleme/php-7.1.2 $_ENV['LANG'] => en_US.UTF-8 $_ENV['TEST_PHP_EXECUTABLE'] => /home/zyrmar1/deleme/php-7.1.2/sapi/cli/php $_ENV['HISTCONTROL'] => ignoredups $_ENV['XTERM_VERSION'] => X.Org 6.8.99.903(261) $_ENV['XTERM_LOCALE'] => en_US.UTF-8 $_ENV['HOME'] => /home/zyrmar1 $_ENV['SHLVL'] => 6 $_ENV['LOGNAME'] => zyrmar1 $_ENV['SSH_CONNECTION'] => deleted $_ENV['LESSOPEN'] => ||/usr/bin/lesspipe.sh %s $_ENV['DISPLAY'] => :1.0 $_ENV['CC'] => cc $_ENV['G_BROKEN_FILENAMES'] => 1 PHP License This program is free software; you can redistribute it and/or modify it under the terms of the PHP License as published by the PHP Group and included in the distribution in the file: LICENSE This program is distributed in the hope that it will be useful, but WITHOUT ANY WARRANTY; without even the implied warranty of MERCHANTABILITY or FITNESS FOR A PARTICULAR PURPOSE. If you did not receive a copy of the PHP license, or have any questions about PHP licensing, please contact license@php.net.