php report

From: Date: Thu, 09 Nov 2017 01:55:19 +0000
Subject: php report
Groups: php.qa.reports 
Request: Send a blank email to php-qa-reports+get-33978@lists.php.net to get a copy of this message


===================================================================== EXPECTED FAILED TEST SUMMARY --------------------------------------------------------------------- Test open_basedir configuration [tests/security/open_basedir_linkinfo.phpt] XFAIL REASON: BUG: open_basedir cannot delete symlink to prohibited file. See also bugs 48111 and 52176. Inconsistencies when accessing protected members [Zend/tests/access_modifiers_008.phpt] XFAIL REASON: Discussion: http://marc.info/?l=php-internals&m=120221184420957&w=2 Inconsistencies when accessing protected members - 2 [Zend/tests/access_modifiers_009.phpt] XFAIL REASON: Discussion: http://marc.info/?l=php-internals&m=120221184420957&w=2 Bug #48770 (call_user_func_array() fails to call parent from inheriting class) [Zend/tests/bug48770.phpt] XFAIL REASON: See Bug #48770 Bug #48770 (call_user_func_array() fails to call parent from inheriting class) [Zend/tests/bug48770_2.phpt] XFAIL REASON: See Bug #48770 Bug #48770 (call_user_func_array() fails to call parent from inheriting class) [Zend/tests/bug48770_3.phpt] XFAIL REASON: See Bug #48770 bug #71428.1: inheritance with null default values [Zend/tests/bug71428.1.phpt] XFAIL REASON: This is a BC break bug #71428: Validation type inheritance with = NULL [Zend/tests/bug71428.3.phpt] XFAIL REASON: This is a BC break Initial value of static var in method depends on the include time of the class definition [Zend/tests/method_static_var.phpt] XFAIL REASON: Maybe not a bug Bug #70228 (memleak if return in finally block) [Zend/tests/try/bug70228.phpt] XFAIL REASON: See https://bugs.php.net/bug.php?id=70228 DateTime::add() -- fall type2 type3 [ext/date/tests/DateTime_add-fall-type2-type3.phpt] XFAIL REASON: Various bugs exist DateTime::add() -- fall type3 type2 [ext/date/tests/DateTime_add-fall-type3-type2.phpt] XFAIL REASON: Various bugs exist DateTime::add() -- fall type3 type3 [ext/date/tests/DateTime_add-fall-type3-type3.phpt] XFAIL REASON: Various bugs exist DateTime::add() -- spring type2 type3 [ext/date/tests/DateTime_add-spring-type2-type3.phpt] XFAIL REASON: Various bugs exist DateTime::add() -- spring type3 type2 [ext/date/tests/DateTime_add-spring-type3-type2.phpt] XFAIL REASON: Various bugs exist DateTime::add() -- spring type3 type3 [ext/date/tests/DateTime_add-spring-type3-type3.phpt] XFAIL REASON: Various bugs exist DateTime::diff() -- fall type2 type3 [ext/date/tests/DateTime_diff-fall-type2-type3.phpt] XFAIL REASON: Various bugs exist DateTime::diff() -- fall type3 type2 [ext/date/tests/DateTime_diff-fall-type3-type2.phpt] XFAIL REASON: Various bugs exist DateTime::diff() -- fall type3 type3 [ext/date/tests/DateTime_diff-fall-type3-type3.phpt] XFAIL REASON: Various bugs exist DateTime::diff() -- spring type2 type3 [ext/date/tests/DateTime_diff-spring-type2-type3.phpt] XFAIL REASON: Various bugs exist DateTime::diff() -- spring type3 type2 [ext/date/tests/DateTime_diff-spring-type3-type2.phpt] XFAIL REASON: Various bugs exist DateTime::diff() -- spring type3 type3 [ext/date/tests/DateTime_diff-spring-type3-type3.phpt] XFAIL REASON: Various bugs exist DateTime::sub() -- fall type2 type3 [ext/date/tests/DateTime_sub-fall-type2-type3.phpt] XFAIL REASON: Various bugs exist DateTime::sub() -- fall type3 type2 [ext/date/tests/DateTime_sub-fall-type3-type2.phpt] XFAIL REASON: Various bugs exist DateTime::sub() -- fall type3 type3 [ext/date/tests/DateTime_sub-fall-type3-type3.phpt] XFAIL REASON: Various bugs exist DateTime::sub() -- spring type2 type3 [ext/date/tests/DateTime_sub-spring-type2-type3.phpt] XFAIL REASON: Various bugs exist DateTime::sub() -- spring type3 type2 [ext/date/tests/DateTime_sub-spring-type3-type2.phpt] XFAIL REASON: Various bugs exist DateTime::sub() -- spring type3 type3 [ext/date/tests/DateTime_sub-spring-type3-type3.phpt] XFAIL REASON: Various bugs exist Bug #55407 (Impossible to prototype DateTime::createFromFormat) [ext/date/tests/bug55407.phpt] XFAIL REASON: Bug #55407 RFC: DateTime and Daylight Saving Time Transitions (zone type 3, bd2) [ext/date/tests/rfc-datetime_and_daylight_saving_time-type3-bd2.phpt] XFAIL REASON: Still not quite right RFC: DateTime and Daylight Saving Time Transitions (zone type 3, fs) [ext/date/tests/rfc-datetime_and_daylight_saving_time-type3-fs.phpt] XFAIL REASON: Still not quite right Bug #42718 (unsafe_raw filter not applied when configured as default filter) [ext/filter/tests/bug42718.phpt] XFAIL REASON: FILTER_UNSAFE_RAW not applied when configured as default filter, even with flags Bug #67296 (filter_input doesn't validate variables) [ext/filter/tests/bug49184.phpt] XFAIL REASON: See Bug #49184 Bug #67167: filter_var(null,FILTER_VALIDATE_BOOLEAN,FILTER_NULL_ON_FAILURE) returns null [ext/filter/tests/bug67167.02.phpt] XFAIL REASON: Requires php_zval_filter to not use convert_to_string for all filters. Phar: bug #69958: Segfault in Phar::convertToData on invalid file [ext/phar/tests/bug69958.phpt] XFAIL REASON: Still has memory leaks, see https://bugs.php.net/bug.php?id=70005 Bug #69111 Crash in SessionHandler::read() [ext/session/tests/bug69111.phpt] XFAIL REASON: It is still a leak Test basic function : variation3 use_trans_sid [ext/session/tests/session_basic3.phpt] XFAIL REASON: Waiting url_scanner_ex.re fix. https://bugs.php.net/bug.php?id=68970 Bug #70219 Use after free vulnerability in session deserializer [ext/standard/tests/serialize/bug70219.phpt] XFAIL REASON: Unfinished merge, needs fix. FPM: Test status page [sapi/fpm/tests/010.phpt] XFAIL REASON: randomly intermittently failing all the time in CI, with diff: 017+ active processes: 0 018+ total processes: 1 017- active processes: 1 018- total processes: 2 FPM: Test various messages on start, from master and childs [sapi/fpm/tests/015.phpt] XFAIL REASON: randomly intermittently failing all the time in CI, ERROR: unable to read what child say: Bad file descriptor (9) catch_workers_output = yes seems not reliable ===================================================================== ===================================================================== FAILED TEST SUMMARY --------------------------------------------------------------------- datefmt_format_code() [ext/intl/tests/dateformat_format_variant2.phpt] Bug #36732 (add support for req_extensions in openss_csr_new and sign) [ext/openssl/tests/bug36732.phpt] Bug #55646: textual input in openssl_csr_new() is not expected in UTF-8 [ext/openssl/tests/bug55646.phpt] Bug #72165 Null pointer dereference - openssl_csr_new [ext/openssl/tests/bug72165.phpt] Bug #64124 IPv6 malformed [ext/snmp/tests/bug64124.phpt] Bug #64159: Truncated snmpget [ext/snmp/tests/bug64159.phpt] IPv6 support [ext/snmp/tests/ipv6.phpt] OO API: getErrno & getError methods [ext/snmp/tests/snmp-object-errno-errstr.phpt] OO API [ext/snmp/tests/snmp-object.phpt] Function snmp2_get [ext/snmp/tests/snmp2_get.phpt] Function snmp2_getnext [ext/snmp/tests/snmp2_getnext.phpt] Function snmp2_real_walk [ext/snmp/tests/snmp2_real_walk.phpt] Function snmp2_set (without MIBs loading) [ext/snmp/tests/snmp2_set-nomib.phpt] Function snmp2_set [ext/snmp/tests/snmp2_set.phpt] Function snmp2_walk [ext/snmp/tests/snmp2_walk.phpt] SNMPv3 Support (errors) [ext/snmp/tests/snmp3-error.phpt] SNMPv3 Support [ext/snmp/tests/snmp3.phpt] Function snmp_getvalue [ext/snmp/tests/snmp_getvalue.phpt] Function snmpget [ext/snmp/tests/snmpget.phpt] Function snmpgetnext [ext/snmp/tests/snmpgetnext.phpt] Function snmprealwalk [ext/snmp/tests/snmprealwalk.phpt] Function snmpset (without MIBs loading) [ext/snmp/tests/snmpset-nomib.phpt] Function snmpset [ext/snmp/tests/snmpset.phpt] Function snmpwalk [ext/snmp/tests/snmpwalk.phpt] SOAP Bug #71610 - Type Confusion Vulnerability - SOAP / make_http_soap_request() [ext/soap/tests/bug71610.phpt] SOAP 1.2: T63 validateCountryCode [ext/soap/tests/soap12/T63.phpt] Test setlocale() function : usage variations - Setting all available locales in the platform [ext/standard/tests/strings/setlocale_variation2.phpt] FPM: Startup and connect [sapi/fpm/tests/002.phpt] FPM: Test Unix Domain Socket [sapi/fpm/tests/009.phpt] FPM: Test IPv4 all addresses (bug #68420) [sapi/fpm/tests/011.phpt] FPM: Test reload configuration (bug #68442) [sapi/fpm/tests/012.phpt] FPM: Test for log_level in fpm_unix_init_main #68381 [sapi/fpm/tests/013.phpt] FPM: Test for pm.start_servers default calculation message being a notice and not a warning #68458 [sapi/fpm/tests/014.phpt] FPM: Test fastcgi_finish_request function [sapi/fpm/tests/017.phpt] FPM: Test global prefix [sapi/fpm/tests/019.phpt] FPM: Test pool prefix [sapi/fpm/tests/020.phpt] FPM: HTTP_PROXY - CVE-2016-5385 [sapi/fpm/tests/022-cve-2016-5385.phpt] Bug #69487 (SAPI may truncate POST data) [sapi/tests/bug69487.phpt] ===================================================================== ===================================================================== WARNED TEST SUMMARY --------------------------------------------------------------------- Temporary leak on exception [Zend/tests/temporary_cleaning_001.phpt] (warn: XFAIL section but test passes) Fundamental memory leak test on temporaries [Zend/tests/temporary_cleaning_003.phpt] (warn: XFAIL section but test passes) Temporary leak with switch [Zend/tests/temporary_cleaning_004.phpt] (warn: XFAIL section but test passes) Temporary leak with foreach [Zend/tests/temporary_cleaning_005.phpt] (warn: XFAIL section but test passes) Exception after separation during indirect write to fcall result [Zend/tests/temporary_cleaning_006.phpt] (warn: XFAIL section but test passes) ===================================================================== ===================================================================== TEST RESULT SUMMARY --------------------------------------------------------------------- Exts skipped : 22 Exts tested : 53 --------------------------------------------------------------------- Number of tests : 15037 12503 Tests skipped : 2534 ( 16.9%) -------- Tests warned : 5 ( 0.0%) ( 0.0%) Tests failed : 38 ( 0.3%) ( 0.3%) Expected fail : 40 ( 0.3%) ( 0.3%) Tests passed : 12420 ( 82.6%) ( 99.3%) --------------------------------------------------------------------- Time taken : 2418 seconds ===================================================================== ===================================================================== EXPECTED FAILED TEST SUMMARY --------------------------------------------------------------------- Test open_basedir configuration [tests/security/open_basedir_linkinfo.phpt] XFAIL REASON: BUG: open_basedir cannot delete symlink to prohibited file. See also bugs 48111 and 52176. Inconsistencies when accessing protected members [Zend/tests/access_modifiers_008.phpt] XFAIL REASON: Discussion: http://marc.info/?l=php-internals&m=120221184420957&w=2 Inconsistencies when accessing protected members - 2 [Zend/tests/access_modifiers_009.phpt] XFAIL REASON: Discussion: http://marc.info/?l=php-internals&m=120221184420957&w=2 Bug #48770 (call_user_func_array() fails to call parent from inheriting class) [Zend/tests/bug48770.phpt] XFAIL REASON: See Bug #48770 Bug #48770 (call_user_func_array() fails to call parent from inheriting class) [Zend/tests/bug48770_2.phpt] XFAIL REASON: See Bug #48770 Bug #48770 (call_user_func_array() fails to call parent from inheriting class) [Zend/tests/bug48770_3.phpt] XFAIL REASON: See Bug #48770 bug #71428.1: inheritance with null default values [Zend/tests/bug71428.1.phpt] XFAIL REASON: This is a BC break bug #71428: Validation type inheritance with = NULL [Zend/tests/bug71428.3.phpt] XFAIL REASON: This is a BC break Initial value of static var in method depends on the include time of the class definition [Zend/tests/method_static_var.phpt] XFAIL REASON: Maybe not a bug Bug #70228 (memleak if return in finally block) [Zend/tests/try/bug70228.phpt] XFAIL REASON: See https://bugs.php.net/bug.php?id=70228 DateTime::add() -- fall type2 type3 [ext/date/tests/DateTime_add-fall-type2-type3.phpt] XFAIL REASON: Various bugs exist DateTime::add() -- fall type3 type2 [ext/date/tests/DateTime_add-fall-type3-type2.phpt] XFAIL REASON: Various bugs exist DateTime::add() -- fall type3 type3 [ext/date/tests/DateTime_add-fall-type3-type3.phpt] XFAIL REASON: Various bugs exist DateTime::add() -- spring type2 type3 [ext/date/tests/DateTime_add-spring-type2-type3.phpt] XFAIL REASON: Various bugs exist DateTime::add() -- spring type3 type2 [ext/date/tests/DateTime_add-spring-type3-type2.phpt] XFAIL REASON: Various bugs exist DateTime::add() -- spring type3 type3 [ext/date/tests/DateTime_add-spring-type3-type3.phpt] XFAIL REASON: Various bugs exist DateTime::diff() -- fall type2 type3 [ext/date/tests/DateTime_diff-fall-type2-type3.phpt] XFAIL REASON: Various bugs exist DateTime::diff() -- fall type3 type2 [ext/date/tests/DateTime_diff-fall-type3-type2.phpt] XFAIL REASON: Various bugs exist DateTime::diff() -- fall type3 type3 [ext/date/tests/DateTime_diff-fall-type3-type3.phpt] XFAIL REASON: Various bugs exist DateTime::diff() -- spring type2 type3 [ext/date/tests/DateTime_diff-spring-type2-type3.phpt] XFAIL REASON: Various bugs exist DateTime::diff() -- spring type3 type2 [ext/date/tests/DateTime_diff-spring-type3-type2.phpt] XFAIL REASON: Various bugs exist DateTime::diff() -- spring type3 type3 [ext/date/tests/DateTime_diff-spring-type3-type3.phpt] XFAIL REASON: Various bugs exist DateTime::sub() -- fall type2 type3 [ext/date/tests/DateTime_sub-fall-type2-type3.phpt] XFAIL REASON: Various bugs exist DateTime::sub() -- fall type3 type2 [ext/date/tests/DateTime_sub-fall-type3-type2.phpt] XFAIL REASON: Various bugs exist DateTime::sub() -- fall type3 type3 [ext/date/tests/DateTime_sub-fall-type3-type3.phpt] XFAIL REASON: Various bugs exist DateTime::sub() -- spring type2 type3 [ext/date/tests/DateTime_sub-spring-type2-type3.phpt] XFAIL REASON: Various bugs exist DateTime::sub() -- spring type3 type2 [ext/date/tests/DateTime_sub-spring-type3-type2.phpt] XFAIL REASON: Various bugs exist DateTime::sub() -- spring type3 type3 [ext/date/tests/DateTime_sub-spring-type3-type3.phpt] XFAIL REASON: Various bugs exist Bug #55407 (Impossible to prototype DateTime::createFromFormat) [ext/date/tests/bug55407.phpt] XFAIL REASON: Bug #55407 RFC: DateTime and Daylight Saving Time Transitions (zone type 3, bd2) [ext/date/tests/rfc-datetime_and_daylight_saving_time-type3-bd2.phpt] XFAIL REASON: Still not quite right RFC: DateTime and Daylight Saving Time Transitions (zone type 3, fs) [ext/date/tests/rfc-datetime_and_daylight_saving_time-type3-fs.phpt] XFAIL REASON: Still not quite right Bug #42718 (unsafe_raw filter not applied when configured as default filter) [ext/filter/tests/bug42718.phpt] XFAIL REASON: FILTER_UNSAFE_RAW not applied when configured as default filter, even with flags Bug #67296 (filter_input doesn't validate variables) [ext/filter/tests/bug49184.phpt] XFAIL REASON: See Bug #49184 Bug #67167: filter_var(null,FILTER_VALIDATE_BOOLEAN,FILTER_NULL_ON_FAILURE) returns null [ext/filter/tests/bug67167.02.phpt] XFAIL REASON: Requires php_zval_filter to not use convert_to_string for all filters. Phar: bug #69958: Segfault in Phar::convertToData on invalid file [ext/phar/tests/bug69958.phpt] XFAIL REASON: Still has memory leaks, see https://bugs.php.net/bug.php?id=70005 Bug #69111 Crash in SessionHandler::read() [ext/session/tests/bug69111.phpt] XFAIL REASON: It is still a leak Test basic function : variation3 use_trans_sid [ext/session/tests/session_basic3.phpt] XFAIL REASON: Waiting url_scanner_ex.re fix. https://bugs.php.net/bug.php?id=68970 Bug #70219 Use after free vulnerability in session deserializer [ext/standard/tests/serialize/bug70219.phpt] XFAIL REASON: Unfinished merge, needs fix. FPM: Test status page [sapi/fpm/tests/010.phpt] XFAIL REASON: randomly intermittently failing all the time in CI, with diff: 017+ active processes: 0 018+ total processes: 1 017- active processes: 1 018- total processes: 2 FPM: Test various messages on start, from master and childs [sapi/fpm/tests/015.phpt] XFAIL REASON: randomly intermittently failing all the time in CI, ERROR: unable to read what child say: Bad file descriptor (9) catch_workers_output = yes seems not reliable ===================================================================== ===================================================================== FAILED TEST SUMMARY --------------------------------------------------------------------- datefmt_format_code() [ext/intl/tests/dateformat_format_variant2.phpt] Bug #36732 (add support for req_extensions in openss_csr_new and sign) [ext/openssl/tests/bug36732.phpt] Bug #55646: textual input in openssl_csr_new() is not expected in UTF-8 [ext/openssl/tests/bug55646.phpt] Bug #72165 Null pointer dereference - openssl_csr_new [ext/openssl/tests/bug72165.phpt] Bug #64124 IPv6 malformed [ext/snmp/tests/bug64124.phpt] Bug #64159: Truncated snmpget [ext/snmp/tests/bug64159.phpt] IPv6 support [ext/snmp/tests/ipv6.phpt] OO API: getErrno & getError methods [ext/snmp/tests/snmp-object-errno-errstr.phpt] OO API [ext/snmp/tests/snmp-object.phpt] Function snmp2_get [ext/snmp/tests/snmp2_get.phpt] Function snmp2_getnext [ext/snmp/tests/snmp2_getnext.phpt] Function snmp2_real_walk [ext/snmp/tests/snmp2_real_walk.phpt] Function snmp2_set (without MIBs loading) [ext/snmp/tests/snmp2_set-nomib.phpt] Function snmp2_set [ext/snmp/tests/snmp2_set.phpt] Function snmp2_walk [ext/snmp/tests/snmp2_walk.phpt] SNMPv3 Support (errors) [ext/snmp/tests/snmp3-error.phpt] SNMPv3 Support [ext/snmp/tests/snmp3.phpt] Function snmp_getvalue [ext/snmp/tests/snmp_getvalue.phpt] Function snmpget [ext/snmp/tests/snmpget.phpt] Function snmpgetnext [ext/snmp/tests/snmpgetnext.phpt] Function snmprealwalk [ext/snmp/tests/snmprealwalk.phpt] Function snmpset (without MIBs loading) [ext/snmp/tests/snmpset-nomib.phpt] Function snmpset [ext/snmp/tests/snmpset.phpt] Function snmpwalk [ext/snmp/tests/snmpwalk.phpt] SOAP Bug #71610 - Type Confusion Vulnerability - SOAP / make_http_soap_request() [ext/soap/tests/bug71610.phpt] SOAP 1.2: T63 validateCountryCode [ext/soap/tests/soap12/T63.phpt] Test setlocale() function : usage variations - Setting all available locales in the platform [ext/standard/tests/strings/setlocale_variation2.phpt] FPM: Startup and connect [sapi/fpm/tests/002.phpt] FPM: Test Unix Domain Socket [sapi/fpm/tests/009.phpt] FPM: Test IPv4 all addresses (bug #68420) [sapi/fpm/tests/011.phpt] FPM: Test reload configuration (bug #68442) [sapi/fpm/tests/012.phpt] FPM: Test for log_level in fpm_unix_init_main #68381 [sapi/fpm/tests/013.phpt] FPM: Test for pm.start_servers default calculation message being a notice and not a warning #68458 [sapi/fpm/tests/014.phpt] FPM: Test fastcgi_finish_request function [sapi/fpm/tests/017.phpt] FPM: Test global prefix [sapi/fpm/tests/019.phpt] FPM: Test pool prefix [sapi/fpm/tests/020.phpt] FPM: HTTP_PROXY - CVE-2016-5385 [sapi/fpm/tests/022-cve-2016-5385.phpt] Bug #69487 (SAPI may truncate POST data) [sapi/tests/bug69487.phpt] ===================================================================== ===================================================================== WARNED TEST SUMMARY --------------------------------------------------------------------- Temporary leak on exception [Zend/tests/temporary_cleaning_001.phpt] (warn: XFAIL section but test passes) Fundamental memory leak test on temporaries [Zend/tests/temporary_cleaning_003.phpt] (warn: XFAIL section but test passes) Temporary leak with switch [Zend/tests/temporary_cleaning_004.phpt] (warn: XFAIL section but test passes) Temporary leak with foreach [Zend/tests/temporary_cleaning_005.phpt] (warn: XFAIL section but test passes) Exception after separation during indirect write to fcall result [Zend/tests/temporary_cleaning_006.phpt] (warn: XFAIL section but test passes) ===================================================================== ================================================================================ /root/apps5/php-7.0.25/ext/intl/tests/dateformat_format_variant2.phpt ================================================================================ ------------ Input timestamp is : 0 ------------ IntlDateFormatter locale= en_US ,datetype = 0 ,timetype =0 Formatted timestamp is : Wednesday, December 31, 1969 at 2:00:00 PM GMT-10:00 IntlDateFormatter locale= en_US ,datetype = 1 ,timetype =1 Formatted timestamp is : December 31, 1969 at 2:00:00 PM GMT-10 IntlDateFormatter locale= en_US ,datetype = 2 ,timetype =2 Formatted timestamp is : Dec 31, 1969, 2:00:00 PM IntlDateFormatter locale= en_US ,datetype = 3 ,timetype =3 Formatted timestamp is : 12/31/69, 2:00 PM IntlDateFormatter locale= en_US ,datetype = -1 ,timetype =-1 Formatted timestamp is : 19691231 02:00 PM ------------ Input timestamp is : -1200000 ------------ IntlDateFormatter locale= en_US ,datetype = 0 ,timetype =0 Formatted timestamp is : Wednesday, December 17, 1969 at 4:40:00 PM GMT-10:00 IntlDateFormatter locale= en_US ,datetype = 1 ,timetype =1 Formatted timestamp is : December 17, 1969 at 4:40:00 PM GMT-10 IntlDateFormatter locale= en_US ,datetype = 2 ,timetype =2 Formatted timestamp is : Dec 17, 1969, 4:40:00 PM IntlDateFormatter locale= en_US ,datetype = 3 ,timetype =3 Formatted timestamp is : 12/17/69, 4:40 PM IntlDateFormatter locale= en_US ,datetype = -1 ,timetype =-1 Formatted timestamp is : 19691217 04:40 PM ------------ Input timestamp is : 1200000 ------------ IntlDateFormatter locale= en_US ,datetype = 0 ,timetype =0 Formatted timestamp is : Wednesday, January 14, 1970 at 11:20:00 AM GMT-10:00 IntlDateFormatter locale= en_US ,datetype = 1 ,timetype =1 Formatted timestamp is : January 14, 1970 at 11:20:00 AM GMT-10 IntlDateFormatter locale= en_US ,datetype = 2 ,timetype =2 Formatted timestamp is : Jan 14, 1970, 11:20:00 AM IntlDateFormatter locale= en_US ,datetype = 3 ,timetype =3 Formatted timestamp is : 1/14/70, 11:20 AM IntlDateFormatter locale= en_US ,datetype = -1 ,timetype =-1 Formatted timestamp is : 19700114 11:20 AM ------------ Input timestamp is : 2200000000 ------------ IntlDateFormatter locale= en_US ,datetype = 0 ,timetype =0 Formatted timestamp is : Sunday, September 18, 2039 at 1:06:40 PM GMT-10:00 IntlDateFormatter locale= en_US ,datetype = 1 ,timetype =1 Formatted timestamp is : September 18, 2039 at 1:06:40 PM GMT-10 IntlDateFormatter locale= en_US ,datetype = 2 ,timetype =2 Formatted timestamp is : Sep 18, 2039, 1:06:40 PM IntlDateFormatter locale= en_US ,datetype = 3 ,timetype =3 Formatted timestamp is : 9/18/39, 1:06 PM IntlDateFormatter locale= en_US ,datetype = -1 ,timetype =-1 Formatted timestamp is : 20390918 01:06 PM ------------ Input timestamp is : -2200000000 ------------ IntlDateFormatter locale= en_US ,datetype = 0 ,timetype =0 Formatted timestamp is : Saturday, April 14, 1900 at 2:53:20 PM GMT-10:00 IntlDateFormatter locale= en_US ,datetype = 1 ,timetype =1 Formatted timestamp is : April 14, 1900 at 2:53:20 PM GMT-10 IntlDateFormatter locale= en_US ,datetype = 2 ,timetype =2 Formatted timestamp is : Apr 14, 1900, 2:53:20 PM IntlDateFormatter locale= en_US ,datetype = 3 ,timetype =3 Formatted timestamp is : 4/14/00, 2:53 PM IntlDateFormatter locale= en_US ,datetype = -1 ,timetype =-1 Formatted timestamp is : 19000414 02:53 PM ------------ Input timestamp is : 90099999 ------------ IntlDateFormatter locale= en_US ,datetype = 0 ,timetype =0 Formatted timestamp is : Wednesday, November 8, 1972 at 9:46:39 AM GMT-10:00 IntlDateFormatter locale= en_US ,datetype = 1 ,timetype =1 Formatted timestamp is : November 8, 1972 at 9:46:39 AM GMT-10 IntlDateFormatter locale= en_US ,datetype = 2 ,timetype =2 Formatted timestamp is : Nov 8, 1972, 9:46:39 AM IntlDateFormatter locale= en_US ,datetype = 3 ,timetype =3 Formatted timestamp is : 11/8/72, 9:46 AM IntlDateFormatter locale= en_US ,datetype = -1 ,timetype =-1 Formatted timestamp is : 19721108 09:46 AM ------------ Input timestamp is : 3600 ------------ IntlDateFormatter locale= en_US ,datetype = 0 ,timetype =0 Formatted timestamp is : Wednesday, December 31, 1969 at 3:00:00 PM GMT-10:00 IntlDateFormatter locale= en_US ,datetype = 1 ,timetype =1 Formatted timestamp is : December 31, 1969 at 3:00:00 PM GMT-10 IntlDateFormatter locale= en_US ,datetype = 2 ,timetype =2 Formatted timestamp is : Dec 31, 1969, 3:00:00 PM IntlDateFormatter locale= en_US ,datetype = 3 ,timetype =3 Formatted timestamp is : 12/31/69, 3:00 PM IntlDateFormatter locale= en_US ,datetype = -1 ,timetype =-1 Formatted timestamp is : 19691231 03:00 PM ------------ Input timestamp is : -3600 ------------ IntlDateFormatter locale= en_US ,datetype = 0 ,timetype =0 Formatted timestamp is : Wednesday, December 31, 1969 at 1:00:00 PM GMT-10:00 IntlDateFormatter locale= en_US ,datetype = 1 ,timetype =1 Formatted timestamp is : December 31, 1969 at 1:00:00 PM GMT-10 IntlDateFormatter locale= en_US ,datetype = 2 ,timetype =2 Formatted timestamp is : Dec 31, 1969, 1:00:00 PM IntlDateFormatter locale= en_US ,datetype = 3 ,timetype =3 Formatted timestamp is : 12/31/69, 1:00 PM IntlDateFormatter locale= en_US ,datetype = -1 ,timetype =-1 Formatted timestamp is : 19691231 01:00 PM ------------ Input localtime is : tm_sec : '24' , tm_min : '3' , tm_hour : '19' , tm_mday : '3' , tm_mon : '3' , tm_year : '105' , ------------ IntlDateFormatter locale= en_US ,datetype = 0 ,timetype =0 Formatted localtime_array is : Sunday, April 3, 2005 at 7:03:24 PM GMT-10:00 IntlDateFormatter locale= en_US ,datetype = 1 ,timetype =1 Formatted localtime_array is : April 3, 2005 at 7:03:24 PM GMT-10 IntlDateFormatter locale= en_US ,datetype = 2 ,timetype =2 Formatted localtime_array is : Apr 3, 2005, 7:03:24 PM IntlDateFormatter locale= en_US ,datetype = 3 ,timetype =3 Formatted localtime_array is : 4/3/05, 7:03 PM IntlDateFormatter locale= en_US ,datetype = -1 ,timetype =-1 Formatted localtime_array is : 20050403 07:03 PM ------------ Input localtime is : tm_sec : '21' , tm_min : '5' , tm_hour : '7' , tm_mday : '13' , tm_mon : '4' , tm_year : '205' , ------------ IntlDateFormatter locale= en_US ,datetype = 0 ,timetype =0 Formatted localtime_array is : Wednesday, May 13, 2105 at 7:05:21 AM GMT-10:00 IntlDateFormatter locale= en_US ,datetype = 1 ,timetype =1 Formatted localtime_array is : May 13, 2105 at 7:05:21 AM GMT-10 IntlDateFormatter locale= en_US ,datetype = 2 ,timetype =2 Formatted localtime_array is : May 13, 2105, 7:05:21 AM IntlDateFormatter locale= en_US ,datetype = 3 ,timetype =3 Formatted localtime_array is : 5/13/05, 7:05 AM IntlDateFormatter locale= en_US ,datetype = -1 ,timetype =-1 Formatted localtime_array is : 21050513 07:05 AM ------------ Input localtime is : tm_sec : '11' , tm_min : '13' , tm_hour : '0' , tm_mday : '17' , tm_mon : '11' , tm_year : '-5' , ------------ IntlDateFormatter locale= en_US ,datetype = 0 ,timetype =0 Formatted localtime_array is : Tuesday, December 17, 1895 at 12:13:11 AM GMT-10:00 IntlDateFormatter locale= en_US ,datetype = 1 ,timetype =1 Formatted localtime_array is : December 17, 1895 at 12:13:11 AM GMT-10 IntlDateFormatter locale= en_US ,datetype = 2 ,timetype =2 Formatted localtime_array is : Dec 17, 1895, 12:13:11 AM IntlDateFormatter locale= en_US ,datetype = 3 ,timetype =3 Formatted localtime_array is : 12/17/95, 12:13 AM IntlDateFormatter locale= en_US ,datetype = -1 ,timetype =-1 Formatted localtime_array is : 18951217 12:13 AM ------------ Date is: DateTime::__set_state(array( 'date' => '2010-01-01 01:02:03.000000', 'timezone_type' => 3, 'timezone' => 'UTC', )) ------------ Formatted DateTime is : Thursday, December 31, 2009 at 3:02:03 PM GMT-10:00 ------------ Date is: DateTime::__set_state(array( 'date' => '2010-01-01 01:02:03.000000', 'timezone_type' => 3, 'timezone' => 'UTC', )) ------------ Formatted DateTime is : December 31, 2009 at 3:02:03 PM GMT-10 ------------ Date is: DateTime::__set_state(array( 'date' => '2010-01-01 01:02:03.000000', 'timezone_type' => 3, 'timezone' => 'UTC', )) ------------ Formatted DateTime is : Dec 31, 2009, 3:02:03 PM ------------ Date is: DateTime::__set_state(array( 'date' => '2010-01-01 01:02:03.000000', 'timezone_type' => 3, 'timezone' => 'UTC', )) ------------ Formatted DateTime is : 12/31/09, 3:02 PM ------------ Date is: DateTime::__set_state(array( 'date' => '2010-01-01 01:02:03.000000', 'timezone_type' => 3, 'timezone' => 'UTC', )) ------------ Formatted DateTime is : 20091231 03:02 PM ------------ Date is: DateTime::__set_state(array( 'date' => '2000-12-30 19:04:05.000000', 'timezone_type' => 2, 'timezone' => 'PDT', )) ------------ Formatted DateTime is : Saturday, December 30, 2000 at 5:04:05 PM GMT-10:00 ------------ Date is: DateTime::__set_state(array( 'date' => '2000-12-30 19:04:05.000000', 'timezone_type' => 2, 'timezone' => 'PDT', )) ------------ Formatted DateTime is : December 30, 2000 at 5:04:05 PM GMT-10 ------------ Date is: DateTime::__set_state(array( 'date' => '2000-12-30 19:04:05.000000', 'timezone_type' => 2, 'timezone' => 'PDT', )) ------------ Formatted DateTime is : Dec 30, 2000, 5:04:05 PM ------------ Date is: DateTime::__set_state(array( 'date' => '2000-12-30 19:04:05.000000', 'timezone_type' => 2, 'timezone' => 'PDT', )) ------------ Formatted DateTime is : 12/30/00, 5:04 PM ------------ Date is: DateTime::__set_state(array( 'date' => '2000-12-30 19:04:05.000000', 'timezone_type' => 2, 'timezone' => 'PDT', )) ------------ Formatted DateTime is : 20001230 05:04 PM ------------ Date is: stdClass::__set_state(array( )) ------------ Error while formatting as: 'datefmt_format: invalid object type for date/time (only IntlCalendar and DateTime permitted): U_ILLEGAL_ARGUMENT_ERROR' ------------ Date is: stdClass::__set_state(array( )) ------------ Error while formatting as: 'datefmt_format: invalid object type for date/time (only IntlCalendar and DateTime permitted): U_ILLEGAL_ARGUMENT_ERROR' ------------ Date is: stdClass::__set_state(array( )) ------------ Error while formatting as: 'datefmt_format: invalid object type for date/time (only IntlCalendar and DateTime permitted): U_ILLEGAL_ARGUMENT_ERROR' ------------ Date is: stdClass::__set_state(array( )) ------------ Error while formatting as: 'datefmt_format: invalid object type for date/time (only IntlCalendar and DateTime permitted): U_ILLEGAL_ARGUMENT_ERROR' ------------ Date is: stdClass::__set_state(array( )) ------------ Error while formatting as: 'datefmt_format: invalid object type for date/time (only IntlCalendar and DateTime permitted): U_ILLEGAL_ARGUMENT_ERROR' ================================================================================ 209+ 'timezone_type' => 2, 210+ 'timezone' => 'PDT', 209- 'timezone_type' => 3, 210- 'timezone' => 'America/Los_Angeles', 217+ 'timezone_type' => 2, 218+ 'timezone' => 'PDT', 217- 'timezone_type' => 3, 218- 'timezone' => 'America/Los_Angeles', 225+ 'timezone_type' => 2, 226+ 'timezone' => 'PDT', 225- 'timezone_type' => 3, 226- 'timezone' => 'America/Los_Angeles', 233+ 'timezone_type' => 2, 234+ 'timezone' => 'PDT', 233- 'timezone_type' => 3, 234- 'timezone' => 'America/Los_Angeles', 241+ 'timezone_type' => 2, 242+ 'timezone' => 'PDT', 241- 'timezone_type' => 3, 242- 'timezone' => 'America/Los_Angeles', ================================================================================ ================================================================================ /root/apps5/php-7.0.25/ext/openssl/tests/bug36732.phpt ================================================================================ Warning: openssl_pkey_new(): private key length is too short; it needs to be at least 384 bits, not 0 in /root/apps5/php-7.0.25/ext/openssl/tests/bug36732.php on line 16 Ok Ok ================================================================================ 001+ Warning: openssl_pkey_new(): private key length is too short; it needs to be at least 384 bits, not 0 in /root/apps5/php-7.0.25/ext/openssl/tests/bug36732.php on line 16 ================================================================================ ================================================================================ /root/apps5/php-7.0.25/ext/openssl/tests/bug55646.phpt ================================================================================ Warning: openssl_pkey_new(): Error loading extensions_section section v3_ca of /etc/ssl/openssl.cnf in /root/apps5/php-7.0.25/ext/openssl/tests/bug55646.php on line 12 A: IT 互 B: 49 54 20 e4 ba 92 C: IT 互 D: 49 54 20 e4 ba 92 ================================================================================ 001+ Warning: openssl_pkey_new(): Error loading extensions_section section v3_ca of /etc/ssl/openssl.cnf in /root/apps5/php-7.0.25/ext/openssl/tests/bug55646.php on line 12 ================================================================================ ================================================================================ /root/apps5/php-7.0.25/ext/openssl/tests/bug72165.phpt ================================================================================ Warning: openssl_csr_new(): private key length is too short; it needs to be at least 384 bits, not 0 in /root/apps5/php-7.0.25/ext/openssl/tests/bug72165.php on line 3 Warning: openssl_csr_new(): Unable to generate a private key in /root/apps5/php-7.0.25/ext/openssl/tests/bug72165.php on line 3 ==DONE== ================================================================================ 001+ Warning: openssl_csr_new(): private key length is too short; it needs to be at least 384 bits, not 0 in /root/apps5/php-7.0.25/ext/openssl/tests/bug72165.php on line 3 001- Warning: openssl_csr_new(): dn: numeric fild names are not supported in %sbug72165.php on line %d 003+ Warning: openssl_csr_new(): Unable to generate a private key in /root/apps5/php-7.0.25/ext/openssl/tests/bug72165.php on line 3 003- Warning: openssl_csr_new(): add1_attr_by_txt challengePassword_min -> 4 (failed; check error queue and value of string_mask OpenSSL option if illegal characters are reported) in %sbug72165.php on line %d ================================================================================ ================================================================================ /root/apps5/php-7.0.25/ext/snmp/tests/bug64124.phpt ================================================================================ Warning: snmpget(): Fatal error: Failure in sendto (Network is unreachable) in /root/apps5/php-7.0.25/ext/snmp/tests/bug64124.php on line 13 bool(false) bool(true) Warning: snmpget(): Fatal error: Failure in sendto (Network is unreachable) in /root/apps5/php-7.0.25/ext/snmp/tests/bug64124.php on line 15 bool(false) bool(true) Warning: snmpget(): Fatal error: Failure in sendto (Network is unreachable) in /root/apps5/php-7.0.25/ext/snmp/tests/bug64124.php on line 17 bool(false) bool(true) ================================================================================ 001+ Warning: snmpget(): Fatal error: Failure in sendto (Network is unreachable) in /root/apps5/php-7.0.25/ext/snmp/tests/bug64124.php on line 13 002+ bool(false) 001- %unicode|string%(%d) "%s" 003- %unicode|string%(%d) "%s" 004+ 005+ Warning: snmpget(): Fatal error: Failure in sendto (Network is unreachable) in /root/apps5/php-7.0.25/ext/snmp/tests/bug64124.php on line 15 006+ bool(false) 005- %unicode|string%(%d) "%s" 008+ 009+ Warning: snmpget(): Fatal error: Failure in sendto (Network is unreachable) in /root/apps5/php-7.0.25/ext/snmp/tests/bug64124.php on line 17 010+ bool(false) ================================================================================ ================================================================================ /root/apps5/php-7.0.25/ext/snmp/tests/bug64159.phpt ================================================================================ MIB search path: $HOME/.snmp/mibs:/usr/share/snmp/mibs Cannot find module (noneXistent): At line 0 in (none) Warning: snmpget(): No response from 127.0.0.1 in /root/apps5/php-7.0.25/ext/snmp/tests/bug64159.php on line 7 bool(false) ================================================================================ 003+ 003- bool(true) 004+ Warning: snmpget(): No response from 127.0.0.1 in /root/apps5/php-7.0.25/ext/snmp/tests/bug64159.php on line 7 005+ bool(false) ================================================================================ ================================================================================ /root/apps5/php-7.0.25/ext/snmp/tests/ipv6.phpt ================================================================================ Warning: snmpget(): Fatal error: Failure in sendto (Network is unreachable) in /root/apps5/php-7.0.25/ext/snmp/tests/ipv6.php on line 8 bool(false) Warning: snmpget(): malformed IPv6 address, closing square bracket missing in /root/apps5/php-7.0.25/ext/snmp/tests/ipv6.php on line 9 bool(false) ================================================================================ 001+ Warning: snmpget(): Fatal error: Failure in sendto (Network is unreachable) in /root/apps5/php-7.0.25/ext/snmp/tests/ipv6.php on line 8 002+ bool(false) 001- %unicode|string%(%d) "%s" ================================================================================ ================================================================================ /root/apps5/php-7.0.25/ext/snmp/tests/snmp-object-errno-errstr.phpt ================================================================================ SNMP::ERRNO_NOERROR bool(false) bool(false) string(26) "No response from 127.0.0.1" SNMP::ERRNO_TIMEOUT bool(false) bool(true) string(26) "No response from 127.0.0.1" SNMP::ERRNO_ERROR_IN_REPLY bool(false) bool(false) string(26) "No response from 127.0.0.1" SNMP::ERRNO_GENERIC bool(false) bool(true) string(20) "Fatal error: Timeout" bool(false) SNMP::ERRNO_OID_PARSING_ERROR GET: Single wrong OID bool(false) bool(true) string(46) "Invalid object identifier: .1.3.6.1.2..1.1.1.0" GET: Miltiple OID, one wrong bool(false) bool(true) string(46) "Invalid object identifier: .1.3.6.1.2..1.1.1.0" WALK: Single wrong OID bool(false) bool(true) string(42) "Invalid object identifier: .1.3.6.1.2..1.1" SET: Wrong type bool(false) bool(true) string(129) "Could not add variable: OID='.iso.org.dod.internet.mgmt.mib-2.system.sysContact.0' type='q' value='blah': Bad variable type ("q")" SNMP::ERRNO_MULTIPLE_SET_QUERIES Warning: SNMP::get(): Fatal error: Timeout in /root/apps5/php-7.0.25/ext/snmp/tests/snmp-object-errno-errstr.php on line 74 Warning: SNMP::get(): Fatal error: Timeout in /root/apps5/php-7.0.25/ext/snmp/tests/snmp-object-errno-errstr.php on line 76 bool(false) bool(false) string(20) "Fatal error: Timeout" Warning: SNMP::get(): Fatal error: Timeout in /root/apps5/php-7.0.25/ext/snmp/tests/snmp-object-errno-errstr.php on line 82 bool(false) Warning: SNMP::get(): Fatal error: Timeout in /root/apps5/php-7.0.25/ext/snmp/tests/snmp-object-errno-errstr.php on line 83 bool(false) bool(false) bool(false) string(20) "Fatal error: Timeout" Warning: SNMP::get(): Fatal error: Timeout in /root/apps5/php-7.0.25/ext/snmp/tests/snmp-object-errno-errstr.php on line 88 bool(true) Warning: SNMP::get(): Fatal error: Timeout in /root/apps5/php-7.0.25/ext/snmp/tests/snmp-object-errno-errstr.php on line 89 bool(true) bool(true) ================================================================================ 002+ bool(false) 003+ bool(false) 003- bool(true) 004- %string|unicode%(0) "" 011+ bool(false) 012+ string(26) "No response from 127.0.0.1" 011- bool(true) 012- %string|unicode%(%d) "Error in packet %s" 016+ string(20) "Fatal error: Timeout" 016- %string|unicode%(%d) "Fatal error: Unknown user name" 036+ 037+ Warning: SNMP::get(): Fatal error: Timeout in /root/apps5/php-7.0.25/ext/snmp/tests/snmp-object-errno-errstr.php on line 74 038+ 039+ Warning: SNMP::get(): Fatal error: Timeout in /root/apps5/php-7.0.25/ext/snmp/tests/snmp-object-errno-errstr.php on line 76 040+ bool(false) 041+ bool(false) 042+ string(20) "Fatal error: Timeout" 043+ 044+ Warning: SNMP::get(): Fatal error: Timeout in /root/apps5/php-7.0.25/ext/snmp/tests/snmp-object-errno-errstr.php on line 82 045+ bool(false) 046+ 047+ Warning: SNMP::get(): Fatal error: Timeout in /root/apps5/php-7.0.25/ext/snmp/tests/snmp-object-errno-errstr.php on line 83 048+ bool(false) 049+ bool(false) 050+ bool(false) 051+ string(20) "Fatal error: Timeout" 052+ 053+ Warning: SNMP::get(): Fatal error: Timeout in /root/apps5/php-7.0.25/ext/snmp/tests/snmp-object-errno-errstr.php on line 88 036- bool(true) 037- bool(true) 038- string(74) "Can not fit all OIDs for SET query into one packet, using multiple queries" 039- bool(true) 040- bool(true) 041- bool(true) 042- bool(true) 043- string(74) "Can not fit all OIDs for SET query into one packet, using multiple queries" 055+ 056+ Warning: SNMP::get(): Fatal error: Timeout in /root/apps5/php-7.0.25/ext/snmp/tests/snmp-object-errno-errstr.php on line 89 ================================================================================ ================================================================================ /root/apps5/php-7.0.25/ext/snmp/tests/snmp-object.phpt ================================================================================ SNMPv1 Warning: SNMP::get(): No response from 127.0.0.1 in /root/apps5/php-7.0.25/ext/snmp/tests/snmp-object.php on line 13 bool(false) Warning: SNMP::get(): No response from 127.0.0.1 in /root/apps5/php-7.0.25/ext/snmp/tests/snmp-object.php on line 14 bool(false) Warning: SNMP::getnext(): No response from 127.0.0.1 in /root/apps5/php-7.0.25/ext/snmp/tests/snmp-object.php on line 15 bool(false) bool(true) SNMPv2 Warning: SNMP::get(): No response from 127.0.0.1 in /root/apps5/php-7.0.25/ext/snmp/tests/snmp-object.php on line 20 bool(false) Warning: SNMP::getnext(): No response from 127.0.0.1 in /root/apps5/php-7.0.25/ext/snmp/tests/snmp-object.php on line 21 bool(false) bool(true) GET with preserving original OID names Warning: SNMP::get(): No response from 127.0.0.1 in /root/apps5/php-7.0.25/ext/snmp/tests/snmp-object.php on line 27 NULL NULL bool(true) WALK multiple on single OID Warning: SNMP::walk(): No response from 127.0.0.1 in /root/apps5/php-7.0.25/ext/snmp/tests/snmp-object.php on line 35 string(7) "boolean" int(1) Warning: key() expects parameter 1 to be array, boolean given in /root/apps5/php-7.0.25/ext/snmp/tests/snmp-object.php on line 38 NULL Warning: array_shift() expects parameter 1 to be array, boolean given in /root/apps5/php-7.0.25/ext/snmp/tests/snmp-object.php on line 39 NULL bool(true) WALK multiple on single OID, max_repetitions set to 30 Warning: SNMP::walk(): No response from 127.0.0.1 in /root/apps5/php-7.0.25/ext/snmp/tests/snmp-object.php on line 44 string(7) "boolean" int(1) Warning: key() expects parameter 1 to be array, boolean given in /root/apps5/php-7.0.25/ext/snmp/tests/snmp-object.php on line 47 NULL Warning: array_shift() expects parameter 1 to be array, boolean given in /root/apps5/php-7.0.25/ext/snmp/tests/snmp-object.php on line 48 NULL bool(true) WALK multiple on single OID, max_repetitions set to 30, non_repeaters set to 0 Warning: SNMP::walk(): No response from 127.0.0.1 in /root/apps5/php-7.0.25/ext/snmp/tests/snmp-object.php on line 53 string(7) "boolean" int(1) Warning: key() expects parameter 1 to be array, boolean given in /root/apps5/php-7.0.25/ext/snmp/tests/snmp-object.php on line 56 NULL Warning: array_shift() expects parameter 1 to be array, boolean given in /root/apps5/php-7.0.25/ext/snmp/tests/snmp-object.php on line 57 NULL bool(true) WALK multiple on single OID, max_oids set to 30 Warning: SNMP::walk(): No response from 127.0.0.1 in /root/apps5/php-7.0.25/ext/snmp/tests/snmp-object.php on line 63 string(7) "boolean" int(1) Warning: key() expects parameter 1 to be array, boolean given in /root/apps5/php-7.0.25/ext/snmp/tests/snmp-object.php on line 66 NULL Warning: array_shift() expects parameter 1 to be array, boolean given in /root/apps5/php-7.0.25/ext/snmp/tests/snmp-object.php on line 67 NULL bool(true) WALK multiple on single OID with OID suffix as keys Warning: SNMP::walk(): No response from 127.0.0.1 in /root/apps5/php-7.0.25/ext/snmp/tests/snmp-object.php on line 72 string(7) "boolean" int(1) Warning: key() expects parameter 1 to be array, boolean given in /root/apps5/php-7.0.25/ext/snmp/tests/snmp-object.php on line 75 NULL Warning: array_shift() expects parameter 1 to be array, boolean given in /root/apps5/php-7.0.25/ext/snmp/tests/snmp-object.php on line 76 NULL Warning: key() expects parameter 1 to be array, boolean given in /root/apps5/php-7.0.25/ext/snmp/tests/snmp-object.php on line 77 NULL Warning: array_shift() expects parameter 1 to be array, boolean given in /root/apps5/php-7.0.25/ext/snmp/tests/snmp-object.php on line 78 Warning: key() expects parameter 1 to be array, boolean given in /root/apps5/php-7.0.25/ext/snmp/tests/snmp-object.php on line 79 NULL Warning: array_shift() expects parameter 1 to be array, boolean given in /root/apps5/php-7.0.25/ext/snmp/tests/snmp-object.php on line 80 Warning: key() expects parameter 1 to be array, boolean given in /root/apps5/php-7.0.25/ext/snmp/tests/snmp-object.php on line 81 NULL Warning: array_shift() expects parameter 1 to be array, boolean given in /root/apps5/php-7.0.25/ext/snmp/tests/snmp-object.php on line 82 Warning: key() expects parameter 1 to be array, boolean given in /root/apps5/php-7.0.25/ext/snmp/tests/snmp-object.php on line 83 NULL bool(true) SNMPv3 (default security settings) Warning: SNMP::get(): Fatal error: Timeout in /root/apps5/php-7.0.25/ext/snmp/tests/snmp-object.php on line 89 bool(false) Warning: SNMP::getnext(): Fatal error: Timeout in /root/apps5/php-7.0.25/ext/snmp/tests/snmp-object.php on line 90 bool(false) bool(true) SNMPv3 (noAuthNoPriv) Warning: SNMP::get(): Fatal error: Timeout in /root/apps5/php-7.0.25/ext/snmp/tests/snmp-object.php on line 96 bool(false) Warning: SNMP::getnext(): Fatal error: Timeout in /root/apps5/php-7.0.25/ext/snmp/tests/snmp-object.php on line 97 bool(false) bool(true) SNMPv3 (authPriv) Warning: SNMP::get(): Fatal error: Timeout in /root/apps5/php-7.0.25/ext/snmp/tests/snmp-object.php on line 103 bool(false) Warning: SNMP::getnext(): Fatal error: Timeout in /root/apps5/php-7.0.25/ext/snmp/tests/snmp-object.php on line 104 bool(false) Warning: SNMP::walk(): Fatal error: Timeout in /root/apps5/php-7.0.25/ext/snmp/tests/snmp-object.php on line 105 bool(false) bool(true) SET single OID Warning: SNMP::get(): Fatal error: Timeout in /root/apps5/php-7.0.25/ext/snmp/tests/snmp-object.php on line 112 Warning: SNMP::set(): Fatal error: Timeout in /root/apps5/php-7.0.25/ext/snmp/tests/snmp-object.php on line 115 bool(false) Warning: SNMP::get(): Fatal error: Timeout in /root/apps5/php-7.0.25/ext/snmp/tests/snmp-object.php on line 117 bool(false) Warning: SNMP::set(): Fatal error: Timeout in /root/apps5/php-7.0.25/ext/snmp/tests/snmp-object.php on line 118 bool(false) Warning: SNMP::get(): Fatal error: Timeout in /root/apps5/php-7.0.25/ext/snmp/tests/snmp-object.php on line 120 bool(true) bool(true) Multiple OID with max_oids = 1 Warning: SNMP::get(): Fatal error: Timeout in /root/apps5/php-7.0.25/ext/snmp/tests/snmp-object.php on line 128 Warning: SNMP::set(): Can not fit all OIDs for SET query into one packet, using multiple queries in /root/apps5/php-7.0.25/ext/snmp/tests/snmp-object.php on line 130 Warning: SNMP::set(): Fatal error: Timeout in /root/apps5/php-7.0.25/ext/snmp/tests/snmp-object.php on line 130 bool(false) Warning: SNMP::get(): Fatal error: Timeout in /root/apps5/php-7.0.25/ext/snmp/tests/snmp-object.php on line 132 bool(false) Warning: SNMP::get(): Fatal error: Timeout in /root/apps5/php-7.0.25/ext/snmp/tests/snmp-object.php on line 133 bool(false) Warning: SNMP::set(): Can not fit all OIDs for SET query into one packet, using multiple queries in /root/apps5/php-7.0.25/ext/snmp/tests/snmp-object.php on line 134 Warning: SNMP::set(): Fatal error: Timeout in /root/apps5/php-7.0.25/ext/snmp/tests/snmp-object.php on line 134 bool(false) Warning: SNMP::get(): Fatal error: Timeout in /root/apps5/php-7.0.25/ext/snmp/tests/snmp-object.php on line 136 bool(true) Warning: SNMP::get(): Fatal error: Timeout in /root/apps5/php-7.0.25/ext/snmp/tests/snmp-object.php on line 137 bool(true) bool(true) SNMPv3, setting contextEngineID (authPriv) Warning: SNMP::get(): Fatal error: Timeout in /root/apps5/php-7.0.25/ext/snmp/tests/snmp-object.php on line 143 bool(false) bool(true) ================================================================================ 002+ 003+ Warning: SNMP::get(): No response from 127.0.0.1 in /root/apps5/php-7.0.25/ext/snmp/tests/snmp-object.php on line 13 004+ bool(false) 005+ 006+ Warning: SNMP::get(): No response from 127.0.0.1 in /root/apps5/php-7.0.25/ext/snmp/tests/snmp-object.php on line 14 007+ bool(false) 008+ 009+ Warning: SNMP::getnext(): No response from 127.0.0.1 in /root/apps5/php-7.0.25/ext/snmp/tests/snmp-object.php on line 15 010+ bool(false) 002- string(%d) "%S" 003- array(2) { 004- ["%s"]=> 005- string(%d) "%S" 006- ["%s"]=> 007- string(%d) "%S" 008- } 009- string(%d) "%S" 012- string(%d) "%S" 013- string(%d) "%S" 013+ 014+ Warning: SNMP::get(): No response from 127.0.0.1 in /root/apps5/php-7.0.25/ext/snmp/tests/snmp-object.php on line 20 015+ bool(false) 016+ 017+ Warning: SNMP::getnext(): No response from 127.0.0.1 in /root/apps5/php-7.0.25/ext/snmp/tests/snmp-object.php on line 21 018+ bool(false) 016- string(%d) "%s" 017- string(%d) "%s" 020- string(5) "array" 021+ 022+ Warning: SNMP::get(): No response from 127.0.0.1 in /root/apps5/php-7.0.25/ext/snmp/tests/snmp-object.php on line 27 023+ NULL 024+ NULL 022- string(%d) "%S" 023- string(%d) "%S" 026- string(5) "array" 027+ 028+ Warning: SNMP::walk(): No response from 127.0.0.1 in /root/apps5/php-7.0.25/ext/snmp/tests/snmp-object.php on line 35 029+ string(7) "boolean" 028- string(%d) "%S" 029- string(%d) "%S" 031+ 032+ Warning: key() expects parameter 1 to be array, boolean given in /root/apps5/php-7.0.25/ext/snmp/tests/snmp-object.php on line 38 033+ NULL 034+ 035+ Warning: array_shift() expects parameter 1 to be array, boolean given in /root/apps5/php-7.0.25/ext/snmp/tests/snmp-object.php on line 39 036+ NULL 032- string(5) "array" 034- string(%d) "%S" 035- string(%d) "%S" 038- string(5) "array" 039+ 040+ Warning: SNMP::walk(): No response from 127.0.0.1 in /root/apps5/php-7.0.25/ext/snmp/tests/snmp-object.php on line 44 041+ string(7) "boolean" 040- string(%d) "%S" 041- string(%d) "%S" 043+ 044+ Warning: key() expects parameter 1 to be array, boolean given in /root/apps5/php-7.0.25/ext/snmp/tests/snmp-object.php on line 47 045+ NULL 046+ 047+ Warning: array_shift() expects parameter 1 to be array, boolean given in /root/apps5/php-7.0.25/ext/snmp/tests/snmp-object.php on line 48 048+ NULL 044- string(5) "array" 046- string(3) "1.0" 047- string(%d) "%s" 048- string(3) "2.0" 049- string(3) "3.0" 050- string(3) "4.0" 051- string(3) "5.0" 052- bool(true) 053- SNMPv3 (default security settings) 054- string(%d) "%S" 055- string(%d) "%S" 056- bool(true) 057- SNMPv3 (noAuthNoPriv) 058- string(%d) "%S" 059- string(%d) "%S" 051+ 052+ Warning: SNMP::walk(): No response from 127.0.0.1 in /root/apps5/php-7.0.25/ext/snmp/tests/snmp-object.php on line 53 053+ string(7) "boolean" 055+ 056+ Warning: key() expects parameter 1 to be array, boolean given in /root/apps5/php-7.0.25/ext/snmp/tests/snmp-object.php on line 56 057+ NULL 058+ 059+ Warning: array_shift() expects parameter 1 to be array, boolean given in /root/apps5/php-7.0.25/ext/snmp/tests/snmp-object.php on line 57 060+ NULL 061- SNMPv3 (authPriv) 062- string(%d) "%S" 063- string(%d) "%S" 064- array(1) { 065- [%s]=> 066- string(%d) "%S" 067- } 063+ 064+ Warning: SNMP::walk(): No response from 127.0.0.1 in /root/apps5/php-7.0.25/ext/snmp/tests/snmp-object.php on line 63 065+ string(7) "boolean" 067+ 068+ Warning: key() expects parameter 1 to be array, boolean given in /root/apps5/php-7.0.25/ext/snmp/tests/snmp-object.php on line 66 069+ NULL 070+ 071+ Warning: array_shift() expects parameter 1 to be array, boolean given in /root/apps5/php-7.0.25/ext/snmp/tests/snmp-object.php on line 67 072+ NULL 069- SET single OID 071- bool(true) 072- bool(true) 075+ 076+ Warning: SNMP::walk(): No response from 127.0.0.1 in /root/apps5/php-7.0.25/ext/snmp/tests/snmp-object.php on line 72 077+ string(7) "boolean" 078- bool(true) 079- bool(true) 079+ 080+ Warning: key() expects parameter 1 to be array, boolean given in /root/apps5/php-7.0.25/ext/snmp/tests/snmp-object.php on line 75 081+ NULL 082+ 083+ Warning: array_shift() expects parameter 1 to be array, boolean given in /root/apps5/php-7.0.25/ext/snmp/tests/snmp-object.php on line 76 084+ NULL 085+ 086+ Warning: key() expects parameter 1 to be array, boolean given in /root/apps5/php-7.0.25/ext/snmp/tests/snmp-object.php on line 77 087+ NULL 088+ 089+ Warning: array_shift() expects parameter 1 to be array, boolean given in /root/apps5/php-7.0.25/ext/snmp/tests/snmp-object.php on line 78 090+ 091+ Warning: key() expects parameter 1 to be array, boolean given in /root/apps5/php-7.0.25/ext/snmp/tests/snmp-object.php on line 79 092+ NULL 093+ 094+ Warning: array_shift() expects parameter 1 to be array, boolean given in /root/apps5/php-7.0.25/ext/snmp/tests/snmp-object.php on line 80 095+ 096+ Warning: key() expects parameter 1 to be array, boolean given in /root/apps5/php-7.0.25/ext/snmp/tests/snmp-object.php on line 81 097+ NULL 098+ 099+ Warning: array_shift() expects parameter 1 to be array, boolean given in /root/apps5/php-7.0.25/ext/snmp/tests/snmp-object.php on line 82 100+ 101+ Warning: key() expects parameter 1 to be array, boolean given in /root/apps5/php-7.0.25/ext/snmp/tests/snmp-object.php on line 83 102+ NULL 082- Warning: SNMP::set(): Can not fit all OIDs for SET query into one packet, using multiple queries in %s on line %d 104+ SNMPv3 (default security settings) 105+ 106+ Warning: SNMP::get(): Fatal error: Timeout in /root/apps5/php-7.0.25/ext/snmp/tests/snmp-object.php on line 89 107+ bool(false) 108+ 109+ Warning: SNMP::getnext(): Fatal error: Timeout in /root/apps5/php-7.0.25/ext/snmp/tests/snmp-object.php on line 90 110+ bool(false) 111+ bool(true) 112+ SNMPv3 (noAuthNoPriv) 113+ 114+ Warning: SNMP::get(): Fatal error: Timeout in /root/apps5/php-7.0.25/ext/snmp/tests/snmp-object.php on line 96 115+ bool(false) 116+ 117+ Warning: SNMP::getnext(): Fatal error: Timeout in /root/apps5/php-7.0.25/ext/snmp/tests/snmp-object.php on line 97 118+ bool(false) 120+ SNMPv3 (authPriv) 121+ 122+ Warning: SNMP::get(): Fatal error: Timeout in /root/apps5/php-7.0.25/ext/snmp/tests/snmp-object.php on line 103 123+ bool(false) 124+ 125+ Warning: SNMP::getnext(): Fatal error: Timeout in /root/apps5/php-7.0.25/ext/snmp/tests/snmp-object.php on line 104 126+ bool(false) 127+ 128+ Warning: SNMP::walk(): Fatal error: Timeout in /root/apps5/php-7.0.25/ext/snmp/tests/snmp-object.php on line 105 129+ bool(false) 131+ SET single OID 132+ 133+ Warning: SNMP::get(): Fatal error: Timeout in /root/apps5/php-7.0.25/ext/snmp/tests/snmp-object.php on line 112 134+ 135+ Warning: SNMP::set(): Fatal error: Timeout in /root/apps5/php-7.0.25/ext/snmp/tests/snmp-object.php on line 115 136+ bool(false) 137+ 138+ Warning: SNMP::get(): Fatal error: Timeout in /root/apps5/php-7.0.25/ext/snmp/tests/snmp-object.php on line 117 139+ bool(false) 140+ 141+ Warning: SNMP::set(): Fatal error: Timeout in /root/apps5/php-7.0.25/ext/snmp/tests/snmp-object.php on line 118 142+ bool(false) 143+ 144+ Warning: SNMP::get(): Fatal error: Timeout in /root/apps5/php-7.0.25/ext/snmp/tests/snmp-object.php on line 120 149+ Warning: SNMP::get(): Fatal error: Timeout in /root/apps5/php-7.0.25/ext/snmp/tests/snmp-object.php on line 128 150+ 152+ 153+ Warning: SNMP::set(): Fatal error: Timeout in /root/apps5/php-7.0.25/ext/snmp/tests/snmp-object.php on line 130 154+ bool(false) 155+ 156+ Warning: SNMP::get(): Fatal error: Timeout in /root/apps5/php-7.0.25/ext/snmp/tests/snmp-object.php on line 132 157+ bool(false) 158+ 159+ Warning: SNMP::get(): Fatal error: Timeout in /root/apps5/php-7.0.25/ext/snmp/tests/snmp-object.php on line 133 160+ bool(false) 161+ 162+ Warning: SNMP::set(): Can not fit all OIDs for SET query into one packet, using multiple queries in /root/apps5/php-7.0.25/ext/snmp/tests/snmp-object.php on line 134 163+ 164+ Warning: SNMP::set(): Fatal error: Timeout in /root/apps5/php-7.0.25/ext/snmp/tests/snmp-object.php on line 134 165+ bool(false) 166+ 167+ Warning: SNMP::get(): Fatal error: Timeout in /root/apps5/php-7.0.25/ext/snmp/tests/snmp-object.php on line 136 170+ Warning: SNMP::get(): Fatal error: Timeout in /root/apps5/php-7.0.25/ext/snmp/tests/snmp-object.php on line 137 173+ SNMPv3, setting contextEngineID (authPriv) 174+ 175+ Warning: SNMP::get(): Fatal error: Timeout in /root/apps5/php-7.0.25/ext/snmp/tests/snmp-object.php on line 143 176+ bool(false) 086- bool(true) 087- SNMPv3, setting contextEngineID (authPriv) 088- string(%d) "%S" 089- bool(true) ================================================================================ ================================================================================ /root/apps5/php-7.0.25/ext/snmp/tests/snmp2_get.phpt ================================================================================ Checking error handling Warning: snmp2_get() expects parameter 4 to be integer, string given in /root/apps5/php-7.0.25/ext/snmp/tests/snmp2_get.php on line 9 bool(false) Warning: snmp2_get() expects parameter 5 to be integer, string given in /root/apps5/php-7.0.25/ext/snmp/tests/snmp2_get.php on line 10 bool(false) Empty OID array Warning: snmp2_get(): Got empty OID array in /root/apps5/php-7.0.25/ext/snmp/tests/snmp2_get.php on line 12 bool(false) Checking working Single OID Warning: snmp2_get(): No response from 127.0.0.1 in /root/apps5/php-7.0.25/ext/snmp/tests/snmp2_get.php on line 16 bool(false) Single OID in array Warning: snmp2_get(): No response from 127.0.0.1 in /root/apps5/php-7.0.25/ext/snmp/tests/snmp2_get.php on line 18 bool(false) Multiple OID Warning: snmp2_get(): No response from 127.0.0.1 in /root/apps5/php-7.0.25/ext/snmp/tests/snmp2_get.php on line 20 bool(false) More error handling Single OID Warning: snmp2_get(): Invalid object identifier: .1.3.6.1.2..1.1.1.0 in /root/apps5/php-7.0.25/ext/snmp/tests/snmp2_get.php on line 24 bool(false) Single OID in array Warning: snmp2_get(): Invalid object identifier: .1.3.6.1.2.1...1.1.0 in /root/apps5/php-7.0.25/ext/snmp/tests/snmp2_get.php on line 26 bool(false) Multiple OID Warning: snmp2_get(): Invalid object identifier: .1.3.6.1.2.1...1.1.0 in /root/apps5/php-7.0.25/ext/snmp/tests/snmp2_get.php on line 28 bool(false) noSuchName checks Single OID Warning: snmp2_get(): No response from 127.0.0.1 in /root/apps5/php-7.0.25/ext/snmp/tests/snmp2_get.php on line 32 bool(false) Single OID in array Warning: snmp2_get(): No response from 127.0.0.1 in /root/apps5/php-7.0.25/ext/snmp/tests/snmp2_get.php on line 34 bool(false) Multiple OID Warning: snmp2_get(): No response from 127.0.0.1 in /root/apps5/php-7.0.25/ext/snmp/tests/snmp2_get.php on line 36 bool(false) ================================================================================ 014+ 015+ Warning: snmp2_get(): No response from 127.0.0.1 in /root/apps5/php-7.0.25/ext/snmp/tests/snmp2_get.php on line 16 016+ bool(false) 014- %unicode|string%(%d) "%s" 016- array(1) { 017- ["%s"]=> 018- %unicode|string%(%d) "%s" 019- } 018+ 019+ Warning: snmp2_get(): No response from 127.0.0.1 in /root/apps5/php-7.0.25/ext/snmp/tests/snmp2_get.php on line 18 020+ bool(false) 021- array(2) { 022- ["%s"]=> 023- %unicode|string%(%d) "%s" 024- ["%s"]=> 025- %unicode|string%(%d) "%d" 026- } 022+ 023+ Warning: snmp2_get(): No response from 127.0.0.1 in /root/apps5/php-7.0.25/ext/snmp/tests/snmp2_get.php on line 20 024+ bool(false) 041+ Warning: snmp2_get(): No response from 127.0.0.1 in /root/apps5/php-7.0.25/ext/snmp/tests/snmp2_get.php on line 32 043- Warning: snmp2_get(): Error in packet at 'SNMPv2-MIB::sysDescr.110': No Such Instance currently exists at this OID in %s on line %d 045+ Warning: snmp2_get(): No response from 127.0.0.1 in /root/apps5/php-7.0.25/ext/snmp/tests/snmp2_get.php on line 34 047- Warning: snmp2_get(): Error in packet at 'SNMPv2-MIB::sysDescr.110': No Such Instance currently exists at this OID in %s on line %d 049+ Warning: snmp2_get(): No response from 127.0.0.1 in /root/apps5/php-7.0.25/ext/snmp/tests/snmp2_get.php on line 36 050+ bool(false) 051- Warning: snmp2_get(): Error in packet at 'SNMPv2-MIB::sysUpTime.220': No Such Instance currently exists at this OID in %s on line %d 052- array(1) { 053- ["%s"]=> 054- %unicode|string%(%d) "%s" 055- } ================================================================================ ================================================================================ /root/apps5/php-7.0.25/ext/snmp/tests/snmp2_getnext.phpt ================================================================================ Single OID Warning: snmp2_getnext(): No response from 127.0.0.1 in /root/apps5/php-7.0.25/ext/snmp/tests/snmp2_getnext.php on line 9 bool(false) Single OID in array Warning: snmp2_getnext(): No response from 127.0.0.1 in /root/apps5/php-7.0.25/ext/snmp/tests/snmp2_getnext.php on line 11 bool(false) Multiple OID Warning: snmp2_getnext(): No response from 127.0.0.1 in /root/apps5/php-7.0.25/ext/snmp/tests/snmp2_getnext.php on line 13 bool(false) ================================================================================ 002+ 003+ Warning: snmp2_getnext(): No response from 127.0.0.1 in /root/apps5/php-7.0.25/ext/snmp/tests/snmp2_getnext.php on line 9 004+ bool(false) 002- %unicode|string%(%d) "%s" 004- array(1) { 005- ["%s"]=> 006- %unicode|string%(%d) "%s" 007- } 006+ 007+ Warning: snmp2_getnext(): No response from 127.0.0.1 in /root/apps5/php-7.0.25/ext/snmp/tests/snmp2_getnext.php on line 11 008+ bool(false) 009- array(2) { 010- ["%s"]=> 011- %unicode|string%(%d) "%s" 010+ 011+ Warning: snmp2_getnext(): No response from 127.0.0.1 in /root/apps5/php-7.0.25/ext/snmp/tests/snmp2_getnext.php on line 13 012+ bool(false) 012- ["%s"]=> 013- %unicode|string%(%d) "%d" 014- } ================================================================================ ================================================================================ /root/apps5/php-7.0.25/ext/snmp/tests/snmp2_real_walk.phpt ================================================================================ Checking error handling Warning: snmp2_real_walk() expects parameter 4 to be integer, string given in /root/apps5/php-7.0.25/ext/snmp/tests/snmp2_real_walk.php on line 9 bool(false) Warning: snmp2_real_walk() expects parameter 5 to be integer, string given in /root/apps5/php-7.0.25/ext/snmp/tests/snmp2_real_walk.php on line 10 bool(false) Checking working Single OID Warning: snmp2_real_walk(): No response from 127.0.0.1 in /root/apps5/php-7.0.25/ext/snmp/tests/snmp2_real_walk.php on line 14 string(7) "boolean" int(1) Warning: key() expects parameter 1 to be array, boolean given in /root/apps5/php-7.0.25/ext/snmp/tests/snmp2_real_walk.php on line 17 NULL Warning: array_shift() expects parameter 1 to be array, boolean given in /root/apps5/php-7.0.25/ext/snmp/tests/snmp2_real_walk.php on line 18 NULL Single OID in array Warning: snmp2_real_walk(): No response from 127.0.0.1 in /root/apps5/php-7.0.25/ext/snmp/tests/snmp2_real_walk.php on line 21 string(7) "boolean" int(1) Warning: key() expects parameter 1 to be array, boolean given in /root/apps5/php-7.0.25/ext/snmp/tests/snmp2_real_walk.php on line 24 NULL Warning: array_shift() expects parameter 1 to be array, boolean given in /root/apps5/php-7.0.25/ext/snmp/tests/snmp2_real_walk.php on line 25 NULL More error handling Multiple correct OID Warning: snmp2_real_walk(): Multi OID walks are not supported! in /root/apps5/php-7.0.25/ext/snmp/tests/snmp2_real_walk.php on line 29 bool(false) Multiple OID with wrong OID Warning: snmp2_real_walk(): Multi OID walks are not supported! in /root/apps5/php-7.0.25/ext/snmp/tests/snmp2_real_walk.php on line 33 bool(false) Warning: snmp2_real_walk(): Multi OID walks are not supported! in /root/apps5/php-7.0.25/ext/snmp/tests/snmp2_real_walk.php on line 35 bool(false) Single nonexisting OID Warning: snmp2_real_walk(): No response from 127.0.0.1 in /root/apps5/php-7.0.25/ext/snmp/tests/snmp2_real_walk.php on line 39 bool(false) ================================================================================ 010+ 011+ Warning: snmp2_real_walk(): No response from 127.0.0.1 in /root/apps5/php-7.0.25/ext/snmp/tests/snmp2_real_walk.php on line 14 012+ string(7) "boolean" 010- %unicode|string%(5) "array" 012- string(%d) "%s" 014+ 015+ Warning: key() expects parameter 1 to be array, boolean given in /root/apps5/php-7.0.25/ext/snmp/tests/snmp2_real_walk.php on line 17 016+ NULL 017+ 018+ Warning: array_shift() expects parameter 1 to be array, boolean given in /root/apps5/php-7.0.25/ext/snmp/tests/snmp2_real_walk.php on line 18 019+ NULL 020+ Single OID in array 021+ 022+ Warning: snmp2_real_walk(): No response from 127.0.0.1 in /root/apps5/php-7.0.25/ext/snmp/tests/snmp2_real_walk.php on line 21 014- Single OID in array 015- %unicode|string%(5) "array" 017- string(%d) "%s" 018- string(%d) "%s" 025+ 026+ Warning: key() expects parameter 1 to be array, boolean given in /root/apps5/php-7.0.25/ext/snmp/tests/snmp2_real_walk.php on line 24 027+ NULL 028+ 029+ Warning: array_shift() expects parameter 1 to be array, boolean given in /root/apps5/php-7.0.25/ext/snmp/tests/snmp2_real_walk.php on line 25 030+ NULL 033- Warning: snmp2_real_walk(): Error in packet at '%s': No more variables left in this MIB View (It is past the end of the MIB tree) in %s on line %d 045+ Warning: snmp2_real_walk(): No response from 127.0.0.1 in /root/apps5/php-7.0.25/ext/snmp/tests/snmp2_real_walk.php on line 39 ================================================================================ ================================================================================ /root/apps5/php-7.0.25/ext/snmp/tests/snmp2_set-nomib.phpt ================================================================================ Check error handing Nonexisting OID Warning: snmp2_set(): No response from 127.0.0.1 in /root/apps5/php-7.0.25/ext/snmp/tests/snmp2_set-nomib.php on line 10 bool(false) Bogus OID Warning: snmp2_set(): Invalid object identifier: .1.3.6...777.888.999.444.0 in /root/apps5/php-7.0.25/ext/snmp/tests/snmp2_set-nomib.php on line 14 bool(false) Checking working Warning: snmpget(): No response from 127.0.0.1 in /root/apps5/php-7.0.25/ext/snmp/tests/snmp2_set-nomib.php on line 19 Single OID Warning: snmp2_set(): No response from 127.0.0.1 in /root/apps5/php-7.0.25/ext/snmp/tests/snmp2_set-nomib.php on line 23 bool(false) Warning: snmpget(): No response from 127.0.0.1 in /root/apps5/php-7.0.25/ext/snmp/tests/snmp2_set-nomib.php on line 25 bool(false) Warning: snmp2_set(): No response from 127.0.0.1 in /root/apps5/php-7.0.25/ext/snmp/tests/snmp2_set-nomib.php on line 26 bool(false) Warning: snmpget(): No response from 127.0.0.1 in /root/apps5/php-7.0.25/ext/snmp/tests/snmp2_set-nomib.php on line 28 bool(true) ================================================================================ 004+ Warning: snmp2_set(): No response from 127.0.0.1 in /root/apps5/php-7.0.25/ext/snmp/tests/snmp2_set-nomib.php on line 10 004- Warning: snmp2_set(): Error in packet at '%s': notWritable (That object does not support modification) in %s on line %d 011+ 012+ Warning: snmpget(): No response from 127.0.0.1 in /root/apps5/php-7.0.25/ext/snmp/tests/snmp2_set-nomib.php on line 19 012- bool(true) 014+ 015+ Warning: snmp2_set(): No response from 127.0.0.1 in /root/apps5/php-7.0.25/ext/snmp/tests/snmp2_set-nomib.php on line 23 016+ bool(false) 017+ 018+ Warning: snmpget(): No response from 127.0.0.1 in /root/apps5/php-7.0.25/ext/snmp/tests/snmp2_set-nomib.php on line 25 019+ bool(false) 020+ 021+ Warning: snmp2_set(): No response from 127.0.0.1 in /root/apps5/php-7.0.25/ext/snmp/tests/snmp2_set-nomib.php on line 26 022+ bool(false) 023+ 024+ Warning: snmpget(): No response from 127.0.0.1 in /root/apps5/php-7.0.25/ext/snmp/tests/snmp2_set-nomib.php on line 28 014- bool(true) 015- bool(true) ================================================================================ ================================================================================ /root/apps5/php-7.0.25/ext/snmp/tests/snmp2_set.phpt ================================================================================ Check error handing 4args (5 needed) Warning: snmp2_set() expects at least 5 parameters, 3 given in /root/apps5/php-7.0.25/ext/snmp/tests/snmp2_set.php on line 10 bool(false) No type & no value (timeout & retries instead) Warning: snmp2_set(): Bogus type '-1', should be single char, got 2 in /root/apps5/php-7.0.25/ext/snmp/tests/snmp2_set.php on line 14 bool(false) No value (timeout instead), retries instead of timeout Warning: snmp2_set(): Could not add variable: OID='SNMPv2-MIB::sysLocation.0' type='q' value='-1': Bad variable type ("q") in /root/apps5/php-7.0.25/ext/snmp/tests/snmp2_set.php on line 18 bool(false) Bogus OID Warning: snmp2_set(): No response from 127.0.0.1 in /root/apps5/php-7.0.25/ext/snmp/tests/snmp2_set.php on line 22 bool(false) Checking working Warning: snmpget(): No response from 127.0.0.1 in /root/apps5/php-7.0.25/ext/snmp/tests/snmp2_set.php on line 27 Warning: snmpget(): No response from 127.0.0.1 in /root/apps5/php-7.0.25/ext/snmp/tests/snmp2_set.php on line 30 Single OID Warning: snmp2_set(): No response from 127.0.0.1 in /root/apps5/php-7.0.25/ext/snmp/tests/snmp2_set.php on line 34 bool(false) Warning: snmpget(): No response from 127.0.0.1 in /root/apps5/php-7.0.25/ext/snmp/tests/snmp2_set.php on line 36 bool(false) Warning: snmp2_set(): No response from 127.0.0.1 in /root/apps5/php-7.0.25/ext/snmp/tests/snmp2_set.php on line 37 bool(false) Warning: snmpget(): No response from 127.0.0.1 in /root/apps5/php-7.0.25/ext/snmp/tests/snmp2_set.php on line 39 bool(true) Multiple OID Warning: snmp2_set(): No response from 127.0.0.1 in /root/apps5/php-7.0.25/ext/snmp/tests/snmp2_set.php on line 42 bool(false) Warning: snmpget(): No response from 127.0.0.1 in /root/apps5/php-7.0.25/ext/snmp/tests/snmp2_set.php on line 44 bool(false) Warning: snmpget(): No response from 127.0.0.1 in /root/apps5/php-7.0.25/ext/snmp/tests/snmp2_set.php on line 45 bool(false) Warning: snmp2_set(): No response from 127.0.0.1 in /root/apps5/php-7.0.25/ext/snmp/tests/snmp2_set.php on line 46 bool(false) Warning: snmpget(): No response from 127.0.0.1 in /root/apps5/php-7.0.25/ext/snmp/tests/snmp2_set.php on line 48 bool(true) Warning: snmpget(): No response from 127.0.0.1 in /root/apps5/php-7.0.25/ext/snmp/tests/snmp2_set.php on line 49 bool(true) Multiple OID, single type & value Warning: snmp2_set(): No response from 127.0.0.1 in /root/apps5/php-7.0.25/ext/snmp/tests/snmp2_set.php on line 52 bool(false) Warning: snmpget(): No response from 127.0.0.1 in /root/apps5/php-7.0.25/ext/snmp/tests/snmp2_set.php on line 54 bool(false) Warning: snmpget(): No response from 127.0.0.1 in /root/apps5/php-7.0.25/ext/snmp/tests/snmp2_set.php on line 55 bool(false) Warning: snmp2_set(): No response from 127.0.0.1 in /root/apps5/php-7.0.25/ext/snmp/tests/snmp2_set.php on line 56 bool(false) Warning: snmpget(): No response from 127.0.0.1 in /root/apps5/php-7.0.25/ext/snmp/tests/snmp2_set.php on line 58 bool(true) Warning: snmpget(): No response from 127.0.0.1 in /root/apps5/php-7.0.25/ext/snmp/tests/snmp2_set.php on line 59 bool(true) Multiple OID, single type, multiple value Warning: snmp2_set(): No response from 127.0.0.1 in /root/apps5/php-7.0.25/ext/snmp/tests/snmp2_set.php on line 62 bool(false) Warning: snmpget(): No response from 127.0.0.1 in /root/apps5/php-7.0.25/ext/snmp/tests/snmp2_set.php on line 64 bool(false) Warning: snmpget(): No response from 127.0.0.1 in /root/apps5/php-7.0.25/ext/snmp/tests/snmp2_set.php on line 65 bool(false) Warning: snmp2_set(): No response from 127.0.0.1 in /root/apps5/php-7.0.25/ext/snmp/tests/snmp2_set.php on line 66 bool(false) Warning: snmpget(): No response from 127.0.0.1 in /root/apps5/php-7.0.25/ext/snmp/tests/snmp2_set.php on line 68 bool(true) Warning: snmpget(): No response from 127.0.0.1 in /root/apps5/php-7.0.25/ext/snmp/tests/snmp2_set.php on line 69 bool(true) More error handing Single OID, single type in array, single value Warning: snmp2_set(): Single objid and multiple type or values are not supported in /root/apps5/php-7.0.25/ext/snmp/tests/snmp2_set.php on line 74 bool(false) Warning: snmpget(): No response from 127.0.0.1 in /root/apps5/php-7.0.25/ext/snmp/tests/snmp2_set.php on line 76 bool(true) Warning: snmpget(): No response from 127.0.0.1 in /root/apps5/php-7.0.25/ext/snmp/tests/snmp2_set.php on line 77 bool(true) Single OID, single type, single value in array Warning: snmp2_set(): Single objid and multiple type or values are not supported in /root/apps5/php-7.0.25/ext/snmp/tests/snmp2_set.php on line 80 bool(false) Warning: snmpget(): No response from 127.0.0.1 in /root/apps5/php-7.0.25/ext/snmp/tests/snmp2_set.php on line 82 bool(true) Warning: snmpget(): No response from 127.0.0.1 in /root/apps5/php-7.0.25/ext/snmp/tests/snmp2_set.php on line 83 bool(true) Multiple OID, 1st wrong type Warning: snmp2_set(): 'SNMPv2-MIB::sysContact.0': bogus type 'sw', should be single char, got 2 in /root/apps5/php-7.0.25/ext/snmp/tests/snmp2_set.php on line 86 bool(false) Warning: snmpget(): No response from 127.0.0.1 in /root/apps5/php-7.0.25/ext/snmp/tests/snmp2_set.php on line 88 bool(true) Warning: snmpget(): No response from 127.0.0.1 in /root/apps5/php-7.0.25/ext/snmp/tests/snmp2_set.php on line 89 bool(true) Multiple OID, 2nd wrong type Warning: snmp2_set(): 'SNMPv2-MIB::sysLocation.0': bogus type 'sb', should be single char, got 2 in /root/apps5/php-7.0.25/ext/snmp/tests/snmp2_set.php on line 92 bool(false) Warning: snmpget(): No response from 127.0.0.1 in /root/apps5/php-7.0.25/ext/snmp/tests/snmp2_set.php on line 94 bool(true) Warning: snmpget(): No response from 127.0.0.1 in /root/apps5/php-7.0.25/ext/snmp/tests/snmp2_set.php on line 95 bool(true) Multiple OID, single type in array, multiple value Warning: snmp2_set(): 'SNMPv2-MIB::sysLocation.0': no type set in /root/apps5/php-7.0.25/ext/snmp/tests/snmp2_set.php on line 98 bool(false) Warning: snmpget(): No response from 127.0.0.1 in /root/apps5/php-7.0.25/ext/snmp/tests/snmp2_set.php on line 100 bool(true) Warning: snmpget(): No response from 127.0.0.1 in /root/apps5/php-7.0.25/ext/snmp/tests/snmp2_set.php on line 101 bool(true) Multiple OID & type, singe value in array Warning: snmp2_set(): 'SNMPv2-MIB::sysLocation.0': no value set in /root/apps5/php-7.0.25/ext/snmp/tests/snmp2_set.php on line 104 bool(false) Warning: snmpget(): No response from 127.0.0.1 in /root/apps5/php-7.0.25/ext/snmp/tests/snmp2_set.php on line 106 bool(true) Warning: snmpget(): No response from 127.0.0.1 in /root/apps5/php-7.0.25/ext/snmp/tests/snmp2_set.php on line 107 bool(true) Multiple OID, 1st bogus, single type, multiple value Warning: snmp2_set(): No response from 127.0.0.1 in /root/apps5/php-7.0.25/ext/snmp/tests/snmp2_set.php on line 110 bool(false) Warning: snmpget(): No response from 127.0.0.1 in /root/apps5/php-7.0.25/ext/snmp/tests/snmp2_set.php on line 112 bool(true) Warning: snmpget(): No response from 127.0.0.1 in /root/apps5/php-7.0.25/ext/snmp/tests/snmp2_set.php on line 113 bool(true) Multiple OID, 2nd bogus, single type, multiple value Warning: snmp2_set(): No response from 127.0.0.1 in /root/apps5/php-7.0.25/ext/snmp/tests/snmp2_set.php on line 116 bool(false) Warning: snmpget(): No response from 127.0.0.1 in /root/apps5/php-7.0.25/ext/snmp/tests/snmp2_set.php on line 118 bool(true) Warning: snmpget(): No response from 127.0.0.1 in /root/apps5/php-7.0.25/ext/snmp/tests/snmp2_set.php on line 119 bool(true) Multiple OID, single multiple type (1st bogus), multiple value Warning: snmp2_set(): Could not add variable: OID='SNMPv2-MIB::sysContact.0' type='q' value='0': Bad variable type ("q") in /root/apps5/php-7.0.25/ext/snmp/tests/snmp2_set.php on line 122 bool(false) Warning: snmpget(): No response from 127.0.0.1 in /root/apps5/php-7.0.25/ext/snmp/tests/snmp2_set.php on line 124 bool(true) Warning: snmpget(): No response from 127.0.0.1 in /root/apps5/php-7.0.25/ext/snmp/tests/snmp2_set.php on line 125 bool(true) Multiple OID, single multiple type (2nd bogus), multiple value Warning: snmp2_set(): Could not add variable: OID='SNMPv2-MIB::sysLocation.0' type='w' value='0': Bad variable type ("w") in /root/apps5/php-7.0.25/ext/snmp/tests/snmp2_set.php on line 128 bool(false) Warning: snmpget(): No response from 127.0.0.1 in /root/apps5/php-7.0.25/ext/snmp/tests/snmp2_set.php on line 130 bool(true) Warning: snmpget(): No response from 127.0.0.1 in /root/apps5/php-7.0.25/ext/snmp/tests/snmp2_set.php on line 131 bool(true) ================================================================================ 016+ Warning: snmp2_set(): No response from 127.0.0.1 in /root/apps5/php-7.0.25/ext/snmp/tests/snmp2_set.php on line 22 016- Warning: snmp2_set(): Error in packet at '%s': notWritable (That object does not support modification) in %s on line %d 019+ 020+ Warning: snmpget(): No response from 127.0.0.1 in /root/apps5/php-7.0.25/ext/snmp/tests/snmp2_set.php on line 27 021+ 022+ Warning: snmpget(): No response from 127.0.0.1 in /root/apps5/php-7.0.25/ext/snmp/tests/snmp2_set.php on line 30 020- bool(true) 021- bool(true) 023- bool(true) 024+ 025+ Warning: snmp2_set(): No response from 127.0.0.1 in /root/apps5/php-7.0.25/ext/snmp/tests/snmp2_set.php on line 34 026+ bool(false) 027+ 028+ Warning: snmpget(): No response from 127.0.0.1 in /root/apps5/php-7.0.25/ext/snmp/tests/snmp2_set.php on line 36 029+ bool(false) 030+ 031+ Warning: snmp2_set(): No response from 127.0.0.1 in /root/apps5/php-7.0.25/ext/snmp/tests/snmp2_set.php on line 37 032+ bool(false) 033+ 034+ Warning: snmpget(): No response from 127.0.0.1 in /root/apps5/php-7.0.25/ext/snmp/tests/snmp2_set.php on line 39 025- bool(true) 026- bool(true) 027- bool(true) 028- bool(true) 032- bool(true) 033- bool(true) 034- bool(true) 035- bool(true) 037+ 038+ Warning: snmp2_set(): No response from 127.0.0.1 in /root/apps5/php-7.0.25/ext/snmp/tests/snmp2_set.php on line 42 039+ bool(false) 040+ 041+ Warning: snmpget(): No response from 127.0.0.1 in /root/apps5/php-7.0.25/ext/snmp/tests/snmp2_set.php on line 44 042+ bool(false) 043+ 044+ Warning: snmpget(): No response from 127.0.0.1 in /root/apps5/php-7.0.25/ext/snmp/tests/snmp2_set.php on line 45 045+ bool(false) 046+ 047+ Warning: snmp2_set(): No response from 127.0.0.1 in /root/apps5/php-7.0.25/ext/snmp/tests/snmp2_set.php on line 46 048+ bool(false) 049+ 050+ Warning: snmpget(): No response from 127.0.0.1 in /root/apps5/php-7.0.25/ext/snmp/tests/snmp2_set.php on line 48 039- bool(true) 040- bool(true) 041- bool(true) 042- bool(true) 043- bool(true) 052+ 053+ Warning: snmpget(): No response from 127.0.0.1 in /root/apps5/php-7.0.25/ext/snmp/tests/snmp2_set.php on line 49 056+ 057+ Warning: snmp2_set(): No response from 127.0.0.1 in /root/apps5/php-7.0.25/ext/snmp/tests/snmp2_set.php on line 52 058+ bool(false) 059+ 060+ Warning: snmpget(): No response from 127.0.0.1 in /root/apps5/php-7.0.25/ext/snmp/tests/snmp2_set.php on line 54 061+ bool(false) 062+ 063+ Warning: snmpget(): No response from 127.0.0.1 in /root/apps5/php-7.0.25/ext/snmp/tests/snmp2_set.php on line 55 064+ bool(false) 065+ 066+ Warning: snmp2_set(): No response from 127.0.0.1 in /root/apps5/php-7.0.25/ext/snmp/tests/snmp2_set.php on line 56 067+ bool(false) 068+ 069+ Warning: snmpget(): No response from 127.0.0.1 in /root/apps5/php-7.0.25/ext/snmp/tests/snmp2_set.php on line 58 071+ 072+ Warning: snmpget(): No response from 127.0.0.1 in /root/apps5/php-7.0.25/ext/snmp/tests/snmp2_set.php on line 59 075+ 076+ Warning: snmp2_set(): No response from 127.0.0.1 in /root/apps5/php-7.0.25/ext/snmp/tests/snmp2_set.php on line 62 077+ bool(false) 078+ 079+ Warning: snmpget(): No response from 127.0.0.1 in /root/apps5/php-7.0.25/ext/snmp/tests/snmp2_set.php on line 64 080+ bool(false) 081+ 082+ Warning: snmpget(): No response from 127.0.0.1 in /root/apps5/php-7.0.25/ext/snmp/tests/snmp2_set.php on line 65 083+ bool(false) 084+ 085+ Warning: snmp2_set(): No response from 127.0.0.1 in /root/apps5/php-7.0.25/ext/snmp/tests/snmp2_set.php on line 66 086+ bool(false) 087+ 088+ Warning: snmpget(): No response from 127.0.0.1 in /root/apps5/php-7.0.25/ext/snmp/tests/snmp2_set.php on line 68 084- Warning: snmp2_set(): Error in packet at '%s': %rnoCreation|notWritable%r (%s) in %s on line %d 090+ 091+ Warning: snmpget(): No response from 127.0.0.1 in /root/apps5/php-7.0.25/ext/snmp/tests/snmp2_set.php on line 69 092+ bool(true) 090- Warning: snmp2_set(): Error in packet at '%s': %rnoCreation|notWritable%r (%s) in %s on line %d 098+ 099+ Warning: snmpget(): No response from 127.0.0.1 in /root/apps5/php-7.0.25/ext/snmp/tests/snmp2_set.php on line 76 101+ 102+ Warning: snmpget(): No response from 127.0.0.1 in /root/apps5/php-7.0.25/ext/snmp/tests/snmp2_set.php on line 77 108+ 109+ Warning: snmpget(): No response from 127.0.0.1 in /root/apps5/php-7.0.25/ext/snmp/tests/snmp2_set.php on line 82 111+ 112+ Warning: snmpget(): No response from 127.0.0.1 in /root/apps5/php-7.0.25/ext/snmp/tests/snmp2_set.php on line 83 118+ 119+ Warning: snmpget(): No response from 127.0.0.1 in /root/apps5/php-7.0.25/ext/snmp/tests/snmp2_set.php on line 88 121+ 122+ Warning: snmpget(): No response from 127.0.0.1 in /root/apps5/php-7.0.25/ext/snmp/tests/snmp2_set.php on line 89 128+ 129+ Warning: snmpget(): No response from 127.0.0.1 in /root/apps5/php-7.0.25/ext/snmp/tests/snmp2_set.php on line 94 131+ 132+ Warning: snmpget(): No response from 127.0.0.1 in /root/apps5/php-7.0.25/ext/snmp/tests/snmp2_set.php on line 95 138+ 139+ Warning: snmpget(): No response from 127.0.0.1 in /root/apps5/php-7.0.25/ext/snmp/tests/snmp2_set.php on line 100 141+ 142+ Warning: snmpget(): No response from 127.0.0.1 in /root/apps5/php-7.0.25/ext/snmp/tests/snmp2_set.php on line 101 148+ 149+ Warning: snmpget(): No response from 127.0.0.1 in /root/apps5/php-7.0.25/ext/snmp/tests/snmp2_set.php on line 106 151+ 152+ Warning: snmpget(): No response from 127.0.0.1 in /root/apps5/php-7.0.25/ext/snmp/tests/snmp2_set.php on line 107 156+ Warning: snmp2_set(): No response from 127.0.0.1 in /root/apps5/php-7.0.25/ext/snmp/tests/snmp2_set.php on line 110 158+ 159+ Warning: snmpget(): No response from 127.0.0.1 in /root/apps5/php-7.0.25/ext/snmp/tests/snmp2_set.php on line 112 161+ 162+ Warning: snmpget(): No response from 127.0.0.1 in /root/apps5/php-7.0.25/ext/snmp/tests/snmp2_set.php on line 113 166+ Warning: snmp2_set(): No response from 127.0.0.1 in /root/apps5/php-7.0.25/ext/snmp/tests/snmp2_set.php on line 116 168+ 169+ Warning: snmpget(): No response from 127.0.0.1 in /root/apps5/php-7.0.25/ext/snmp/tests/snmp2_set.php on line 118 171+ 172+ Warning: snmpget(): No response from 127.0.0.1 in /root/apps5/php-7.0.25/ext/snmp/tests/snmp2_set.php on line 119 178+ 179+ Warning: snmpget(): No response from 127.0.0.1 in /root/apps5/php-7.0.25/ext/snmp/tests/snmp2_set.php on line 124 181+ 182+ Warning: snmpget(): No response from 127.0.0.1 in /root/apps5/php-7.0.25/ext/snmp/tests/snmp2_set.php on line 125 188+ 189+ Warning: snmpget(): No response from 127.0.0.1 in /root/apps5/php-7.0.25/ext/snmp/tests/snmp2_set.php on line 130 191+ 192+ Warning: snmpget(): No response from 127.0.0.1 in /root/apps5/php-7.0.25/ext/snmp/tests/snmp2_set.php on line 131 ================================================================================ ================================================================================ /root/apps5/php-7.0.25/ext/snmp/tests/snmp2_walk.phpt ================================================================================ Checking error handling Warning: snmp2_walk() expects parameter 4 to be integer, string given in /root/apps5/php-7.0.25/ext/snmp/tests/snmp2_walk.php on line 9 bool(false) Warning: snmp2_walk() expects parameter 5 to be integer, string given in /root/apps5/php-7.0.25/ext/snmp/tests/snmp2_walk.php on line 10 bool(false) Checking working Single OID Warning: snmp2_walk(): No response from 127.0.0.1 in /root/apps5/php-7.0.25/ext/snmp/tests/snmp2_walk.php on line 14 string(7) "boolean" int(1) string(4) "NULL" string(4) "NULL" Single OID in array Warning: snmp2_walk(): No response from 127.0.0.1 in /root/apps5/php-7.0.25/ext/snmp/tests/snmp2_walk.php on line 22 string(7) "boolean" string(4) "NULL" Default OID Warning: snmpwalk(): No response from 127.0.0.1 in /root/apps5/php-7.0.25/ext/snmp/tests/snmp2_walk.php on line 27 string(7) "boolean" string(4) "NULL" More error handling Single incorrect OID Warning: snmpwalk(): Invalid object identifier: .1.3.6...1 in /root/apps5/php-7.0.25/ext/snmp/tests/snmp2_walk.php on line 33 bool(false) Multiple correct OID Warning: snmp2_walk(): Multi OID walks are not supported! in /root/apps5/php-7.0.25/ext/snmp/tests/snmp2_walk.php on line 37 bool(false) Multiple OID with wrong OID Warning: snmp2_walk(): Multi OID walks are not supported! in /root/apps5/php-7.0.25/ext/snmp/tests/snmp2_walk.php on line 41 bool(false) Warning: snmp2_walk(): Multi OID walks are not supported! in /root/apps5/php-7.0.25/ext/snmp/tests/snmp2_walk.php on line 43 bool(false) Single nonexisting OID Warning: snmp2_walk(): No response from 127.0.0.1 in /root/apps5/php-7.0.25/ext/snmp/tests/snmp2_walk.php on line 47 bool(false) ================================================================================ 010+ 011+ Warning: snmp2_walk(): No response from 127.0.0.1 in /root/apps5/php-7.0.25/ext/snmp/tests/snmp2_walk.php on line 14 012+ string(7) "boolean" 010- %unicode|string%(5) "array" 012- %unicode|string%(6) "string" 013- %unicode|string%(6) "string" 014+ string(4) "NULL" 015+ string(4) "NULL" 015- %unicode|string%(5) "array" 016- %unicode|string%(6) "string" 017+ 018+ Warning: snmp2_walk(): No response from 127.0.0.1 in /root/apps5/php-7.0.25/ext/snmp/tests/snmp2_walk.php on line 22 019+ string(7) "boolean" 020+ string(4) "NULL" 018- %unicode|string%(5) "array" 019- %unicode|string%(6) "string" 022+ 023+ Warning: snmpwalk(): No response from 127.0.0.1 in /root/apps5/php-7.0.25/ext/snmp/tests/snmp2_walk.php on line 27 024+ string(7) "boolean" 025+ string(4) "NULL" 038- Warning: snmp2_walk(): Error in packet at '%s': No more variables left in this MIB View (It is past the end of the MIB tree) in %s on line %d 044+ Warning: snmp2_walk(): No response from 127.0.0.1 in /root/apps5/php-7.0.25/ext/snmp/tests/snmp2_walk.php on line 47 ================================================================================ ================================================================================ /root/apps5/php-7.0.25/ext/snmp/tests/snmp3-error.phpt ================================================================================ Checking error handling Warning: snmp3_get() expects at least 8 parameters, 7 given in /root/apps5/php-7.0.25/ext/snmp/tests/snmp3-error.php on line 10 bool(false) Warning: snmp3_get(): Invalid security level '' in /root/apps5/php-7.0.25/ext/snmp/tests/snmp3-error.php on line 11 bool(false) Warning: snmp3_get(): Invalid security level 'bugusPriv' in /root/apps5/php-7.0.25/ext/snmp/tests/snmp3-error.php on line 12 bool(false) Warning: snmp3_get(): Unknown authentication protocol 'TTT' in /root/apps5/php-7.0.25/ext/snmp/tests/snmp3-error.php on line 13 bool(false) Warning: snmp3_get(): Error generating a key for authentication pass phrase '': Generic error (The supplied password length is too short.) in /root/apps5/php-7.0.25/ext/snmp/tests/snmp3-error.php on line 14 bool(false) Warning: snmp3_get(): Error generating a key for authentication pass phrase 'te': Generic error (The supplied password length is too short.) in /root/apps5/php-7.0.25/ext/snmp/tests/snmp3-error.php on line 15 bool(false) Warning: snmp3_get(): Unknown security protocol 'BBB' in /root/apps5/php-7.0.25/ext/snmp/tests/snmp3-error.php on line 16 bool(false) Warning: snmp3_get(): Error generating a key for privacy pass phrase '': Generic error (The supplied password length is too short.) in /root/apps5/php-7.0.25/ext/snmp/tests/snmp3-error.php on line 17 bool(false) Warning: snmp3_get(): Error generating a key for privacy pass phrase 'ty': Generic error (The supplied password length is too short.) in /root/apps5/php-7.0.25/ext/snmp/tests/snmp3-error.php on line 18 bool(false) Warning: snmp3_get(): Fatal error: Timeout in /root/apps5/php-7.0.25/ext/snmp/tests/snmp3-error.php on line 19 bool(false) Warning: snmp3_set() expects at least 10 parameters, 9 given in /root/apps5/php-7.0.25/ext/snmp/tests/snmp3-error.php on line 21 bool(false) Warning: snmp3_set(): Invalid object identifier: .1.3.6.777...7.5.3 in /root/apps5/php-7.0.25/ext/snmp/tests/snmp3-error.php on line 23 bool(false) Warning: snmp3_set(): Single objid and multiple type or values are not supported in /root/apps5/php-7.0.25/ext/snmp/tests/snmp3-error.php on line 24 bool(false) ================================================================================ 030+ Warning: snmp3_get(): Fatal error: Timeout in /root/apps5/php-7.0.25/ext/snmp/tests/snmp3-error.php on line 19 030- Warning: snmp3_get(): Fatal error: Unknown user name in %s on line %d ================================================================================ ================================================================================ /root/apps5/php-7.0.25/ext/snmp/tests/snmp3.phpt ================================================================================ Working version GET single: noAuthNoPriv Warning: snmp3_get(): Fatal error: Timeout in /root/apps5/php-7.0.25/ext/snmp/tests/snmp3.php on line 11 bool(false) GET single: MD5 Warning: snmp3_get(): Fatal error: Timeout in /root/apps5/php-7.0.25/ext/snmp/tests/snmp3.php on line 15 bool(false) GET single: SHA Warning: snmp3_get(): Fatal error: Timeout in /root/apps5/php-7.0.25/ext/snmp/tests/snmp3.php on line 15 bool(false) GET single: MD5/AES Warning: snmp3_get(): Fatal error: Timeout in /root/apps5/php-7.0.25/ext/snmp/tests/snmp3.php on line 20 bool(false) GET single: MD5/DES Warning: snmp3_get(): Fatal error: Timeout in /root/apps5/php-7.0.25/ext/snmp/tests/snmp3.php on line 20 bool(false) GET single: MD5/AES128 Warning: snmp3_get(): Fatal error: Timeout in /root/apps5/php-7.0.25/ext/snmp/tests/snmp3.php on line 20 bool(false) GET multiple Warning: snmp3_get(): Fatal error: Timeout in /root/apps5/php-7.0.25/ext/snmp/tests/snmp3.php on line 24 bool(false) GETNEXT single Warning: snmp3_getnext(): Fatal error: Timeout in /root/apps5/php-7.0.25/ext/snmp/tests/snmp3.php on line 26 bool(false) WALK single on single OID Warning: snmp3_walk(): Fatal error: Timeout in /root/apps5/php-7.0.25/ext/snmp/tests/snmp3.php on line 29 string(7) "boolean" int(1) bool(false) REALWALK single on single OID Warning: snmp3_real_walk(): Fatal error: Timeout in /root/apps5/php-7.0.25/ext/snmp/tests/snmp3.php on line 35 string(7) "boolean" int(1) bool(false) WALK multiple on single OID Warning: snmp3_walk(): Fatal error: Timeout in /root/apps5/php-7.0.25/ext/snmp/tests/snmp3.php on line 41 string(7) "boolean" int(1) Warning: key() expects parameter 1 to be array, boolean given in /root/apps5/php-7.0.25/ext/snmp/tests/snmp3.php on line 44 NULL Warning: array_shift() expects parameter 1 to be array, boolean given in /root/apps5/php-7.0.25/ext/snmp/tests/snmp3.php on line 45 NULL REALWALK multiple on single OID Warning: snmp3_real_walk(): Fatal error: Timeout in /root/apps5/php-7.0.25/ext/snmp/tests/snmp3.php on line 48 string(7) "boolean" int(1) Warning: key() expects parameter 1 to be array, boolean given in /root/apps5/php-7.0.25/ext/snmp/tests/snmp3.php on line 51 NULL Warning: array_shift() expects parameter 1 to be array, boolean given in /root/apps5/php-7.0.25/ext/snmp/tests/snmp3.php on line 52 NULL SET single OID Warning: snmp3_get(): Fatal error: Timeout in /root/apps5/php-7.0.25/ext/snmp/tests/snmp3.php on line 56 Warning: snmp3_set(): Fatal error: Timeout in /root/apps5/php-7.0.25/ext/snmp/tests/snmp3.php on line 59 bool(false) Warning: snmp3_get(): Fatal error: Timeout in /root/apps5/php-7.0.25/ext/snmp/tests/snmp3.php on line 61 bool(false) Warning: snmp3_set(): Fatal error: Timeout in /root/apps5/php-7.0.25/ext/snmp/tests/snmp3.php on line 62 bool(false) Warning: snmp3_get(): Fatal error: Timeout in /root/apps5/php-7.0.25/ext/snmp/tests/snmp3.php on line 64 bool(true) ================================================================================ 003+ 004+ Warning: snmp3_get(): Fatal error: Timeout in /root/apps5/php-7.0.25/ext/snmp/tests/snmp3.php on line 11 005+ bool(false) 003- %string|unicode%(%d) "%s" 005- %string|unicode%(%d) "%s" 007+ 008+ Warning: snmp3_get(): Fatal error: Timeout in /root/apps5/php-7.0.25/ext/snmp/tests/snmp3.php on line 15 009+ bool(false) 007- %string|unicode%(%d) "%s" 009- %string|unicode%(%d) "%s" 011+ 012+ Warning: snmp3_get(): Fatal error: Timeout in /root/apps5/php-7.0.25/ext/snmp/tests/snmp3.php on line 15 013+ bool(false) 011- %string|unicode%(%d) "%s" 013- %string|unicode%(%d) "%s" 015+ 016+ Warning: snmp3_get(): Fatal error: Timeout in /root/apps5/php-7.0.25/ext/snmp/tests/snmp3.php on line 20 017+ bool(false) 015- array(2) { 016- ["%s"]=> 017- %string|unicode%(%d) "%s" 018- ["%s"]=> 019- %string|unicode%(%d) "%s" 020- } 019+ 020+ Warning: snmp3_get(): Fatal error: Timeout in /root/apps5/php-7.0.25/ext/snmp/tests/snmp3.php on line 20 021+ bool(false) 023+ 024+ Warning: snmp3_get(): Fatal error: Timeout in /root/apps5/php-7.0.25/ext/snmp/tests/snmp3.php on line 20 025+ bool(false) 023- WALK single on single OID 024- %string|unicode%(5) "array" 026- array(1) { 027- [0]=> 028- %string|unicode%(%d) "%s" 029- } 030- REALWALK single on single OID 031- %string|unicode%(5) "array" 027+ 028+ Warning: snmp3_get(): Fatal error: Timeout in /root/apps5/php-7.0.25/ext/snmp/tests/snmp3.php on line 24 029+ bool(false) 031+ 032+ Warning: snmp3_getnext(): Fatal error: Timeout in /root/apps5/php-7.0.25/ext/snmp/tests/snmp3.php on line 26 033+ bool(false) 034+ WALK single on single OID 035+ 036+ Warning: snmp3_walk(): Fatal error: Timeout in /root/apps5/php-7.0.25/ext/snmp/tests/snmp3.php on line 29 033- array(1) { 034- ["%s"]=> 035- %string|unicode%(%d) "%s" 036- } 037- WALK multiple on single OID 038- %string|unicode%(5) "array" 039- int(%d) 040- int(0) 041- %string|unicode%(%d) "%s" 042- REALWALK multiple on single OID 043- %string|unicode%(5) "array" 044- int(%d) 045- %string|unicode%(%d) "%s" 046- %string|unicode%(%d) "%s" 047- SET single OID 038+ int(1) 039+ bool(false) 040+ REALWALK single on single OID 041+ 042+ Warning: snmp3_real_walk(): Fatal error: Timeout in /root/apps5/php-7.0.25/ext/snmp/tests/snmp3.php on line 35 043+ string(7) "boolean" 044+ int(1) 045+ bool(false) 046+ WALK multiple on single OID 047+ 048+ Warning: snmp3_walk(): Fatal error: Timeout in /root/apps5/php-7.0.25/ext/snmp/tests/snmp3.php on line 41 049+ string(7) "boolean" 051+ 052+ Warning: key() expects parameter 1 to be array, boolean given in /root/apps5/php-7.0.25/ext/snmp/tests/snmp3.php on line 44 053+ NULL 054+ 055+ Warning: array_shift() expects parameter 1 to be array, boolean given in /root/apps5/php-7.0.25/ext/snmp/tests/snmp3.php on line 45 056+ NULL 057+ REALWALK multiple on single OID 058+ 059+ Warning: snmp3_real_walk(): Fatal error: Timeout in /root/apps5/php-7.0.25/ext/snmp/tests/snmp3.php on line 48 060+ string(7) "boolean" 062+ 063+ Warning: key() expects parameter 1 to be array, boolean given in /root/apps5/php-7.0.25/ext/snmp/tests/snmp3.php on line 51 064+ NULL 065+ 066+ Warning: array_shift() expects parameter 1 to be array, boolean given in /root/apps5/php-7.0.25/ext/snmp/tests/snmp3.php on line 52 067+ NULL 068+ SET single OID 069+ 070+ Warning: snmp3_get(): Fatal error: Timeout in /root/apps5/php-7.0.25/ext/snmp/tests/snmp3.php on line 56 071+ 072+ Warning: snmp3_set(): Fatal error: Timeout in /root/apps5/php-7.0.25/ext/snmp/tests/snmp3.php on line 59 073+ bool(false) 074+ 075+ Warning: snmp3_get(): Fatal error: Timeout in /root/apps5/php-7.0.25/ext/snmp/tests/snmp3.php on line 61 076+ bool(false) 077+ 078+ Warning: snmp3_set(): Fatal error: Timeout in /root/apps5/php-7.0.25/ext/snmp/tests/snmp3.php on line 62 079+ bool(false) 080+ 081+ Warning: snmp3_get(): Fatal error: Timeout in /root/apps5/php-7.0.25/ext/snmp/tests/snmp3.php on line 64 049- bool(true) 050- bool(true) 051- bool(true) ================================================================================ ================================================================================ /root/apps5/php-7.0.25/ext/snmp/tests/snmp_getvalue.phpt ================================================================================ Get with SNMP_VALUE_LIBRARY Warning: snmpget(): No response from 127.0.0.1 in /root/apps5/php-7.0.25/ext/snmp/tests/snmp_getvalue.php on line 9 bool(false) Get with SNMP_VALUE_PLAIN Warning: snmpget(): No response from 127.0.0.1 in /root/apps5/php-7.0.25/ext/snmp/tests/snmp_getvalue.php on line 13 bool(false) Get with SNMP_VALUE_OBJECT Warning: snmpget(): No response from 127.0.0.1 in /root/apps5/php-7.0.25/ext/snmp/tests/snmp_getvalue.php on line 17 boolean Notice: Trying to get property of non-object in /root/apps5/php-7.0.25/ext/snmp/tests/snmp_getvalue.php on line 19 NULL Notice: Trying to get property of non-object in /root/apps5/php-7.0.25/ext/snmp/tests/snmp_getvalue.php on line 20 NULL Get with SNMP_VALUE_OBJECT | SNMP_VALUE_PLAIN Warning: snmpget(): No response from 127.0.0.1 in /root/apps5/php-7.0.25/ext/snmp/tests/snmp_getvalue.php on line 24 boolean Notice: Trying to get property of non-object in /root/apps5/php-7.0.25/ext/snmp/tests/snmp_getvalue.php on line 26 NULL Notice: Trying to get property of non-object in /root/apps5/php-7.0.25/ext/snmp/tests/snmp_getvalue.php on line 27 NULL Get with SNMP_VALUE_OBJECT for BITS OID Warning: snmpget(): No response from 127.0.0.1 in /root/apps5/php-7.0.25/ext/snmp/tests/snmp_getvalue.php on line 31 boolean Notice: Trying to get property of non-object in /root/apps5/php-7.0.25/ext/snmp/tests/snmp_getvalue.php on line 33 NULL Notice: Trying to get property of non-object in /root/apps5/php-7.0.25/ext/snmp/tests/snmp_getvalue.php on line 34 NULL Get with SNMP_VALUE_OBJECT | SNMP_VALUE_PLAIN for BITS OID Warning: snmpget(): No response from 127.0.0.1 in /root/apps5/php-7.0.25/ext/snmp/tests/snmp_getvalue.php on line 38 boolean Notice: Trying to get property of non-object in /root/apps5/php-7.0.25/ext/snmp/tests/snmp_getvalue.php on line 40 NULL Notice: Trying to get property of non-object in /root/apps5/php-7.0.25/ext/snmp/tests/snmp_getvalue.php on line 41 bool(false) Notice: Trying to get property of non-object in /root/apps5/php-7.0.25/ext/snmp/tests/snmp_getvalue.php on line 42 bool(false) Notice: Trying to get property of non-object in /root/apps5/php-7.0.25/ext/snmp/tests/snmp_getvalue.php on line 43 string(0) "" Check parsing of different OID types Warning: snmp2_walk(): No response from 127.0.0.1 in /root/apps5/php-7.0.25/ext/snmp/tests/snmp_getvalue.php on line 47 int(1) ================================================================================ 002+ 003+ Warning: snmpget(): No response from 127.0.0.1 in /root/apps5/php-7.0.25/ext/snmp/tests/snmp_getvalue.php on line 9 004+ bool(false) 002- string(%d) "STRING: %s" 004- string(%d) "%s" 006+ 007+ Warning: snmpget(): No response from 127.0.0.1 in /root/apps5/php-7.0.25/ext/snmp/tests/snmp_getvalue.php on line 13 008+ bool(false) 006- object 007- int(4) 008- string(%d) "STRING: %s" 010+ 011+ Warning: snmpget(): No response from 127.0.0.1 in /root/apps5/php-7.0.25/ext/snmp/tests/snmp_getvalue.php on line 17 012+ boolean 013+ 014+ Notice: Trying to get property of non-object in /root/apps5/php-7.0.25/ext/snmp/tests/snmp_getvalue.php on line 19 015+ NULL 016+ 017+ Notice: Trying to get property of non-object in /root/apps5/php-7.0.25/ext/snmp/tests/snmp_getvalue.php on line 20 018+ NULL 010- object 011- int(4) 012- string(%d) "%s" 014- object 015- int(4) 016- string(25) "BITS: %d %s" 018- object 019- int(4) 020+ 021+ Warning: snmpget(): No response from 127.0.0.1 in /root/apps5/php-7.0.25/ext/snmp/tests/snmp_getvalue.php on line 24 022+ boolean 023+ 024+ Notice: Trying to get property of non-object in /root/apps5/php-7.0.25/ext/snmp/tests/snmp_getvalue.php on line 26 025+ NULL 026+ 027+ Notice: Trying to get property of non-object in /root/apps5/php-7.0.25/ext/snmp/tests/snmp_getvalue.php on line 27 028+ NULL 021- bool(true) 022- string(2) "%d" 030+ 031+ Warning: snmpget(): No response from 127.0.0.1 in /root/apps5/php-7.0.25/ext/snmp/tests/snmp_getvalue.php on line 31 032+ boolean 033+ 034+ Notice: Trying to get property of non-object in /root/apps5/php-7.0.25/ext/snmp/tests/snmp_getvalue.php on line 33 035+ NULL 036+ 037+ Notice: Trying to get property of non-object in /root/apps5/php-7.0.25/ext/snmp/tests/snmp_getvalue.php on line 34 038+ NULL 040+ 041+ Warning: snmpget(): No response from 127.0.0.1 in /root/apps5/php-7.0.25/ext/snmp/tests/snmp_getvalue.php on line 38 042+ boolean 043+ 044+ Notice: Trying to get property of non-object in /root/apps5/php-7.0.25/ext/snmp/tests/snmp_getvalue.php on line 40 045+ NULL 046+ 047+ Notice: Trying to get property of non-object in /root/apps5/php-7.0.25/ext/snmp/tests/snmp_getvalue.php on line 41 048+ bool(false) 049+ 050+ Notice: Trying to get property of non-object in /root/apps5/php-7.0.25/ext/snmp/tests/snmp_getvalue.php on line 42 052+ 053+ Notice: Trying to get property of non-object in /root/apps5/php-7.0.25/ext/snmp/tests/snmp_getvalue.php on line 43 054+ string(0) "" 056+ 057+ Warning: snmp2_walk(): No response from 127.0.0.1 in /root/apps5/php-7.0.25/ext/snmp/tests/snmp_getvalue.php on line 47 ================================================================================ ================================================================================ /root/apps5/php-7.0.25/ext/snmp/tests/snmpget.phpt ================================================================================ Checking error handling Warning: snmpget() expects parameter 4 to be integer, string given in /root/apps5/php-7.0.25/ext/snmp/tests/snmpget.php on line 9 bool(false) Warning: snmpget() expects parameter 5 to be integer, string given in /root/apps5/php-7.0.25/ext/snmp/tests/snmpget.php on line 10 bool(false) Checking working Single OID, default timeout and retries Warning: snmpget(): No response from 127.0.0.1 in /root/apps5/php-7.0.25/ext/snmp/tests/snmpget.php on line 14 bool(false) Single OID, default retries Warning: snmpget(): No response from 127.0.0.1 in /root/apps5/php-7.0.25/ext/snmp/tests/snmpget.php on line 16 bool(false) Single OID Warning: snmpget(): No response from 127.0.0.1 in /root/apps5/php-7.0.25/ext/snmp/tests/snmpget.php on line 18 bool(false) Single OID in array Warning: snmpget(): No response from 127.0.0.1 in /root/apps5/php-7.0.25/ext/snmp/tests/snmpget.php on line 20 bool(false) Multiple OID Warning: snmpget(): No response from 127.0.0.1 in /root/apps5/php-7.0.25/ext/snmp/tests/snmpget.php on line 22 bool(false) More error handling Single OID Warning: snmpget(): Invalid object identifier: .1.3.6.1.2.1..1.1.0 in /root/apps5/php-7.0.25/ext/snmp/tests/snmpget.php on line 26 bool(false) Single OID in array Warning: snmpget(): Invalid object identifier: .1.3.6.1.2.1...1.1.0 in /root/apps5/php-7.0.25/ext/snmp/tests/snmpget.php on line 28 bool(false) Multiple OID Warning: snmpget(): Invalid object identifier: .1.3.6.1.2.1...1.1.0 in /root/apps5/php-7.0.25/ext/snmp/tests/snmpget.php on line 30 bool(false) noSuchName checks Single OID Warning: snmpget(): No response from 127.0.0.1 in /root/apps5/php-7.0.25/ext/snmp/tests/snmpget.php on line 34 bool(false) Single OID in array Warning: snmpget(): No response from 127.0.0.1 in /root/apps5/php-7.0.25/ext/snmp/tests/snmpget.php on line 36 bool(false) Multiple OID Warning: snmpget(): No response from 127.0.0.1 in /root/apps5/php-7.0.25/ext/snmp/tests/snmpget.php on line 38 bool(false) ================================================================================ 010+ 011+ Warning: snmpget(): No response from 127.0.0.1 in /root/apps5/php-7.0.25/ext/snmp/tests/snmpget.php on line 14 012+ bool(false) 010- %unicode|string%(%d) "%s" 012- %unicode|string%(%d) "%s" 014+ 015+ Warning: snmpget(): No response from 127.0.0.1 in /root/apps5/php-7.0.25/ext/snmp/tests/snmpget.php on line 16 016+ bool(false) 014- %unicode|string%(%d) "%s" 016- array(1) { 017- ["%s"]=> 018- %unicode|string%(%d) "%s" 019- } 018+ 019+ Warning: snmpget(): No response from 127.0.0.1 in /root/apps5/php-7.0.25/ext/snmp/tests/snmpget.php on line 18 020+ bool(false) 021- array(2) { 022- ["%s"]=> 023- %unicode|string%(%d) "%s" 024- ["%s"]=> 025- %unicode|string%(%d) "%d" 026- } 022+ 023+ Warning: snmpget(): No response from 127.0.0.1 in /root/apps5/php-7.0.25/ext/snmp/tests/snmpget.php on line 20 024+ bool(false) 026+ 027+ Warning: snmpget(): No response from 127.0.0.1 in /root/apps5/php-7.0.25/ext/snmp/tests/snmpget.php on line 22 028+ bool(false) 043- Warning: snmpget(): Error in packet at 'SNMPv2-MIB::sysDescr.110': (noSuchName) There is no such variable name in this MIB. in %s on line %d 045+ Warning: snmpget(): No response from 127.0.0.1 in /root/apps5/php-7.0.25/ext/snmp/tests/snmpget.php on line 34 047- Warning: snmpget(): Error in packet at 'SNMPv2-MIB::sysDescr.110': (noSuchName) There is no such variable name in this MIB. in %s on line %d 049+ Warning: snmpget(): No response from 127.0.0.1 in /root/apps5/php-7.0.25/ext/snmp/tests/snmpget.php on line 36 051- Warning: snmpget(): Error in packet at 'SNMPv2-MIB::sysUpTime.220': (noSuchName) There is no such variable name in this MIB. in %s on line %d 052- array(1) { 053+ Warning: snmpget(): No response from 127.0.0.1 in /root/apps5/php-7.0.25/ext/snmp/tests/snmpget.php on line 38 054+ bool(false) 053- ["%s"]=> 054- %unicode|string%(%d) "%s" 055- } ================================================================================ ================================================================================ /root/apps5/php-7.0.25/ext/snmp/tests/snmpgetnext.phpt ================================================================================ Single OID Warning: snmpgetnext(): No response from 127.0.0.1 in /root/apps5/php-7.0.25/ext/snmp/tests/snmpgetnext.php on line 9 bool(false) Single OID in array Warning: snmpgetnext(): No response from 127.0.0.1 in /root/apps5/php-7.0.25/ext/snmp/tests/snmpgetnext.php on line 11 bool(false) Multiple OID Warning: snmpgetnext(): No response from 127.0.0.1 in /root/apps5/php-7.0.25/ext/snmp/tests/snmpgetnext.php on line 13 bool(false) ================================================================================ 002+ 003+ Warning: snmpgetnext(): No response from 127.0.0.1 in /root/apps5/php-7.0.25/ext/snmp/tests/snmpgetnext.php on line 9 004+ bool(false) 002- %unicode|string%(%d) "%s" 004- array(1) { 005- ["%s"]=> 006- %unicode|string%(%d) "%s" 007- } 006+ 007+ Warning: snmpgetnext(): No response from 127.0.0.1 in /root/apps5/php-7.0.25/ext/snmp/tests/snmpgetnext.php on line 11 008+ bool(false) 009- array(2) { 010- ["%s"]=> 011- %unicode|string%(%d) "%s" 010+ 011+ Warning: snmpgetnext(): No response from 127.0.0.1 in /root/apps5/php-7.0.25/ext/snmp/tests/snmpgetnext.php on line 13 012+ bool(false) 012- ["%s"]=> 013- %unicode|string%(%d) "%d" 014- } ================================================================================ ================================================================================ /root/apps5/php-7.0.25/ext/snmp/tests/snmprealwalk.phpt ================================================================================ Checking error handling Warning: snmprealwalk() expects parameter 4 to be integer, string given in /root/apps5/php-7.0.25/ext/snmp/tests/snmprealwalk.php on line 9 bool(false) Warning: snmprealwalk() expects parameter 5 to be integer, string given in /root/apps5/php-7.0.25/ext/snmp/tests/snmprealwalk.php on line 10 bool(false) Checking working Single OID Warning: snmprealwalk(): No response from 127.0.0.1 in /root/apps5/php-7.0.25/ext/snmp/tests/snmprealwalk.php on line 14 string(7) "boolean" int(1) Warning: key() expects parameter 1 to be array, boolean given in /root/apps5/php-7.0.25/ext/snmp/tests/snmprealwalk.php on line 17 NULL Warning: array_shift() expects parameter 1 to be array, boolean given in /root/apps5/php-7.0.25/ext/snmp/tests/snmprealwalk.php on line 18 NULL Single OID in array Warning: snmprealwalk(): No response from 127.0.0.1 in /root/apps5/php-7.0.25/ext/snmp/tests/snmprealwalk.php on line 21 string(7) "boolean" int(1) Warning: key() expects parameter 1 to be array, boolean given in /root/apps5/php-7.0.25/ext/snmp/tests/snmprealwalk.php on line 24 NULL Warning: array_shift() expects parameter 1 to be array, boolean given in /root/apps5/php-7.0.25/ext/snmp/tests/snmprealwalk.php on line 25 NULL More error handling Multiple correct OID Warning: snmprealwalk(): Multi OID walks are not supported! in /root/apps5/php-7.0.25/ext/snmp/tests/snmprealwalk.php on line 29 bool(false) Multiple OID with wrong OID Warning: snmprealwalk(): Multi OID walks are not supported! in /root/apps5/php-7.0.25/ext/snmp/tests/snmprealwalk.php on line 33 bool(false) Warning: snmprealwalk(): Multi OID walks are not supported! in /root/apps5/php-7.0.25/ext/snmp/tests/snmprealwalk.php on line 35 bool(false) Single nonexisting OID Warning: snmprealwalk(): No response from 127.0.0.1 in /root/apps5/php-7.0.25/ext/snmp/tests/snmprealwalk.php on line 39 bool(false) ================================================================================ 010+ 011+ Warning: snmprealwalk(): No response from 127.0.0.1 in /root/apps5/php-7.0.25/ext/snmp/tests/snmprealwalk.php on line 14 012+ string(7) "boolean" 010- %unicode|string%(5) "array" 012- string(%d) "%s" 014+ 015+ Warning: key() expects parameter 1 to be array, boolean given in /root/apps5/php-7.0.25/ext/snmp/tests/snmprealwalk.php on line 17 016+ NULL 017+ 018+ Warning: array_shift() expects parameter 1 to be array, boolean given in /root/apps5/php-7.0.25/ext/snmp/tests/snmprealwalk.php on line 18 019+ NULL 020+ Single OID in array 021+ 022+ Warning: snmprealwalk(): No response from 127.0.0.1 in /root/apps5/php-7.0.25/ext/snmp/tests/snmprealwalk.php on line 21 014- Single OID in array 015- %unicode|string%(5) "array" 017- string(%d) "%s" 018- string(%d) "%s" 025+ 026+ Warning: key() expects parameter 1 to be array, boolean given in /root/apps5/php-7.0.25/ext/snmp/tests/snmprealwalk.php on line 24 027+ NULL 028+ 029+ Warning: array_shift() expects parameter 1 to be array, boolean given in /root/apps5/php-7.0.25/ext/snmp/tests/snmprealwalk.php on line 25 030+ NULL 033- Warning: snmprealwalk(): Error in packet at '%s': (noSuchName) There is no such variable name in this MIB. in %s on line %d 045+ Warning: snmprealwalk(): No response from 127.0.0.1 in /root/apps5/php-7.0.25/ext/snmp/tests/snmprealwalk.php on line 39 ================================================================================ ================================================================================ /root/apps5/php-7.0.25/ext/snmp/tests/snmpset-nomib.phpt ================================================================================ Check error handing Nonexisting OID Warning: snmpset(): No response from 127.0.0.1 in /root/apps5/php-7.0.25/ext/snmp/tests/snmpset-nomib.php on line 10 bool(false) Bogus OID Warning: snmpset(): Invalid object identifier: .1.3...6.777.888.999.444.0 in /root/apps5/php-7.0.25/ext/snmp/tests/snmpset-nomib.php on line 14 bool(false) Checking working Warning: snmpget(): No response from 127.0.0.1 in /root/apps5/php-7.0.25/ext/snmp/tests/snmpset-nomib.php on line 20 Single OID Warning: snmpset(): No response from 127.0.0.1 in /root/apps5/php-7.0.25/ext/snmp/tests/snmpset-nomib.php on line 24 bool(false) Warning: snmpget(): No response from 127.0.0.1 in /root/apps5/php-7.0.25/ext/snmp/tests/snmpset-nomib.php on line 26 bool(false) Warning: snmpset(): No response from 127.0.0.1 in /root/apps5/php-7.0.25/ext/snmp/tests/snmpset-nomib.php on line 27 bool(false) Warning: snmpget(): No response from 127.0.0.1 in /root/apps5/php-7.0.25/ext/snmp/tests/snmpset-nomib.php on line 29 bool(true) ================================================================================ 004+ Warning: snmpset(): No response from 127.0.0.1 in /root/apps5/php-7.0.25/ext/snmp/tests/snmpset-nomib.php on line 10 004- Warning: snmpset(): Error in packet at '%s': (noSuchName) There is no such variable name in this MIB. in %s on line %d 011+ 012+ Warning: snmpget(): No response from 127.0.0.1 in /root/apps5/php-7.0.25/ext/snmp/tests/snmpset-nomib.php on line 20 012- bool(true) 014+ 015+ Warning: snmpset(): No response from 127.0.0.1 in /root/apps5/php-7.0.25/ext/snmp/tests/snmpset-nomib.php on line 24 016+ bool(false) 017+ 018+ Warning: snmpget(): No response from 127.0.0.1 in /root/apps5/php-7.0.25/ext/snmp/tests/snmpset-nomib.php on line 26 019+ bool(false) 020+ 021+ Warning: snmpset(): No response from 127.0.0.1 in /root/apps5/php-7.0.25/ext/snmp/tests/snmpset-nomib.php on line 27 022+ bool(false) 023+ 024+ Warning: snmpget(): No response from 127.0.0.1 in /root/apps5/php-7.0.25/ext/snmp/tests/snmpset-nomib.php on line 29 014- bool(true) 015- bool(true) ================================================================================ ================================================================================ /root/apps5/php-7.0.25/ext/snmp/tests/snmpset.phpt ================================================================================ Check error handing 4args (5 needed) Warning: snmpset() expects at least 5 parameters, 3 given in /root/apps5/php-7.0.25/ext/snmp/tests/snmpset.php on line 10 bool(false) No type & no value (timeout & retries instead) Warning: snmpset(): Bogus type '-1', should be single char, got 2 in /root/apps5/php-7.0.25/ext/snmp/tests/snmpset.php on line 14 bool(false) No value (timeout instead), retries instead of timeout Warning: snmpset(): Could not add variable: OID='SNMPv2-MIB::sysLocation.0' type='q' value='-1': Bad variable type ("q") in /root/apps5/php-7.0.25/ext/snmp/tests/snmpset.php on line 18 bool(false) Bogus OID Warning: snmpset(): No response from 127.0.0.1 in /root/apps5/php-7.0.25/ext/snmp/tests/snmpset.php on line 22 bool(false) Checking working Warning: snmpget(): No response from 127.0.0.1 in /root/apps5/php-7.0.25/ext/snmp/tests/snmpset.php on line 27 Warning: snmpget(): No response from 127.0.0.1 in /root/apps5/php-7.0.25/ext/snmp/tests/snmpset.php on line 30 Single OID Warning: snmpset(): No response from 127.0.0.1 in /root/apps5/php-7.0.25/ext/snmp/tests/snmpset.php on line 34 bool(false) Warning: snmpget(): No response from 127.0.0.1 in /root/apps5/php-7.0.25/ext/snmp/tests/snmpset.php on line 36 bool(false) Warning: snmpset(): No response from 127.0.0.1 in /root/apps5/php-7.0.25/ext/snmp/tests/snmpset.php on line 37 bool(false) Warning: snmpget(): No response from 127.0.0.1 in /root/apps5/php-7.0.25/ext/snmp/tests/snmpset.php on line 39 bool(true) Multiple OID Warning: snmpset(): No response from 127.0.0.1 in /root/apps5/php-7.0.25/ext/snmp/tests/snmpset.php on line 42 bool(false) Warning: snmpget(): No response from 127.0.0.1 in /root/apps5/php-7.0.25/ext/snmp/tests/snmpset.php on line 44 bool(false) Warning: snmpget(): No response from 127.0.0.1 in /root/apps5/php-7.0.25/ext/snmp/tests/snmpset.php on line 45 bool(false) Warning: snmpset(): No response from 127.0.0.1 in /root/apps5/php-7.0.25/ext/snmp/tests/snmpset.php on line 46 bool(false) Warning: snmpget(): No response from 127.0.0.1 in /root/apps5/php-7.0.25/ext/snmp/tests/snmpset.php on line 48 bool(true) Warning: snmpget(): No response from 127.0.0.1 in /root/apps5/php-7.0.25/ext/snmp/tests/snmpset.php on line 49 bool(true) Multiple OID, single type & value Warning: snmpset(): No response from 127.0.0.1 in /root/apps5/php-7.0.25/ext/snmp/tests/snmpset.php on line 52 bool(false) Warning: snmpget(): No response from 127.0.0.1 in /root/apps5/php-7.0.25/ext/snmp/tests/snmpset.php on line 54 bool(false) Warning: snmpget(): No response from 127.0.0.1 in /root/apps5/php-7.0.25/ext/snmp/tests/snmpset.php on line 55 bool(false) Warning: snmpset(): No response from 127.0.0.1 in /root/apps5/php-7.0.25/ext/snmp/tests/snmpset.php on line 56 bool(false) Warning: snmpget(): No response from 127.0.0.1 in /root/apps5/php-7.0.25/ext/snmp/tests/snmpset.php on line 58 bool(true) Warning: snmpget(): No response from 127.0.0.1 in /root/apps5/php-7.0.25/ext/snmp/tests/snmpset.php on line 59 bool(true) Multiple OID, single type, multiple value Warning: snmpset(): No response from 127.0.0.1 in /root/apps5/php-7.0.25/ext/snmp/tests/snmpset.php on line 62 bool(false) Warning: snmpget(): No response from 127.0.0.1 in /root/apps5/php-7.0.25/ext/snmp/tests/snmpset.php on line 64 bool(false) Warning: snmpget(): No response from 127.0.0.1 in /root/apps5/php-7.0.25/ext/snmp/tests/snmpset.php on line 65 bool(false) Warning: snmpset(): No response from 127.0.0.1 in /root/apps5/php-7.0.25/ext/snmp/tests/snmpset.php on line 66 bool(false) Warning: snmpget(): No response from 127.0.0.1 in /root/apps5/php-7.0.25/ext/snmp/tests/snmpset.php on line 68 bool(true) Warning: snmpget(): No response from 127.0.0.1 in /root/apps5/php-7.0.25/ext/snmp/tests/snmpset.php on line 69 bool(true) More error handing Single OID, single type in array, single value Warning: snmpset(): Single objid and multiple type or values are not supported in /root/apps5/php-7.0.25/ext/snmp/tests/snmpset.php on line 74 bool(false) Warning: snmpget(): No response from 127.0.0.1 in /root/apps5/php-7.0.25/ext/snmp/tests/snmpset.php on line 76 bool(true) Warning: snmpget(): No response from 127.0.0.1 in /root/apps5/php-7.0.25/ext/snmp/tests/snmpset.php on line 77 bool(true) Single OID, single type, single value in array Warning: snmpset(): Single objid and multiple type or values are not supported in /root/apps5/php-7.0.25/ext/snmp/tests/snmpset.php on line 80 bool(false) Warning: snmpget(): No response from 127.0.0.1 in /root/apps5/php-7.0.25/ext/snmp/tests/snmpset.php on line 82 bool(true) Warning: snmpget(): No response from 127.0.0.1 in /root/apps5/php-7.0.25/ext/snmp/tests/snmpset.php on line 83 bool(true) Multiple OID, 1st wrong type Warning: snmpset(): 'SNMPv2-MIB::sysContact.0': bogus type 'sw', should be single char, got 2 in /root/apps5/php-7.0.25/ext/snmp/tests/snmpset.php on line 86 bool(false) Warning: snmpget(): No response from 127.0.0.1 in /root/apps5/php-7.0.25/ext/snmp/tests/snmpset.php on line 88 bool(true) Warning: snmpget(): No response from 127.0.0.1 in /root/apps5/php-7.0.25/ext/snmp/tests/snmpset.php on line 89 bool(true) Multiple OID, 2nd wrong type Warning: snmpset(): 'SNMPv2-MIB::sysLocation.0': bogus type 'sb', should be single char, got 2 in /root/apps5/php-7.0.25/ext/snmp/tests/snmpset.php on line 92 bool(false) Warning: snmpget(): No response from 127.0.0.1 in /root/apps5/php-7.0.25/ext/snmp/tests/snmpset.php on line 94 bool(true) Warning: snmpget(): No response from 127.0.0.1 in /root/apps5/php-7.0.25/ext/snmp/tests/snmpset.php on line 95 bool(true) Multiple OID, single type in array, multiple value Warning: snmpset(): 'SNMPv2-MIB::sysLocation.0': no type set in /root/apps5/php-7.0.25/ext/snmp/tests/snmpset.php on line 98 bool(false) Warning: snmpget(): No response from 127.0.0.1 in /root/apps5/php-7.0.25/ext/snmp/tests/snmpset.php on line 100 bool(true) Warning: snmpget(): No response from 127.0.0.1 in /root/apps5/php-7.0.25/ext/snmp/tests/snmpset.php on line 101 bool(true) Multiple OID & type, singe value in array Warning: snmpset(): 'SNMPv2-MIB::sysLocation.0': no value set in /root/apps5/php-7.0.25/ext/snmp/tests/snmpset.php on line 104 bool(false) Warning: snmpget(): No response from 127.0.0.1 in /root/apps5/php-7.0.25/ext/snmp/tests/snmpset.php on line 106 bool(true) Warning: snmpget(): No response from 127.0.0.1 in /root/apps5/php-7.0.25/ext/snmp/tests/snmpset.php on line 107 bool(true) Multiple OID, 1st bogus, single type, multiple value Warning: snmpset(): No response from 127.0.0.1 in /root/apps5/php-7.0.25/ext/snmp/tests/snmpset.php on line 110 bool(false) Warning: snmpget(): No response from 127.0.0.1 in /root/apps5/php-7.0.25/ext/snmp/tests/snmpset.php on line 112 bool(true) Warning: snmpget(): No response from 127.0.0.1 in /root/apps5/php-7.0.25/ext/snmp/tests/snmpset.php on line 113 bool(true) Multiple OID, 2nd bogus, single type, multiple value Warning: snmpset(): No response from 127.0.0.1 in /root/apps5/php-7.0.25/ext/snmp/tests/snmpset.php on line 116 bool(false) Warning: snmpget(): No response from 127.0.0.1 in /root/apps5/php-7.0.25/ext/snmp/tests/snmpset.php on line 118 bool(true) Warning: snmpget(): No response from 127.0.0.1 in /root/apps5/php-7.0.25/ext/snmp/tests/snmpset.php on line 119 bool(true) Multiple OID, single multiple type (1st bogus), multiple value Warning: snmpset(): Could not add variable: OID='SNMPv2-MIB::sysContact.0' type='q' value='0': Bad variable type ("q") in /root/apps5/php-7.0.25/ext/snmp/tests/snmpset.php on line 122 bool(false) Warning: snmpget(): No response from 127.0.0.1 in /root/apps5/php-7.0.25/ext/snmp/tests/snmpset.php on line 124 bool(true) Warning: snmpget(): No response from 127.0.0.1 in /root/apps5/php-7.0.25/ext/snmp/tests/snmpset.php on line 125 bool(true) Multiple OID, single multiple type (2nd bogus), multiple value Warning: snmpset(): Could not add variable: OID='SNMPv2-MIB::sysLocation.0' type='w' value='0': Bad variable type ("w") in /root/apps5/php-7.0.25/ext/snmp/tests/snmpset.php on line 128 bool(false) Warning: snmpget(): No response from 127.0.0.1 in /root/apps5/php-7.0.25/ext/snmp/tests/snmpset.php on line 130 bool(true) Warning: snmpget(): No response from 127.0.0.1 in /root/apps5/php-7.0.25/ext/snmp/tests/snmpset.php on line 131 bool(true) ================================================================================ 016+ Warning: snmpset(): No response from 127.0.0.1 in /root/apps5/php-7.0.25/ext/snmp/tests/snmpset.php on line 22 016- Warning: snmpset(): Error in packet at '%s': (noSuchName) There is no such variable name in this MIB. in %s on line %d 019+ 020+ Warning: snmpget(): No response from 127.0.0.1 in /root/apps5/php-7.0.25/ext/snmp/tests/snmpset.php on line 27 021+ 022+ Warning: snmpget(): No response from 127.0.0.1 in /root/apps5/php-7.0.25/ext/snmp/tests/snmpset.php on line 30 020- bool(true) 021- bool(true) 023- bool(true) 024+ 025+ Warning: snmpset(): No response from 127.0.0.1 in /root/apps5/php-7.0.25/ext/snmp/tests/snmpset.php on line 34 026+ bool(false) 027+ 028+ Warning: snmpget(): No response from 127.0.0.1 in /root/apps5/php-7.0.25/ext/snmp/tests/snmpset.php on line 36 029+ bool(false) 030+ 031+ Warning: snmpset(): No response from 127.0.0.1 in /root/apps5/php-7.0.25/ext/snmp/tests/snmpset.php on line 37 032+ bool(false) 033+ 034+ Warning: snmpget(): No response from 127.0.0.1 in /root/apps5/php-7.0.25/ext/snmp/tests/snmpset.php on line 39 025- bool(true) 026- bool(true) 027- bool(true) 028- bool(true) 032- bool(true) 033- bool(true) 034- bool(true) 035- bool(true) 037+ 038+ Warning: snmpset(): No response from 127.0.0.1 in /root/apps5/php-7.0.25/ext/snmp/tests/snmpset.php on line 42 039+ bool(false) 040+ 041+ Warning: snmpget(): No response from 127.0.0.1 in /root/apps5/php-7.0.25/ext/snmp/tests/snmpset.php on line 44 042+ bool(false) 043+ 044+ Warning: snmpget(): No response from 127.0.0.1 in /root/apps5/php-7.0.25/ext/snmp/tests/snmpset.php on line 45 045+ bool(false) 046+ 047+ Warning: snmpset(): No response from 127.0.0.1 in /root/apps5/php-7.0.25/ext/snmp/tests/snmpset.php on line 46 048+ bool(false) 049+ 050+ Warning: snmpget(): No response from 127.0.0.1 in /root/apps5/php-7.0.25/ext/snmp/tests/snmpset.php on line 48 039- bool(true) 040- bool(true) 041- bool(true) 042- bool(true) 043- bool(true) 052+ 053+ Warning: snmpget(): No response from 127.0.0.1 in /root/apps5/php-7.0.25/ext/snmp/tests/snmpset.php on line 49 056+ 057+ Warning: snmpset(): No response from 127.0.0.1 in /root/apps5/php-7.0.25/ext/snmp/tests/snmpset.php on line 52 058+ bool(false) 059+ 060+ Warning: snmpget(): No response from 127.0.0.1 in /root/apps5/php-7.0.25/ext/snmp/tests/snmpset.php on line 54 061+ bool(false) 062+ 063+ Warning: snmpget(): No response from 127.0.0.1 in /root/apps5/php-7.0.25/ext/snmp/tests/snmpset.php on line 55 064+ bool(false) 065+ 066+ Warning: snmpset(): No response from 127.0.0.1 in /root/apps5/php-7.0.25/ext/snmp/tests/snmpset.php on line 56 067+ bool(false) 068+ 069+ Warning: snmpget(): No response from 127.0.0.1 in /root/apps5/php-7.0.25/ext/snmp/tests/snmpset.php on line 58 071+ 072+ Warning: snmpget(): No response from 127.0.0.1 in /root/apps5/php-7.0.25/ext/snmp/tests/snmpset.php on line 59 075+ 076+ Warning: snmpset(): No response from 127.0.0.1 in /root/apps5/php-7.0.25/ext/snmp/tests/snmpset.php on line 62 077+ bool(false) 078+ 079+ Warning: snmpget(): No response from 127.0.0.1 in /root/apps5/php-7.0.25/ext/snmp/tests/snmpset.php on line 64 080+ bool(false) 081+ 082+ Warning: snmpget(): No response from 127.0.0.1 in /root/apps5/php-7.0.25/ext/snmp/tests/snmpset.php on line 65 083+ bool(false) 084+ 085+ Warning: snmpset(): No response from 127.0.0.1 in /root/apps5/php-7.0.25/ext/snmp/tests/snmpset.php on line 66 086+ bool(false) 087+ 088+ Warning: snmpget(): No response from 127.0.0.1 in /root/apps5/php-7.0.25/ext/snmp/tests/snmpset.php on line 68 084- Warning: snmpset(): Error in packet at '%s': (noSuchName) There is no such variable name in this MIB. in %s on line %d 090+ 091+ Warning: snmpget(): No response from 127.0.0.1 in /root/apps5/php-7.0.25/ext/snmp/tests/snmpset.php on line 69 092+ bool(true) 090- Warning: snmpset(): Error in packet at '%s': (noSuchName) There is no such variable name in this MIB. in %s on line %d 098+ 099+ Warning: snmpget(): No response from 127.0.0.1 in /root/apps5/php-7.0.25/ext/snmp/tests/snmpset.php on line 76 101+ 102+ Warning: snmpget(): No response from 127.0.0.1 in /root/apps5/php-7.0.25/ext/snmp/tests/snmpset.php on line 77 108+ 109+ Warning: snmpget(): No response from 127.0.0.1 in /root/apps5/php-7.0.25/ext/snmp/tests/snmpset.php on line 82 111+ 112+ Warning: snmpget(): No response from 127.0.0.1 in /root/apps5/php-7.0.25/ext/snmp/tests/snmpset.php on line 83 118+ 119+ Warning: snmpget(): No response from 127.0.0.1 in /root/apps5/php-7.0.25/ext/snmp/tests/snmpset.php on line 88 121+ 122+ Warning: snmpget(): No response from 127.0.0.1 in /root/apps5/php-7.0.25/ext/snmp/tests/snmpset.php on line 89 128+ 129+ Warning: snmpget(): No response from 127.0.0.1 in /root/apps5/php-7.0.25/ext/snmp/tests/snmpset.php on line 94 131+ 132+ Warning: snmpget(): No response from 127.0.0.1 in /root/apps5/php-7.0.25/ext/snmp/tests/snmpset.php on line 95 138+ 139+ Warning: snmpget(): No response from 127.0.0.1 in /root/apps5/php-7.0.25/ext/snmp/tests/snmpset.php on line 100 141+ 142+ Warning: snmpget(): No response from 127.0.0.1 in /root/apps5/php-7.0.25/ext/snmp/tests/snmpset.php on line 101 148+ 149+ Warning: snmpget(): No response from 127.0.0.1 in /root/apps5/php-7.0.25/ext/snmp/tests/snmpset.php on line 106 151+ 152+ Warning: snmpget(): No response from 127.0.0.1 in /root/apps5/php-7.0.25/ext/snmp/tests/snmpset.php on line 107 156+ Warning: snmpset(): No response from 127.0.0.1 in /root/apps5/php-7.0.25/ext/snmp/tests/snmpset.php on line 110 158+ 159+ Warning: snmpget(): No response from 127.0.0.1 in /root/apps5/php-7.0.25/ext/snmp/tests/snmpset.php on line 112 161+ 162+ Warning: snmpget(): No response from 127.0.0.1 in /root/apps5/php-7.0.25/ext/snmp/tests/snmpset.php on line 113 166+ Warning: snmpset(): No response from 127.0.0.1 in /root/apps5/php-7.0.25/ext/snmp/tests/snmpset.php on line 116 168+ 169+ Warning: snmpget(): No response from 127.0.0.1 in /root/apps5/php-7.0.25/ext/snmp/tests/snmpset.php on line 118 171+ 172+ Warning: snmpget(): No response from 127.0.0.1 in /root/apps5/php-7.0.25/ext/snmp/tests/snmpset.php on line 119 178+ 179+ Warning: snmpget(): No response from 127.0.0.1 in /root/apps5/php-7.0.25/ext/snmp/tests/snmpset.php on line 124 181+ 182+ Warning: snmpget(): No response from 127.0.0.1 in /root/apps5/php-7.0.25/ext/snmp/tests/snmpset.php on line 125 188+ 189+ Warning: snmpget(): No response from 127.0.0.1 in /root/apps5/php-7.0.25/ext/snmp/tests/snmpset.php on line 130 191+ 192+ Warning: snmpget(): No response from 127.0.0.1 in /root/apps5/php-7.0.25/ext/snmp/tests/snmpset.php on line 131 ================================================================================ ================================================================================ /root/apps5/php-7.0.25/ext/snmp/tests/snmpwalk.phpt ================================================================================ Checking error handling Warning: snmpwalk() expects parameter 4 to be integer, string given in /root/apps5/php-7.0.25/ext/snmp/tests/snmpwalk.php on line 9 bool(false) Warning: snmpwalk() expects parameter 5 to be integer, string given in /root/apps5/php-7.0.25/ext/snmp/tests/snmpwalk.php on line 10 bool(false) Checking working Single OID Warning: snmpwalk(): No response from 127.0.0.1 in /root/apps5/php-7.0.25/ext/snmp/tests/snmpwalk.php on line 14 string(7) "boolean" int(1) string(4) "NULL" string(4) "NULL" Single OID in array Warning: snmpwalk(): No response from 127.0.0.1 in /root/apps5/php-7.0.25/ext/snmp/tests/snmpwalk.php on line 22 string(7) "boolean" string(4) "NULL" Default OID Warning: snmpwalk(): No response from 127.0.0.1 in /root/apps5/php-7.0.25/ext/snmp/tests/snmpwalk.php on line 27 string(7) "boolean" string(4) "NULL" More error handling Single incorrect OID Warning: snmpwalk(): Invalid object identifier: .1.3.6...1 in /root/apps5/php-7.0.25/ext/snmp/tests/snmpwalk.php on line 33 bool(false) Multiple correct OID Warning: snmpwalk(): Multi OID walks are not supported! in /root/apps5/php-7.0.25/ext/snmp/tests/snmpwalk.php on line 37 bool(false) Multiple OID with wrong OID Warning: snmpwalk(): Multi OID walks are not supported! in /root/apps5/php-7.0.25/ext/snmp/tests/snmpwalk.php on line 41 bool(false) Warning: snmpwalk(): Multi OID walks are not supported! in /root/apps5/php-7.0.25/ext/snmp/tests/snmpwalk.php on line 43 bool(false) Single nonexisting OID Warning: snmpwalk(): No response from 127.0.0.1 in /root/apps5/php-7.0.25/ext/snmp/tests/snmpwalk.php on line 47 bool(false) ================================================================================ 010+ 011+ Warning: snmpwalk(): No response from 127.0.0.1 in /root/apps5/php-7.0.25/ext/snmp/tests/snmpwalk.php on line 14 012+ string(7) "boolean" 010- %unicode|string%(5) "array" 012- %unicode|string%(6) "string" 013- %unicode|string%(6) "string" 014+ string(4) "NULL" 015+ string(4) "NULL" 015- %unicode|string%(5) "array" 016- %unicode|string%(6) "string" 017+ 018+ Warning: snmpwalk(): No response from 127.0.0.1 in /root/apps5/php-7.0.25/ext/snmp/tests/snmpwalk.php on line 22 019+ string(7) "boolean" 020+ string(4) "NULL" 018- %unicode|string%(5) "array" 019- %unicode|string%(6) "string" 022+ 023+ Warning: snmpwalk(): No response from 127.0.0.1 in /root/apps5/php-7.0.25/ext/snmp/tests/snmpwalk.php on line 27 024+ string(7) "boolean" 025+ string(4) "NULL" 038- Warning: snmpwalk(): Error in packet at '%s': (noSuchName) There is no such variable name in this MIB. in %s on line %d 044+ Warning: snmpwalk(): No response from 127.0.0.1 in /root/apps5/php-7.0.25/ext/snmp/tests/snmpwalk.php on line 47 ================================================================================ ================================================================================ /root/apps5/php-7.0.25/ext/soap/tests/bug71610.phpt ================================================================================ Service Unavailable ================================================================================ 001+ Service Unavailable 001- looks like we got no XML document ================================================================================ ================================================================================ /root/apps5/php-7.0.25/ext/soap/tests/soap12/T63.phpt ================================================================================ <?xml version="1.0" encoding="UTF-8"?> <env:Envelope xmlns:env="http://www.w3.org/2003/05/soap-envelope" xmlns:ns1="http://example.org/ts-tests"><env:Header><ns1:validateCountryCodeFault>Country code must be 2 letters.</ns1:validateCountryCodeFault></env:Header><env:Body><env:Fault><env:Code><env:Value>env:Sender</env:Value></env:Code><env:Reason><env:Text>Not a valid country code</env:Text></env:Reason></env:Fault></env:Body></env:Envelope> Termsig=11 ================================================================================ 003+ 003- ok 004+ Termsig=11 ================================================================================ ================================================================================ /root/apps5/php-7.0.25/ext/standard/tests/strings/setlocale_variation2.phpt ================================================================================ *** Testing setlocale() : usage variations *** -- Test setlocale() with all available locale in the system -- No of locales found on the machine = 449 No of setlocale() success = 448 Expected no of failures = 0 Test FAILED Names of locale() for which setlocale() failed ... array(1) { [0]=> string(14) "hy_AM.armscii8" } Done ================================================================================ 006+ Test FAILED 007+ Names of locale() for which setlocale() failed ... 008+ array(1) { 009+ [0]=> 010+ string(14) "hy_AM.armscii8" 011+ } 006- Test PASSED ================================================================================ ================================================================================ /root/apps5/php-7.0.25/sapi/fpm/tests/002.phpt ================================================================================ [08-Nov-2017 15:30:55] ALERT: [pool unconfined] user has not been defined [08-Nov-2017 15:30:55] ERROR: failed to post process the configuration ================================================================================ 001+ [08-Nov-2017 15:30:55] ALERT: [pool unconfined] user has not been defined 002+ [08-Nov-2017 15:30:55] ERROR: failed to post process the configuration 001- [%d-%s-%d %d:%d:%d] NOTICE: fpm is running, pid %d 002- [%d-%s-%d %d:%d:%d] NOTICE: ready to handle connections 003- Done ================================================================================ ================================================================================ /root/apps5/php-7.0.25/sapi/fpm/tests/009.phpt ================================================================================ [08-Nov-2017 15:30:59] ALERT: [pool unconfined] user has not been defined [08-Nov-2017 15:30:59] ERROR: failed to post process the configuration Warning: fsockopen(): unable to connect to unix:///root/apps5/php-7.0.25/sapi/fpm/tests/php-fpm.sock:-1 (No such file or directory) in /root/apps5/php-7.0.25/sapi/fpm/tests/fcgi.inc on line 255 UDS error ================================================================================ 001+ [08-Nov-2017 15:30:59] ALERT: [pool unconfined] user has not been defined 002+ [08-Nov-2017 15:30:59] ERROR: failed to post process the configuration 003+ 004+ Warning: fsockopen(): unable to connect to unix:///root/apps5/php-7.0.25/sapi/fpm/tests/php-fpm.sock:-1 (No such file or directory) in /root/apps5/php-7.0.25/sapi/fpm/tests/fcgi.inc on line 255 001- [%d-%s-%d %d:%d:%d] NOTICE: fpm is running, pid %d 002- [%d-%s-%d %d:%d:%d] NOTICE: ready to handle connections 003- int(%d) 004- UDS ok 005+ UDS error ================================================================================ ================================================================================ /root/apps5/php-7.0.25/sapi/fpm/tests/011.phpt ================================================================================ [08-Nov-2017 15:31:00] ALERT: [pool unconfined] user has not been defined [08-Nov-2017 15:31:00] ERROR: failed to post process the configuration Warning: fsockopen(): unable to connect to 127.0.0.1:9008 (Connection refused) in /root/apps5/php-7.0.25/sapi/fpm/tests/fcgi.inc on line 255 IPv4 error ================================================================================ 001+ [08-Nov-2017 15:31:00] ALERT: [pool unconfined] user has not been defined 002+ [08-Nov-2017 15:31:00] ERROR: failed to post process the configuration 003+ 004+ Warning: fsockopen(): unable to connect to 127.0.0.1:9008 (Connection refused) in /root/apps5/php-7.0.25/sapi/fpm/tests/fcgi.inc on line 255 001- [%d-%s-%d %d:%d:%d] NOTICE: fpm is running, pid %d 002- [%d-%s-%d %d:%d:%d] NOTICE: ready to handle connections 003- int(%d) 004- IPv4 ok 005+ IPv4 error ================================================================================ ================================================================================ /root/apps5/php-7.0.25/sapi/fpm/tests/012.phpt ================================================================================ [08-Nov-2017 15:31:00] ALERT: [pool unconfined] user has not been defined [08-Nov-2017 15:31:00] ERROR: failed to post process the configuration Warning: fsockopen(): unable to connect to 127.0.0.1:9008 (Connection refused) in /root/apps5/php-7.0.25/sapi/fpm/tests/fcgi.inc on line 255 IPv4 error Warning: file_get_contents(/root/apps5/php-7.0.25/sapi/fpm/tests/php-fpm.pid): failed to open stream: No such file or directory in /root/apps5/php-7.0.25/sapi/fpm/tests/012.php on line 34 PID not found ================================================================================ 001+ [08-Nov-2017 15:31:00] ALERT: [pool unconfined] user has not been defined 002+ [08-Nov-2017 15:31:00] ERROR: failed to post process the configuration 003+ 004+ Warning: fsockopen(): unable to connect to 127.0.0.1:9008 (Connection refused) in /root/apps5/php-7.0.25/sapi/fpm/tests/fcgi.inc on line 255 005+ IPv4 error 006+ 007+ Warning: file_get_contents(/root/apps5/php-7.0.25/sapi/fpm/tests/php-fpm.pid): failed to open stream: No such file or directory in /root/apps5/php-7.0.25/sapi/fpm/tests/012.php on line 34 008+ PID not found 001- [%d-%s-%d %d:%d:%d] NOTICE: fpm is running, pid %d 002- [%d-%s-%d %d:%d:%d] NOTICE: ready to handle connections 003- int(%d) 004- IPv4 ok 005- [%d-%s-%d %d:%d:%d] NOTICE: Reloading in progress ... 006- [%d-%s-%d %d:%d:%d] NOTICE: reloading: %s 007- [%d-%s-%d %d:%d:%d] NOTICE: using inherited socket fd=%d, "127.0.0.1:%d" 008- [%d-%s-%d %d:%d:%d] NOTICE: fpm is running, pid %d 009- [%d-%s-%d %d:%d:%d] NOTICE: ready to handle connections 010- int(%d) 011- IPv4 ok ================================================================================ ================================================================================ /root/apps5/php-7.0.25/sapi/fpm/tests/013.phpt ================================================================================ [08-Nov-2017 15:31:01] ERROR: [pool unconfined] cannot get uid for user 'foo' [08-Nov-2017 15:31:01] ERROR: FPM initialization failed Done ================================================================================ 001+ [08-Nov-2017 15:31:01] ERROR: [pool unconfined] cannot get uid for user 'foo' 002+ [08-Nov-2017 15:31:01] ERROR: FPM initialization failed 001- Started ================================================================================ ================================================================================ /root/apps5/php-7.0.25/sapi/fpm/tests/014.phpt ================================================================================ [08-Nov-2017 15:31:04] ERROR: [pool unconfined] cannot get uid for user 'foo' [08-Nov-2017 15:31:04] ERROR: FPM initialization failed Done ================================================================================ 001+ [08-Nov-2017 15:31:04] ERROR: [pool unconfined] cannot get uid for user 'foo' 002+ [08-Nov-2017 15:31:04] ERROR: FPM initialization failed 001- Started ================================================================================ ================================================================================ /root/apps5/php-7.0.25/sapi/fpm/tests/017.phpt ================================================================================ [08-Nov-2017 15:31:11] ALERT: [pool unconfined] user has not been defined [08-Nov-2017 15:31:11] ERROR: failed to post process the configuration Warning: fsockopen(): unable to connect to 127.0.0.1:9008 (Connection refused) in /root/apps5/php-7.0.25/sapi/fpm/tests/fcgi.inc on line 255 Request error [08-Nov-2017 15:31:11] ERROR: FPM initialization failed Done ================================================================================ 001+ [08-Nov-2017 15:31:11] ALERT: [pool unconfined] user has not been defined 002+ [08-Nov-2017 15:31:11] ERROR: failed to post process the configuration 001- [%s] NOTICE: fpm is running, pid %d 002- [%s] NOTICE: ready to handle connections 003- Test Start 004+ Warning: fsockopen(): unable to connect to 127.0.0.1:9008 (Connection refused) in /root/apps5/php-7.0.25/sapi/fpm/tests/fcgi.inc on line 255 005+ Request error 006+ [08-Nov-2017 15:31:11] ERROR: FPM initialization failed 005- Request ok 006- [%s] NOTICE: Terminating ... 007- [%s] NOTICE: exiting, bye-bye! ================================================================================ ================================================================================ /root/apps5/php-7.0.25/sapi/fpm/tests/019.phpt ================================================================================ [08-Nov-2017 15:31:11] ALERT: [pool test] user has not been defined [08-Nov-2017 15:31:11] ERROR: failed to post process the configuration Warning: fsockopen(): unable to connect to 127.0.0.1:9008 (Connection refused) in /root/apps5/php-7.0.25/sapi/fpm/tests/fcgi.inc on line 255 Ping error File php-fpm.log.tmp exists File php-fpm.acc.tmp missing File php-fpm.slw.tmp missing File php-fpm.pid.tmp missing [08-Nov-2017 15:31:11] ERROR: FPM initialization failed File php-fpm.pid.tmp removed Warning: readfile(/root/apps5/php-7.0.25/sapi/fpm/tests/php-fpm.acc.tmp): failed to open stream: No such file or directory in /root/apps5/php-7.0.25/sapi/fpm/tests/019.php on line 48 ================================================================================ 001+ [08-Nov-2017 15:31:11] ALERT: [pool test] user has not been defined 002+ [08-Nov-2017 15:31:11] ERROR: failed to post process the configuration 003+ 004+ Warning: fsockopen(): unable to connect to 127.0.0.1:9008 (Connection refused) in /root/apps5/php-7.0.25/sapi/fpm/tests/fcgi.inc on line 255 005+ Ping error 001- [%s] NOTICE: fpm is running, pid %d 002- [%s] NOTICE: ready to handle connections 003- Ping ok 005- File php-fpm.acc.tmp exists 006- File php-fpm.slw.tmp exists 007- File php-fpm.pid.tmp exists 008- [%s] NOTICE: Terminating ... 009- [%s] NOTICE: exiting, bye-bye! 007+ File php-fpm.acc.tmp missing 008+ File php-fpm.slw.tmp missing 009+ File php-fpm.pid.tmp missing 010+ [08-Nov-2017 15:31:11] ERROR: FPM initialization failed 011- 127.0.0.1 - %s "GET /ping" 200 012+ 013+ Warning: readfile(/root/apps5/php-7.0.25/sapi/fpm/tests/php-fpm.acc.tmp): failed to open stream: No such file or directory in /root/apps5/php-7.0.25/sapi/fpm/tests/019.php on line 48 ================================================================================ ================================================================================ /root/apps5/php-7.0.25/sapi/fpm/tests/020.phpt ================================================================================ [08-Nov-2017 15:31:11] ALERT: [pool test] user has not been defined [08-Nov-2017 15:31:11] ERROR: failed to post process the configuration Warning: fsockopen(): unable to connect to 127.0.0.1:9008 (Connection refused) in /root/apps5/php-7.0.25/sapi/fpm/tests/fcgi.inc on line 255 Ping error File php-fpm.acc.tmp missing File php-fpm.slw.tmp missing [08-Nov-2017 15:31:11] ERROR: FPM initialization failed Warning: readfile(/root/apps5/php-7.0.25/sapi/fpm/tests/php-fpm.acc.tmp): failed to open stream: No such file or directory in /root/apps5/php-7.0.25/sapi/fpm/tests/020.php on line 47 ================================================================================ 001+ [08-Nov-2017 15:31:11] ALERT: [pool test] user has not been defined 002+ [08-Nov-2017 15:31:11] ERROR: failed to post process the configuration 003+ 004+ Warning: fsockopen(): unable to connect to 127.0.0.1:9008 (Connection refused) in /root/apps5/php-7.0.25/sapi/fpm/tests/fcgi.inc on line 255 005+ Ping error 006+ File php-fpm.acc.tmp missing 007+ File php-fpm.slw.tmp missing 008+ [08-Nov-2017 15:31:11] ERROR: FPM initialization failed 001- [%s] NOTICE: fpm is running, pid %d 002- [%s] NOTICE: ready to handle connections 003- Ping ok 004- File php-fpm.acc.tmp exists 005- File php-fpm.slw.tmp exists 006- [%s] NOTICE: Terminating ... 007- [%s] NOTICE: exiting, bye-bye! 008- 127.0.0.1 - %s "GET /ping" 200 009+ 010+ Warning: readfile(/root/apps5/php-7.0.25/sapi/fpm/tests/php-fpm.acc.tmp): failed to open stream: No such file or directory in /root/apps5/php-7.0.25/sapi/fpm/tests/020.php on line 47 ================================================================================ ================================================================================ /root/apps5/php-7.0.25/sapi/fpm/tests/022-cve-2016-5385.phpt ================================================================================ [08-Nov-2017 15:31:12] ALERT: [pool unconfined] user has not been defined [08-Nov-2017 15:31:12] ERROR: failed to post process the configuration Warning: fsockopen(): unable to connect to 127.0.0.1:9008 (Connection refused) in /root/apps5/php-7.0.25/sapi/fpm/tests/fcgi.inc on line 255 Request error [08-Nov-2017 15:31:12] ERROR: FPM initialization failed Done ================================================================================ 001+ [08-Nov-2017 15:31:12] ALERT: [pool unconfined] user has not been defined 002+ [08-Nov-2017 15:31:12] ERROR: failed to post process the configuration 001- [%s] NOTICE: fpm is running, pid %d 002- [%s] NOTICE: ready to handle connections 003- Test Start 004- NULL 005- string(3) "BAR" 006- bool(false) 007- string(3) "BAR" 008- Test End 004+ Warning: fsockopen(): unable to connect to 127.0.0.1:9008 (Connection refused) in /root/apps5/php-7.0.25/sapi/fpm/tests/fcgi.inc on line 255 005+ Request error 006+ [08-Nov-2017 15:31:12] ERROR: FPM initialization failed 010- Request ok 011- [%s] NOTICE: Terminating ... 012- [%s] NOTICE: exiting, bye-bye! ================================================================================ ================================================================================ /root/apps5/php-7.0.25/sapi/tests/bug69487.phpt ================================================================================ Warning: Unknown: Unable to create temporary file, Check permissions in temporary files directory. in Unknown on line 0 Warning: Unknown: POST data can't be buffered; all data discarded in Unknown on line 0 bool(false) int(0) ================================================================================ 004- 005- Warning: Cannot modify header information - headers already sent in Unknown on line 0 ================================================================================ ================================================================================ BUILD ENVIRONMENT ================================================================================ OS: Linux - Linux wintermute 3.16.45-mariovaldez #1 SMP Tue Jul 4 00:07:29 CDT 2017 x86_64 Autoconf: autoconf (GNU Autoconf) 2.69 Copyright (C) 2012 Free Software Foundation, Inc. License GPLv3+/Autoconf: GNU GPL version 3 or later <http://gnu.org/licenses/gpl.html>, <http://gnu.org/licenses/exceptions.html> This is free software: you are free to change and redistribute it. There is NO WARRANTY, to the extent permitted by law. Written by David J. MacKenzie and Akim Demaille. Bundled Libtool: ltmain.sh (GNU libtool) 1.5.26 (1.1220.2.492 2008/01/30 06:40:56) Copyright (C) 2008 Free Software Foundation, Inc. This is free software; see the source for copying conditions. There is NO warranty; not even for MERCHANTABILITY or FITNESS FOR A PARTICULAR PURPOSE. System Libtool: libtool (GNU libtool) 2.4.2 Written by Gordon Matzigkeit <gord@gnu.ai.mit.edu>, 1996 Copyright (C) 2011 Free Software Foundation, Inc. This is free software; see the source for copying conditions. There is NO warranty; not even for MERCHANTABILITY or FITNESS FOR A PARTICULAR PURPOSE. Compiler: Reading specs from /usr/lib64/gcc/x86_64-slackware-linux/4.8.2/specs COLLECT_GCC=cc COLLECT_LTO_WRAPPER=/usr/libexec/gcc/x86_64-slackware-linux/4.8.2/lto-wrapper Target: x86_64-slackware-linux Configured with: ../gcc-4.8.2/configure --prefix=/usr --libdir=/usr/lib64 --mandir=/usr/man --infodir=/usr/info --enable-shared --enable-bootstrap --enable-languages=ada,c,c++,fortran,go,java,lto,objc --enable-threads=posix --enable-checking=release --enable-objc-gc --with-system-zlib --with-python-dir=/lib64/python2.7/site-packages --disable-libunwind-exceptions --enable-__cxa_atexit --enable-libssp --enable-lto --with-gnu-ld --verbose --enable-java-home --with-java-home=/usr/lib64/jvm/jre --with-jvm-root-dir=/usr/lib64/jvm --with-jvm-jar-dir=/usr/lib64/jvm/jvm-exports --with-arch-directory=amd64 --with-antlr-jar=/home/slackware/slackbuilds/gcc/antlr-runtime-3.4.jar --enable-multilib --target=x86_64-slackware-linux --build=x86_64-slackware-linux --host=x86_64-slackware-linux Thread model: posix gcc version 4.8.2 (GCC) Bison: bison (GNU Bison) 2.7 Written by Robert Corbett and Richard Stallman. Copyright (C) 2012 Free Software Foundation, Inc. This is free software; see the source for copying conditions. There is NO warranty; not even for MERCHANTABILITY or FITNESS FOR A PARTICULAR PURPOSE. Libraries: linux-vdso.so.1 (0x00007ffd57780000) libcrypt.so.1 => /lib64/libcrypt.so.1 (0x00007fc6cc418000) libz.so.1 => /usr/lib64/../lib64/libz.so.1 (0x00007fc6cc200000) libpq.so.5 => /usr/pgsql/lib/libpq.so.5 (0x00007fc6cbfc8000) librt.so.1 => /lib64/librt.so.1 (0x00007fc6cbdc0000) libsybdb.so.5 => /usr/local/freetds/lib/libsybdb.so.5 (0x00007fc6cbb50000) libdl.so.2 => /lib64/libdl.so.2 (0x00007fc6cb948000) libmcrypt.so.4 => /usr/lib64/../lib64/libmcrypt.so.4 (0x00007fc6cb710000) libssl.so.1 => /usr/lib64/../lib64/libssl.so.1 (0x00007fc6cb4a0000) libcrypto.so.1 => /usr/lib64/../lib64/libcrypto.so.1 (0x00007fc6cb0c0000) libstdc++.so.6 => /usr/lib64/../lib64/libstdc++.so.6 (0x00007fc6cadb8000) libm.so.6 => /lib64/libm.so.6 (0x00007fc6caab0000) libjpeg.so.8 => /usr/lib64/../lib64/libjpeg.so.8 (0x00007fc6ca870000) libgdbm.so.3 => /usr/lib64/../lib64/libgdbm.so.3 (0x00007fc6ca668000) libnsl.so.1 => /lib64/libnsl.so.1 (0x00007fc6ca448000) libcurl.so.4 => /usr/lib64/../lib64/libcurl.so.4 (0x00007fc6ca1d8000) libldap-2.4.so.2 => /usr/lib64/../lib64/libldap-2.4.so.2 (0x00007fc6c9f90000) libsasl2.so.2 => /usr/lib64/../lib64/libsasl2.so.2 (0x00007fc6c9d70000) liblber-2.4.so.2 => /usr/lib64/../lib64/liblber-2.4.so.2 (0x00007fc6c9b60000) libresolv.so.2 => /lib64/libresolv.so.2 (0x00007fc6c9940000) libfreetype.so.6 => /usr/lib64/../lib64/libfreetype.so.6 (0x00007fc6c96a8000) libbz2.so.1 => /lib64/libbz2.so.1 (0x00007fc6c9498000) libpng14.so.14 => /usr/lib64/../lib64/libpng14.so.14 (0x00007fc6c9270000) libicui18n.so.51 => /usr/lib64/../lib64/libicui18n.so.51 (0x00007fc6c8e70000) libicuuc.so.51 => /usr/lib64/../lib64/libicuuc.so.51 (0x00007fc6c8b00000) libicudata.so.51 => /usr/lib64/../lib64/libicudata.so.51 (0x00007fc6c73b0000) libicuio.so.51 => /usr/lib64/../lib64/libicuio.so.51 (0x00007fc6c71a0000) libodbc.so.2 => /usr/local/lib/libodbc.so.2 (0x00007fc6c6f30000) libltdl.so.7 => /usr/lib64/../lib64/libltdl.so.7 (0x00007fc6c6d20000) libpthread.so.0 => /lib64/libpthread.so.0 (0x00007fc6c6b00000) libnetsnmp.so.30 => /usr/lib64/../lib64/libnetsnmp.so.30 (0x00007fc6c6848000) libxml2.so.2 => /usr/lib64/../lib64/libxml2.so.2 (0x00007fc6c64e0000) liblzma.so.5 => /lib64/liblzma.so.5 (0x00007fc6c62b8000) libgcc_s.so.1 => /usr/lib64/../lib64/libgcc_s.so.1 (0x00007fc6c60a0000) libc.so.6 => /lib64/libc.so.6 (0x00007fc6c5cd0000) /lib64/ld-linux-x86-64.so.2 (0x00007fc6cc658000) ================================================================================ PHPINFO ================================================================================ phpinfo() PHP Version => 7.0.25 System => Linux wintermute 3.16.45-mariovaldez #1 SMP Tue Jul 4 00:07:29 CDT 2017 x86_64 Build Date => Nov 8 2017 14:49:14 Configure Command => './configure' '--with-libdir=lib64' '--with-bz2' '--with-zlib' '--enable-calendar' '--with-gdbm' '--enable-ftp' '--with-gd' '--enable-inline-optimization' '--with-jpeg-dir=/usr' '--with-png-dir=/usr' '--with-freetype-dir' '--enable-gd-native-ttf' '--enable-exif' '--with-imap=/usr/src/APPS_SRC/imap-2007f/' '--with-imap-ssl' '--sysconfdir=/etc/php' '--with-config-file-path=/etc/php' '--with-mysqli=mysqlnd' '--with-gettext' '--with-mcrypt' '--with-ldap' '--with-mhash' '--with-curl' '--with-openssl' '--with-pdo-dblib=/usr/local/freetds/' '--enable-mbstring' '--enable-bcmath' '--with-snmp' '--enable-soap' '--enable-sockets' '--with-tidy' '--enable-zip' '--with-pdo-mysql=mysqlnd' '--enable-fpm' '--with-pgsql=/usr/pgsql' '--with-unixODBC' '--enable-intl' Server API => Command Line Interface Virtual Directory Support => disabled Configuration File (php.ini) Path => /etc/php Loaded Configuration File => /etc/php/php.ini Scan this dir for additional .ini files => (none) Additional .ini files parsed => (none) PHP API => 20151012 PHP Extension => 20151012 Zend Extension => 320151012 Zend Extension Build => API320151012,NTS PHP Extension Build => API20151012,NTS Debug Build => no Thread Safety => disabled Zend Signal Handling => disabled Zend Memory Manager => enabled Zend Multibyte Support => provided by mbstring IPv6 Support => enabled DTrace Support => disabled Registered PHP Streams => https, ftps, compress.zlib, compress.bzip2, php, file, glob, data, http, ftp, zip, phar Registered Stream Socket Transports => tcp, udp, unix, udg, ssl, sslv3, sslv2, tls, tlsv1.0, tlsv1.1, tlsv1.2 Registered Stream Filters => zlib.*, bzip2.*, convert.iconv.*, mcrypt.*, mdecrypt.*, string.rot13, string.toupper, string.tolower, string.strip_tags, convert.*, consumed, dechunk This program makes use of the Zend Scripting Language Engine: Zend Engine v3.0.0, Copyright (c) 1998-2017 Zend Technologies with the ionCube PHP Loader (enabled) + Intrusion Protection from ioncube24.com (unconfigured) v6.0.6, Copyright (c) 2002-2016, by ionCube Ltd. with Zend OPcache v7.0.25, Copyright (c) 1999-2017, by Zend Technologies with Xdebug v2.4.0, Copyright (c) 2002-2016, by Derick Rethans _______________________________________________________________________ Configuration apc APC Compatibility => 1.0.3 APCu Version => 5.1.8 Build Date => Sep 10 2017 15:54:00 apcu APCu Support => Disabled Version => 5.1.8 APCu Debugging => Disabled MMAP Support => Enabled MMAP File Mask => Serialization Support => Disabled Build Date => Sep 10 2017 05:14:22 Directive => Local Value => Master Value apc.coredump_unmap => Off => Off apc.enable_cli => Off => Off apc.enabled => On => On apc.entries_hint => 4096 => 4096 apc.gc_ttl => 3600 => 3600 apc.mmap_file_mask => no value => no value apc.preload_path => no value => no value apc.serializer => php => php apc.shm_segments => 1 => 1 apc.shm_size => 32M => 32M apc.slam_defense => On => On apc.smart => 0 => 0 apc.ttl => 0 => 0 apc.use_request_time => On => On apc.writable => /tmp => /tmp bcmath BCMath support => enabled Directive => Local Value => Master Value bcmath.scale => 0 => 0 bz2 BZip2 Support => Enabled Stream Wrapper support => compress.bzip2:// Stream Filter support => bzip2.decompress, bzip2.compress BZip2 Version => 1.0.6, 6-Sept-2010 calendar Calendar support => enabled Core PHP Version => 7.0.25 Directive => Local Value => Master Value allow_url_fopen => On => On allow_url_include => Off => Off arg_separator.input => & => & arg_separator.output => & => & auto_append_file => no value => no value auto_globals_jit => On => On auto_prepend_file => no value => no value browscap => no value => no value default_charset => UTF-8 => UTF-8 default_mimetype => text/html => text/html disable_classes => no value => no value disable_functions => no value => no value display_errors => STDERR => STDERR display_startup_errors => Off => Off doc_root => no value => no value docref_ext => no value => no value docref_root => no value => no value enable_dl => Off => Off enable_post_data_reading => On => On error_append_string => no value => no value error_log => no value => no value error_prepend_string => no value => no value error_reporting => 22527 => 22527 exit_on_timeout => Off => Off expose_php => Off => Off extension_dir => /usr/local/lib/php/extensions/no-debug-non-zts-20151012 => /usr/local/lib/php/extensions/no-debug-non-zts-20151012 file_uploads => On => On highlight.comment => <font style="color: #FF8000">#FF8000</font> => <font style="color: #FF8000">#FF8000</font> highlight.default => <font style="color: #0000BB">#0000BB</font> => <font style="color: #0000BB">#0000BB</font> highlight.html => <font style="color: #000000">#000000</font> => <font style="color: #000000">#000000</font> highlight.keyword => <font style="color: #007700">#007700</font> => <font style="color: #007700">#007700</font> highlight.string => <font style="color: #DD0000">#DD0000</font> => <font style="color: #DD0000">#DD0000</font> html_errors => Off => Off ignore_repeated_errors => Off => Off ignore_repeated_source => Off => Off ignore_user_abort => Off => Off implicit_flush => On => On include_path => .:/usr/local/lib/php => .:/usr/local/lib/php input_encoding => no value => no value internal_encoding => no value => no value log_errors => On => On log_errors_max_len => 10240 => 10240 mail.add_x_header => On => On mail.force_extra_parameters => no value => no value mail.log => no value => no value max_execution_time => 0 => 0 max_file_uploads => 20 => 20 max_input_nesting_level => 64 => 64 max_input_time => -1 => -1 max_input_vars => 1000 => 1000 memory_limit => 128M => 128M open_basedir => no value => no value output_buffering => 0 => 0 output_encoding => no value => no value output_handler => no value => no value post_max_size => 20M => 20M precision => 14 => 14 realpath_cache_size => 4096K => 4096K realpath_cache_ttl => 120 => 120 register_argc_argv => On => On report_memleaks => On => On report_zend_debug => Off => Off request_order => GP => GP sendmail_from => no value => no value sendmail_path => /usr/sbin/sendmail -t -i => /usr/sbin/sendmail -t -i serialize_precision => 17 => 17 short_open_tag => Off => Off SMTP => localhost => localhost smtp_port => 25 => 25 sql.safe_mode => Off => Off sys_temp_dir => no value => no value track_errors => Off => Off unserialize_callback_func => no value => no value upload_max_filesize => 20M => 20M upload_tmp_dir => no value => no value user_dir => no value => no value user_ini.cache_ttl => 300 => 300 user_ini.filename => .user.ini => .user.ini variables_order => GPCS => GPCS xmlrpc_error_number => 0 => 0 xmlrpc_errors => Off => Off zend.assertions => 1 => 1 zend.detect_unicode => On => On zend.enable_gc => On => On zend.multibyte => Off => Off zend.script_encoding => no value => no value ctype ctype functions => enabled curl cURL support => enabled cURL Information => 7.56.1 Age => 3 Features AsynchDNS => Yes CharConv => No Debug => No GSS-Negotiate => No IDN => No IPv6 => Yes krb4 => No Largefile => Yes libz => Yes NTLM => Yes NTLMWB => Yes SPNEGO => No SSL => Yes SSPI => No TLS-SRP => Yes HTTP2 => No GSSAPI => No KERBEROS5 => No UNIX_SOCKETS => Yes PSL => No Protocols => dict, file, ftp, ftps, gopher, http, https, imap, imaps, ldap, ldaps, pop3, pop3s, rtsp, smb, smbs, smtp, smtps, telnet, tftp Host => x86_64-pc-linux-gnu SSL Version => OpenSSL/1.0.1u ZLib Version => 1.2.8 date date/time support => enabled timelib version => 2016.02 "Olson" Timezone Database Version => 2017.2 Timezone Database => internal Default timezone => America/Monterrey Directive => Local Value => Master Value date.default_latitude => 31.7667 => 31.7667 date.default_longitude => 35.2333 => 35.2333 date.sunrise_zenith => 90.583333 => 90.583333 date.sunset_zenith => 90.583333 => 90.583333 date.timezone => America/Monterrey => America/Monterrey dba DBA support => enabled Supported handlers => gdbm cdb cdb_make inifile flatfile Directive => Local Value => Master Value dba.default_handler => flatfile => flatfile dom DOM/XML => enabled DOM/XML API Version => 20031129 libxml Version => 2.9.5 HTML Support => enabled XPath Support => enabled XPointer Support => enabled Schema Support => enabled RelaxNG Support => enabled exif EXIF Support => enabled EXIF Version => 1.4 $Id: 8bdc0c8f27c2c9dd1f7551f1f9fe3ab57a06a4b1 $ Supported EXIF Version => 0220 Supported filetypes => JPEG,TIFF Directive => Local Value => Master Value exif.decode_jis_intel => JIS => JIS exif.decode_jis_motorola => JIS => JIS exif.decode_unicode_intel => UCS-2LE => UCS-2LE exif.decode_unicode_motorola => UCS-2BE => UCS-2BE exif.encode_jis => no value => no value exif.encode_unicode => ISO-8859-15 => ISO-8859-15 fileinfo fileinfo support => enabled version => 1.0.5 libmagic => 522 filter Input Validation and Filtering => enabled Revision => $Id: 28fcca4bfda9c9907588a64d245b49cb398249d8 $ Directive => Local Value => Master Value filter.default => unsafe_raw => unsafe_raw filter.default_flags => no value => no value ftp FTP support => enabled FTPS support => enabled gd GD Support => enabled GD Version => bundled (2.1.0 compatible) FreeType Support => enabled FreeType Linkage => with freetype FreeType Version => 2.5.5 GIF Read Support => enabled GIF Create Support => enabled JPEG Support => enabled libJPEG Version => 8 PNG Support => enabled libPNG Version => 1.4.20 WBMP Support => enabled XBM Support => enabled Directive => Local Value => Master Value gd.jpeg_ignore_warning => 0 => 0 gettext GetText Support => enabled hash hash support => enabled Hashing Engines => md2 md4 md5 sha1 sha224 sha256 sha384 sha512 ripemd128 ripemd160 ripemd256 ripemd320 whirlpool tiger128,3 tiger160,3 tiger192,3 tiger128,4 tiger160,4 tiger192,4 snefru snefru256 gost gost-crypto adler32 crc32 crc32b fnv132 fnv1a32 fnv164 fnv1a64 joaat haval128,3 haval160,3 haval192,3 haval224,3 haval256,3 haval128,4 haval160,4 haval192,4 haval224,4 haval256,4 haval128,5 haval160,5 haval192,5 haval224,5 haval256,5 MHASH support => Enabled MHASH API Version => Emulated Support iconv iconv support => enabled iconv implementation => glibc iconv library version => 2.17 Directive => Local Value => Master Value iconv.input_encoding => no value => no value iconv.internal_encoding => no value => no value iconv.output_encoding => no value => no value imap IMAP c-Client Version => 2007f SSL Support => enabled intl Internationalization support => enabled version => 1.1.0 ICU version => 51.2 ICU Data version => 51.2 Directive => Local Value => Master Value intl.default_locale => no value => no value intl.error_level => 0 => 0 intl.use_exceptions => 0 => 0 json json support => enabled json version => 1.4.0 ldap LDAP Support => enabled RCS Version => $Id: cec20da3ccaa477662b8667bef021291fb5bf6f4 $ Total Links => 0/unlimited API Version => 3001 Vendor Name => OpenLDAP Vendor Version => 20439 Directive => Local Value => Master Value ldap.max_links => Unlimited => Unlimited libxml libXML support => active libXML Compiled Version => 2.9.5 libXML Loaded Version => 20905 libXML streams => enabled mbstring Multibyte Support => enabled Multibyte string engine => libmbfl HTTP input encoding translation => disabled libmbfl version => 1.3.2 oniguruma version => 5.9.6 mbstring extension makes use of "streamable kanji code filter and converter", which is distributed under the GNU Lesser General Public License version 2.1. Multibyte (japanese) regex support => enabled Multibyte regex (oniguruma) backtrack check => On Multibyte regex (oniguruma) version => 5.9.6 Directive => Local Value => Master Value mbstring.detect_order => no value => no value mbstring.encoding_translation => Off => Off mbstring.func_overload => 0 => 0 mbstring.http_input => no value => no value mbstring.http_output => no value => no value mbstring.http_output_conv_mimetypes => ^(text/|application/xhtml\+xml) => ^(text/|application/xhtml\+xml) mbstring.internal_encoding => no value => no value mbstring.language => neutral => neutral mbstring.strict_detection => Off => Off mbstring.substitute_character => no value => no value mcrypt mcrypt support => enabled mcrypt_filter support => enabled Version => 2.5.8 Api No => 20021217 Supported ciphers => cast-128 gost rijndael-128 twofish arcfour cast-256 loki97 rijndael-192 saferplus wake blowfish-compat des rijndael-256 serpent xtea blowfish enigma rc2 tripledes Supported modes => cbc cfb ctr ecb ncfb nofb ofb stream Directive => Local Value => Master Value mcrypt.algorithms_dir => no value => no value mcrypt.modes_dir => no value => no value mysqli MysqlI Support => enabled Client API library version => mysqlnd 5.0.12-dev - 20150407 - $Id: b5c5906d452ec590732a93b051f3827e02749b83 $ Active Persistent Links => 0 Inactive Persistent Links => 0 Active Links => 0 Directive => Local Value => Master Value mysqli.allow_local_infile => On => On mysqli.allow_persistent => On => On mysqli.default_host => no value => no value mysqli.default_port => 3306 => 3306 mysqli.default_pw => no value => no value mysqli.default_socket => no value => no value mysqli.default_user => no value => no value mysqli.max_links => Unlimited => Unlimited mysqli.max_persistent => Unlimited => Unlimited mysqli.reconnect => Off => Off mysqli.rollback_on_cached_plink => Off => Off mysqlnd mysqlnd => enabled Version => mysqlnd 5.0.12-dev - 20150407 - $Id: b5c5906d452ec590732a93b051f3827e02749b83 $ Compression => supported core SSL => supported extended SSL => supported Command buffer size => 4096 Read buffer size => 32768 Read timeout => 31536000 Collecting statistics => Yes Collecting memory statistics => No Tracing => n/a Loaded plugins => mysqlnd,debug_trace,auth_plugin_mysql_native_password,auth_plugin_mysql_clear_password,auth_plugin_sha256_password API Extensions => mysqli,pdo_mysql mysqlnd statistics => bytes_sent => 0 bytes_received => 0 packets_sent => 0 packets_received => 0 protocol_overhead_in => 0 protocol_overhead_out => 0 bytes_received_ok_packet => 0 bytes_received_eof_packet => 0 bytes_received_rset_header_packet => 0 bytes_received_rset_field_meta_packet => 0 bytes_received_rset_row_packet => 0 bytes_received_prepare_response_packet => 0 bytes_received_change_user_packet => 0 packets_sent_command => 0 packets_received_ok => 0 packets_received_eof => 0 packets_received_rset_header => 0 packets_received_rset_field_meta => 0 packets_received_rset_row => 0 packets_received_prepare_response => 0 packets_received_change_user => 0 result_set_queries => 0 non_result_set_queries => 0 no_index_used => 0 bad_index_used => 0 slow_queries => 0 buffered_sets => 0 unbuffered_sets => 0 ps_buffered_sets => 0 ps_unbuffered_sets => 0 flushed_normal_sets => 0 flushed_ps_sets => 0 ps_prepared_never_executed => 0 ps_prepared_once_executed => 0 rows_fetched_from_server_normal => 0 rows_fetched_from_server_ps => 0 rows_buffered_from_client_normal => 0 rows_buffered_from_client_ps => 0 rows_fetched_from_client_normal_buffered => 0 rows_fetched_from_client_normal_unbuffered => 0 rows_fetched_from_client_ps_buffered => 0 rows_fetched_from_client_ps_unbuffered => 0 rows_fetched_from_client_ps_cursor => 0 rows_affected_normal => 0 rows_affected_ps => 0 rows_skipped_normal => 0 rows_skipped_ps => 0 copy_on_write_saved => 0 copy_on_write_performed => 0 command_buffer_too_small => 0 connect_success => 0 connect_failure => 0 connection_reused => 0 reconnect => 0 pconnect_success => 0 active_connections => 0 active_persistent_connections => 0 explicit_close => 0 implicit_close => 0 disconnect_close => 0 in_middle_of_command_close => 0 explicit_free_result => 0 implicit_free_result => 0 explicit_stmt_close => 0 implicit_stmt_close => 0 mem_emalloc_count => 0 mem_emalloc_amount => 0 mem_ecalloc_count => 0 mem_ecalloc_amount => 0 mem_erealloc_count => 0 mem_erealloc_amount => 0 mem_efree_count => 0 mem_efree_amount => 0 mem_malloc_count => 0 mem_malloc_amount => 0 mem_calloc_count => 0 mem_calloc_amount => 0 mem_realloc_count => 0 mem_realloc_amount => 0 mem_free_count => 0 mem_free_amount => 0 mem_estrndup_count => 0 mem_strndup_count => 0 mem_estndup_count => 0 mem_strdup_count => 0 proto_text_fetched_null => 0 proto_text_fetched_bit => 0 proto_text_fetched_tinyint => 0 proto_text_fetched_short => 0 proto_text_fetched_int24 => 0 proto_text_fetched_int => 0 proto_text_fetched_bigint => 0 proto_text_fetched_decimal => 0 proto_text_fetched_float => 0 proto_text_fetched_double => 0 proto_text_fetched_date => 0 proto_text_fetched_year => 0 proto_text_fetched_time => 0 proto_text_fetched_datetime => 0 proto_text_fetched_timestamp => 0 proto_text_fetched_string => 0 proto_text_fetched_blob => 0 proto_text_fetched_enum => 0 proto_text_fetched_set => 0 proto_text_fetched_geometry => 0 proto_text_fetched_other => 0 proto_binary_fetched_null => 0 proto_binary_fetched_bit => 0 proto_binary_fetched_tinyint => 0 proto_binary_fetched_short => 0 proto_binary_fetched_int24 => 0 proto_binary_fetched_int => 0 proto_binary_fetched_bigint => 0 proto_binary_fetched_decimal => 0 proto_binary_fetched_float => 0 proto_binary_fetched_double => 0 proto_binary_fetched_date => 0 proto_binary_fetched_year => 0 proto_binary_fetched_time => 0 proto_binary_fetched_datetime => 0 proto_binary_fetched_timestamp => 0 proto_binary_fetched_string => 0 proto_binary_fetched_json => 0 proto_binary_fetched_blob => 0 proto_binary_fetched_enum => 0 proto_binary_fetched_set => 0 proto_binary_fetched_geometry => 0 proto_binary_fetched_other => 0 init_command_executed_count => 0 init_command_failed_count => 0 com_quit => 0 com_init_db => 0 com_query => 0 com_field_list => 0 com_create_db => 0 com_drop_db => 0 com_refresh => 0 com_shutdown => 0 com_statistics => 0 com_process_info => 0 com_connect => 0 com_process_kill => 0 com_debug => 0 com_ping => 0 com_time => 0 com_delayed_insert => 0 com_change_user => 0 com_binlog_dump => 0 com_table_dump => 0 com_connect_out => 0 com_register_slave => 0 com_stmt_prepare => 0 com_stmt_execute => 0 com_stmt_send_long_data => 0 com_stmt_close => 0 com_stmt_reset => 0 com_stmt_set_option => 0 com_stmt_fetch => 0 com_deamon => 0 bytes_received_real_data_normal => 0 bytes_received_real_data_ps => 0 oci8 OCI8 Support => enabled OCI8 DTrace Support => disabled OCI8 Version => 2.1.2 Revision => $Id: 0527b558474b9602dac1cbae9d6544f6d1ee3f7e $ Oracle Run-time Client Library Version => 12.1.0.2.0 Oracle Compile-time Instant Client Version => 12.1 Directive => Local Value => Master Value oci8.connection_class => no value => no value oci8.default_prefetch => 100 => 100 oci8.events => Off => Off oci8.max_persistent => -1 => -1 oci8.old_oci_close_semantics => Off => Off oci8.persistent_timeout => -1 => -1 oci8.ping_interval => 60 => 60 oci8.privileged_connect => Off => Off oci8.statement_cache_size => 20 => 20 Statistics => Active Persistent Connections => 0 Active Connections => 0 odbc ODBC Support => enabled Active Persistent Links => 0 Active Links => 0 ODBC library => unixODBC ODBCVER => 0x0380 ODBC_INCLUDE => -I/usr/local/include ODBC_LFLAGS => -L/usr/local/lib64 ODBC_LIBS => -lodbc Directive => Local Value => Master Value odbc.allow_persistent => On => On odbc.check_persistent => On => On odbc.default_cursortype => Static cursor => Static cursor odbc.default_db => no value => no value odbc.default_pw => no value => no value odbc.default_user => no value => no value odbc.defaultbinmode => return as is => return as is odbc.defaultlrl => return up to 4096 bytes => return up to 4096 bytes odbc.max_links => Unlimited => Unlimited odbc.max_persistent => Unlimited => Unlimited openssl OpenSSL support => enabled OpenSSL Library Version => OpenSSL 1.0.1u 22 Sep 2016 OpenSSL Header Version => OpenSSL 1.0.1u 22 Sep 2016 Openssl default config => /etc/ssl/openssl.cnf Directive => Local Value => Master Value openssl.cafile => no value => no value openssl.capath => no value => no value pcre PCRE (Perl Compatible Regular Expressions) Support => enabled PCRE Library Version => 8.38 2015-11-23 PCRE JIT Support => enabled Directive => Local Value => Master Value pcre.backtrack_limit => 1000000 => 1000000 pcre.jit => 1 => 1 pcre.recursion_limit => 100000 => 100000 PDO PDO support => enabled PDO drivers => dblib, mysql, sqlite pdo_dblib PDO Driver for FreeTDS/Sybase DB-lib => enabled Flavour => freetds pdo_mysql PDO Driver for MySQL => enabled Client API version => mysqlnd 5.0.12-dev - 20150407 - $Id: b5c5906d452ec590732a93b051f3827e02749b83 $ Directive => Local Value => Master Value pdo_mysql.default_socket => /tmp/mysql.sock => /tmp/mysql.sock pdo_sqlite PDO Driver for SQLite 3.x => enabled SQLite Library => 3.14.2 pgsql PostgreSQL Support => enabled PostgreSQL(libpq) Version => 9.6.3 PostgreSQL(libpq) => PostgreSQL 9.6.3 on x86_64-pc-linux-gnu, compiled by gcc (GCC) 4.8.2, 64-bit Multibyte character support => enabled SSL support => enabled Active Persistent Links => 0 Active Links => 0 Directive => Local Value => Master Value pgsql.allow_persistent => On => On pgsql.auto_reset_persistent => Off => Off pgsql.ignore_notice => Off => Off pgsql.log_notice => Off => Off pgsql.max_links => Unlimited => Unlimited pgsql.max_persistent => Unlimited => Unlimited Phar Phar: PHP Archive support => enabled Phar EXT version => 2.0.2 Phar API version => 1.1.1 SVN revision => $Id: 9d91fd26ae99260111b934cc25174387d4bd7059 $ Phar-based phar archives => enabled Tar-based phar archives => enabled ZIP-based phar archives => enabled gzip compression => enabled bzip2 compression => enabled Native OpenSSL support => enabled Phar based on pear/PHP_Archive, original concept by Davey Shafik. Phar fully realized by Gregory Beaver and Marcus Boerger. Portions of tar implementation Copyright (c) 2003-2009 Tim Kientzle. Directive => Local Value => Master Value phar.cache_list => no value => no value phar.readonly => On => On phar.require_hash => On => On posix Revision => $Id: b691ca925e7a085e6929579c4eba8fed0732e0ef $ Reflection Reflection => enabled Version => $Id: e5303663dcb329e17818853ff223e5ee01481f2c $ session Session Support => enabled Registered save handlers => files user Registered serializer handlers => php_serialize php php_binary Directive => Local Value => Master Value session.auto_start => Off => Off session.cache_expire => 180 => 180 session.cache_limiter => nocache => nocache session.cookie_domain => no value => no value session.cookie_httponly => Off => Off session.cookie_lifetime => 0 => 0 session.cookie_path => / => / session.cookie_secure => Off => Off session.entropy_file => /dev/urandom => /dev/urandom session.entropy_length => 32 => 32 session.gc_divisor => 1000 => 1000 session.gc_maxlifetime => 1440 => 1440 session.gc_probability => 1 => 1 session.hash_bits_per_character => 5 => 5 session.hash_function => 0 => 0 session.lazy_write => On => On session.name => PHPSESSID => PHPSESSID session.referer_check => no value => no value session.save_handler => files => files session.save_path => no value => no value session.serialize_handler => php => php session.upload_progress.cleanup => On => On session.upload_progress.enabled => On => On session.upload_progress.freq => 1% => 1% session.upload_progress.min_freq => 1 => 1 session.upload_progress.name => PHP_SESSION_UPLOAD_PROGRESS => PHP_SESSION_UPLOAD_PROGRESS session.upload_progress.prefix => upload_progress_ => upload_progress_ session.use_cookies => On => On session.use_only_cookies => On => On session.use_strict_mode => Off => Off session.use_trans_sid => 0 => 0 SimpleXML Simplexml support => enabled Revision => $Id: 0637e06af859ca1d0dea9c2f1530e51b98f1970e $ Schema support => enabled snmp NET-SNMP Support => enabled NET-SNMP Version => 5.7.2 PHP SNMP Version => 0.1 soap Soap Client => enabled Soap Server => enabled Directive => Local Value => Master Value soap.wsdl_cache => 1 => 1 soap.wsdl_cache_dir => /tmp => /tmp soap.wsdl_cache_enabled => 1 => 1 soap.wsdl_cache_limit => 5 => 5 soap.wsdl_cache_ttl => 86400 => 86400 sockets Sockets Support => enabled SPL SPL support => enabled Interfaces => Countable, OuterIterator, RecursiveIterator, SeekableIterator, SplObserver, SplSubject Classes => AppendIterator, ArrayIterator, ArrayObject, BadFunctionCallException, BadMethodCallException, CachingIterator, CallbackFilterIterator, DirectoryIterator, DomainException, EmptyIterator, FilesystemIterator, FilterIterator, GlobIterator, InfiniteIterator, InvalidArgumentException, IteratorIterator, LengthException, LimitIterator, LogicException, MultipleIterator, NoRewindIterator, OutOfBoundsException, OutOfRangeException, OverflowException, ParentIterator, RangeException, RecursiveArrayIterator, RecursiveCachingIterator, RecursiveCallbackFilterIterator, RecursiveDirectoryIterator, RecursiveFilterIterator, RecursiveIteratorIterator, RecursiveRegexIterator, RecursiveTreeIterator, RegexIterator, RuntimeException, SplDoublyLinkedList, SplFileInfo, SplFileObject, SplFixedArray, SplHeap, SplMinHeap, SplMaxHeap, SplObjectStorage, SplPriorityQueue, SplQueue, SplStack, SplTempFileObject, UnderflowException, UnexpectedValueException sqlite3 SQLite3 support => enabled SQLite3 module version => 7.0.25 SQLite Library => 3.14.2 Directive => Local Value => Master Value sqlite3.extension_dir => no value => no value standard Dynamic Library Support => enabled Path to sendmail => /usr/sbin/sendmail -t -i Directive => Local Value => Master Value assert.active => 1 => 1 assert.bail => 0 => 0 assert.callback => no value => no value assert.exception => 0 => 0 assert.quiet_eval => 0 => 0 assert.warning => 1 => 1 auto_detect_line_endings => 0 => 0 default_socket_timeout => 60 => 60 from => no value => no value url_rewriter.tags => a=href,area=href,frame=src,input=src,form=fakeentry => a=href,area=href,frame=src,input=src,form=fakeentry user_agent => no value => no value tidy Tidy support => enabled libTidy Release => 25 March 2009 Extension Version => 7.0.25 ($Id: 4e307eec06aa0ac776a415ba4d74290bfd9e0c73 $) Directive => Local Value => Master Value tidy.clean_output => no value => no value tidy.default_config => no value => no value tokenizer Tokenizer Support => enabled xdebug xdebug support => enabled Version => 2.4.0 IDE Key => root Supported protocols => Revision DBGp - Common DeBuGger Protocol => $Revision: 1.145 $ Directive => Local Value => Master Value xdebug.auto_trace => Off => Off xdebug.cli_color => 0 => 0 xdebug.collect_assignments => Off => Off xdebug.collect_includes => On => On xdebug.collect_params => 0 => 0 xdebug.collect_return => Off => Off xdebug.collect_vars => Off => Off xdebug.coverage_enable => On => On xdebug.default_enable => On => On xdebug.dump.COOKIE => no value => no value xdebug.dump.ENV => no value => no value xdebug.dump.FILES => no value => no value xdebug.dump.GET => no value => no value xdebug.dump.POST => no value => no value xdebug.dump.REQUEST => no value => no value xdebug.dump.SERVER => no value => no value xdebug.dump.SESSION => no value => no value xdebug.dump_globals => On => On xdebug.dump_once => On => On xdebug.dump_undefined => Off => Off xdebug.extended_info => On => On xdebug.file_link_format => no value => no value xdebug.force_display_errors => Off => Off xdebug.force_error_reporting => 0 => 0 xdebug.halt_level => 0 => 0 xdebug.idekey => no value => no value xdebug.max_nesting_level => 256 => 256 xdebug.max_stack_frames => -1 => -1 xdebug.overload_var_dump => On => On xdebug.profiler_aggregate => Off => Off xdebug.profiler_append => Off => Off xdebug.profiler_enable => Off => Off xdebug.profiler_enable_trigger => On => On xdebug.profiler_enable_trigger_value => no value => no value xdebug.profiler_output_dir => /home/mvaldez/SHARE/DEV-www/xdebug => /home/mvaldez/SHARE/DEV-www/xdebug xdebug.profiler_output_name => cachegrind.out.%t.%p.%r => cachegrind.out.%t.%p.%r xdebug.remote_addr_header => no value => no value xdebug.remote_autostart => Off => Off xdebug.remote_connect_back => Off => Off xdebug.remote_cookie_expire_time => 3600 => 3600 xdebug.remote_enable => On => On xdebug.remote_handler => dbgp => dbgp xdebug.remote_host => 192.168.246.25 => 192.168.246.25 xdebug.remote_log => /var/log/apachelogs/xdebug_remote => /var/log/apachelogs/xdebug_remote xdebug.remote_mode => req => req xdebug.remote_port => 9000 => 9000 xdebug.scream => Off => Off xdebug.show_error_trace => Off => Off xdebug.show_exception_trace => Off => Off xdebug.show_local_vars => Off => Off xdebug.show_mem_delta => Off => Off xdebug.trace_enable_trigger => Off => Off xdebug.trace_enable_trigger_value => no value => no value xdebug.trace_format => 0 => 0 xdebug.trace_options => 0 => 0 xdebug.trace_output_dir => /tmp => /tmp xdebug.trace_output_name => trace.%c => trace.%c xdebug.var_display_max_children => 128 => 128 xdebug.var_display_max_data => 512 => 512 xdebug.var_display_max_depth => 3 => 3 xml XML Support => active XML Namespace Support => active libxml2 Version => 2.9.5 xmlreader XMLReader => enabled xmlwriter XMLWriter => enabled Zend OPcache Opcode Caching => Disabled Optimization => Disabled SHM Cache => Enabled File Cache => Disabled Startup Failed => Opcode Caching is disabled for CLI Directive => Local Value => Master Value opcache.blacklist_filename => no value => no value opcache.consistency_checks => 0 => 0 opcache.dups_fix => Off => Off opcache.enable => On => On opcache.enable_cli => Off => Off opcache.enable_file_override => Off => Off opcache.error_log => no value => no value opcache.fast_shutdown => 0 => 0 opcache.file_cache => no value => no value opcache.file_cache_consistency_checks => 1 => 1 opcache.file_cache_only => 0 => 0 opcache.file_update_protection => 2 => 2 opcache.force_restart_timeout => 180 => 180 opcache.huge_code_pages => Off => Off opcache.inherited_hack => On => On opcache.interned_strings_buffer => 4 => 4 opcache.lockfile_path => /tmp => /tmp opcache.log_verbosity_level => 1 => 1 opcache.max_accelerated_files => 2000 => 2000 opcache.max_file_size => 0 => 0 opcache.max_wasted_percentage => 5 => 5 opcache.memory_consumption => 64 => 64 opcache.optimization_level => 0x7FFFBFFF => 0x7FFFBFFF opcache.preferred_memory_model => no value => no value opcache.protect_memory => 0 => 0 opcache.restrict_api => no value => no value opcache.revalidate_freq => 2 => 2 opcache.revalidate_path => Off => Off opcache.save_comments => 1 => 1 opcache.use_cwd => On => On opcache.validate_permission => Off => Off opcache.validate_root => Off => Off opcache.validate_timestamps => On => On zip Zip => enabled Zip version => 1.13.5 Libzip version => 1.1.2 zlib ZLib Support => enabled Stream Wrapper => compress.zlib:// Stream Filter => zlib.inflate, zlib.deflate Compiled Version => 1.2.8 Linked Version => 1.2.8 Directive => Local Value => Master Value zlib.output_compression => Off => Off zlib.output_compression_level => -1 => -1 zlib.output_handler => no value => no value Additional Modules Module Name ionCube Loader Environment Variable => Value CPLUS_INCLUDE_PATH => /usr/lib64/qt/include MANPATH => /usr/local/man:/usr/man:/usr/local/share/man NNTPSERVER => news.openventura.work HOSTNAME => wintermute.openventura.work TEST_PHP_SRCDIR => /root/apps5/php-7.0.25 ORGANIZATION => openventura SHELL => /bin/bash TERM => screen MAKEFLAGS => HISTSIZE => 80000 SSH_CLIENT => deleted TEST_PHPDBG_EXECUTABLE => /root/apps5/php-7.0.25/sapi/phpdbg/phpdbg CVSROOT => /home/BASE-cvs/cvsroot SSH_TTY => deleted HISTFILESIZE => 80000 USER => root http_proxy => http://192.168.246.254:800/ LS_COLORS => no=00:fi=00:di=01;34:ln=01;36:pi=40;33:so=01;35:do=01;35:bd=40;33;01:cd=40;33;01:or=40;31;01:su=37;41:sg=30;43:tw=30;42:ow=34;42:st=37;44:ex=01;32:*.bat=01;32:*.BAT=01;32:*.btm=01;32:*.BTM=01;32:*.cmd=01;32:*.CMD=01;32:*.com=01;32:*.COM=01;32:*.dll=01;32:*.DLL=01;32:*.exe=01;32:*.EXE=01;32:*.lrz=01;31:*.7zip=01;31:*.arj=01;31:*.bz2=01;31:*.deb=01;31:*.gz=01;31:*.lzh=01;31:*.rar=01;31:*.dar=01;31:*.enc=01;31;44:*.par2=01;31;42:*.RAR=01;31:*.rpm=01;31:*.rz=01;31:*.tar=01;31:*.taz=01;31:*.tb2=01;31:*.tbz2=01;31:*.tbz=01;31:*.tgz=01;31:*.txz=01;31:*.tz2=01;31:*.z=01;31:*.Z=01;31:*.zip=01;31:*.ZIP=01;31:*.zoo=01;31:*.asf=01;35:*.ASF=01;35:*.avi=01;35:*.AVI=01;35:*.bmp=01;35:*.BMP=01;35:*.flac=01;35:*.FLAC=01;35:*.gif=01;35:*.GIF=01;35:*.jpg=01;35:*.JPG=01;35:*.jpeg=01;35:*.JPEG=01;35:*.m2a=01;35:*.M2A=01;35:*.m2v=01;35:*.M2V=01;35:*.m4a=01;35:*.M4A=01;35:*.m4p=01;35:*.M4P=01;35:*.m4v=01;35:*.M4V=01;35:*.mp4=01;35:*.MP4=01;35:*.mov=01;35:*.MOV=01;35:*.mp3=01;35:*.MP3=01;35:*.mpc=01;35:*.MPC=01;35:*.mpeg=01;35:*.MPEG=01;35:*.mpg=01;35:*.MPG=01;35:*.ogg=01;35:*.OGG=01;35:*.pbm=01;35:*.pgm=01;35:*.png=01;35:*.PNG=01;35:*.ppm=01;35:*.ram=01;35:*.RAM=01;35:*.rm=01;35:*.RM=01;35:*.tga=01;35:*.TGA=01;35:*.tif=01;35:*.TIF=01;35:*.tiff=01;35:*.TIFF=01;35:*.wav=01;35:*.WAV=01;35:*.wma=01;35:*.WMA=01;35:*.wmv=01;35:*.WMV=01;35:*.xbm=01;35:*.xcf=01;35:*.xpm=01;35:*.xwd=01;35:*.XWD=01;35:*.doc=01;37:*.txt=01;37:*.dat=01;37:*.wp=01;37:*.wri=01;37:*.diz=01;37:*.html=01;37:*.htm=01;37:*.ps=01;37:*.dvi=01;37:*.tex=01;37:*.msg=01;37:*.pdf=01;37:*.log=01;37:*.faq=01;37:*.DOC=01;37:*.TXT=01;37:*.DAT=01;37:*.WP=01;37:*.WRI=01;37:*.DIZ=01;37:*.HTML=01;37:*.HTM=01;37:*.PS=01;37:*.DVI=01;37:*.TEX=01;37:*.MSG=01;37:*.PDF=01;37:*.LOG=01;37:*.FAQ=01;37:*.pas=01;33;44:*.c=01;33;44:*.cpp=01;33;44:*.pp=01;33;44:*.bas=01;33;44:*.h=01;33;44:*.tpu=01;33;44:*.awk=01;33;44:*.sh=01;33;44:*.PAS=01;33;44:*.C=01;33;44:*.CPP=01;33;44:*.PP=01;33;44:*.BAS=01;33;44:*.H=01;33;44:*.TPU=01;33;44:*.AWK=01;33;44:*.SH=01;33;44:*~=30;44:*.bak=30;44:*.orig=30;44:*.bck=30;44:*.BAK=30;44:*.ORIG=30;44:*.BCK=30;44:*.rej=01\:31\:41: GDK_USE_XFT => 1 SSH_AUTH_SOCK => deleted TERMCAP => SC|screen|VT 100/ANSI X3.64 virtual terminal:\ :DO=\E[%dB:LE=\E[%dD:RI=\E[%dC:UP=\E[%dA:bs:bt=\E[Z:\ :cd=\E[J:ce=\E[K:cl=\E[H\E[J:cm=\E[%i%d;%dH:ct=\E[3g:\ :do=^J:nd=\E[C:pt:rc=\E8:rs=\Ec:sc=\E7:st=\EH:up=\EM:\ :le=^H:bl=^G:cr=^M:it#8:ho=\E[H:nw=\EE:ta=^I:is=\E)0:\ :li#79:co#118:am:xn:xv:LP:sr=\EM:al=\E[L:AL=\E[%dL:\ :cs=\E[%i%d;%dr:dl=\E[M:DL=\E[%dM:dc=\E[P:DC=\E[%dP:\ :im=\E[4h:ei=\E[4l:mi:IC=\E[%d@:ks=\E[?1h\E=:\ :ke=\E[?1l\E>:vi=\E[?25l:ve=\E[34h\E[?25h:vs=\E[34l:\ :ti=\E[?1049h:te=\E[?1049l:us=\E[4m:ue=\E[24m:so=\E[3m:\ :se=\E[23m:mb=\E[5m:md=\E[1m:mr=\E[7m:me=\E[m:ms:\ :Co#8:pa#64:AF=\E[3%dm:AB=\E[4%dm:op=\E[39;49m:AX:\ :vb=\Eg:G0:as=\E(0:ae=\E(B:\ :ac=\140\140aaffggjjkkllmmnnooppqqrrssttuuvvwwxxyyzz{{||}}~~..--++,,hhII00:\ :po=\E[5i:pf=\E[4i:k0=\E[10~:k1=\EOP:k2=\EOQ:k3=\EOR:\ :k4=\EOS:k5=\E[15~:k6=\E[17~:k7=\E[18~:k8=\E[19~:\ :k9=\E[20~:k;=\E[21~:F1=\E[23~:F2=\E[24~:F3=\E[1;2P:\ :F4=\E[1;2Q:F5=\E[1;2R:F6=\E[1;2S:F7=\E[15;2~:\ :F8=\E[17;2~:F9=\E[18;2~:FA=\E[19;2~:kb=^H:K2=\EOE:\ :kB=\E[Z:kF=\E[1;2B:kR=\E[1;2A:*4=\E[3;2~:*7=\E[1;2F:\ :#2=\E[1;2H:#3=\E[2;2~:#4=\E[1;2D:%c=\E[6;2~:%e=\E[5;2~:\ :%i=\E[1;2C:kh=\E[1~:@1=\E[1~:kH=\E[4~:@7=\E[4~:\ :kN=\E[6~:kP=\E[5~:kI=\E[2~:kD=\E[3~:ku=\EOA:kd=\EOB:\ :kr=\EOC:kl=\EOD:km: ftp_proxy => http://192.168.246.254:800/ TMOUT => 600 MAKELEVEL => 1 PAGER => less MFLAGS => T1LIB_CONFIG => /usr/share/t1lib/t1lib.config MINICOM => -c on PATH => /usr/local/sbin:/usr/sbin:/sbin:/usr/local/bin:/usr/bin:/bin:/usr/games:/usr/lib64/qt/bin MAIL => /var/mail/root STY => 25548.pts-0.wintermute _ => /root/apps5/php-7.0.25/sapi/cli/php LC_COLLATE => C PWD => /root/apps5/php-7.0.25 INPUTRC => /etc/inputrc EDITOR => /usr/bin/joe LANG => en_US.UTF-8 TEST_PHP_EXECUTABLE => /root/apps5/php-7.0.25/sapi/cli/php TERMNUMBER => 0 QT4DIR => /usr/lib64/qt HTTPS_PROXY => http://192.168.246.254:800/ HOME => /root SHLVL => 4 LESSCHARSET => utf-8 LS_OPTIONS => -F -b -T 0 --color=auto LOGNAME => root G_FILENAME_ENCODING => @locale LESS => -M VISUAL => /usr/bin/joe WINDOW => 0 SSH_CONNECTION => deleted LESSOPEN => |lesspipe.sh %s PKG_CONFIG_PATH => /usr/local/lib64/pkgconfig:/usr/lib64/pkgconfig CC => cc HISTTIMEFORMAT => %F %T G_BROKEN_FILENAMES => 1 HISTFILE => /root/.bash_history0 PHP Variables Variable => Value $_SERVER['CPLUS_INCLUDE_PATH'] => /usr/lib64/qt/include $_SERVER['MANPATH'] => /usr/local/man:/usr/man:/usr/local/share/man $_SERVER['NNTPSERVER'] => news.openventura.work $_SERVER['HOSTNAME'] => wintermute.openventura.work $_SERVER['TEST_PHP_SRCDIR'] => /root/apps5/php-7.0.25 $_SERVER['ORGANIZATION'] => openventura $_SERVER['SHELL'] => /bin/bash $_SERVER['TERM'] => screen $_SERVER['MAKEFLAGS'] => $_SERVER['HISTSIZE'] => 80000 $_SERVER['SSH_CLIENT'] => deleted $_SERVER['TEST_PHPDBG_EXECUTABLE'] => /root/apps5/php-7.0.25/sapi/phpdbg/phpdbg $_SERVER['CVSROOT'] => /home/BASE-cvs/cvsroot $_SERVER['SSH_TTY'] => deleted $_SERVER['HISTFILESIZE'] => 80000 $_SERVER['USER'] => root $_SERVER['http_proxy'] => http://192.168.246.254:800/ $_SERVER['LS_COLORS'] => no=00:fi=00:di=01;34:ln=01;36:pi=40;33:so=01;35:do=01;35:bd=40;33;01:cd=40;33;01:or=40;31;01:su=37;41:sg=30;43:tw=30;42:ow=34;42:st=37;44:ex=01;32:*.bat=01;32:*.BAT=01;32:*.btm=01;32:*.BTM=01;32:*.cmd=01;32:*.CMD=01;32:*.com=01;32:*.COM=01;32:*.dll=01;32:*.DLL=01;32:*.exe=01;32:*.EXE=01;32:*.lrz=01;31:*.7zip=01;31:*.arj=01;31:*.bz2=01;31:*.deb=01;31:*.gz=01;31:*.lzh=01;31:*.rar=01;31:*.dar=01;31:*.enc=01;31;44:*.par2=01;31;42:*.RAR=01;31:*.rpm=01;31:*.rz=01;31:*.tar=01;31:*.taz=01;31:*.tb2=01;31:*.tbz2=01;31:*.tbz=01;31:*.tgz=01;31:*.txz=01;31:*.tz2=01;31:*.z=01;31:*.Z=01;31:*.zip=01;31:*.ZIP=01;31:*.zoo=01;31:*.asf=01;35:*.ASF=01;35:*.avi=01;35:*.AVI=01;35:*.bmp=01;35:*.BMP=01;35:*.flac=01;35:*.FLAC=01;35:*.gif=01;35:*.GIF=01;35:*.jpg=01;35:*.JPG=01;35:*.jpeg=01;35:*.JPEG=01;35:*.m2a=01;35:*.M2A=01;35:*.m2v=01;35:*.M2V=01;35:*.m4a=01;35:*.M4A=01;35:*.m4p=01;35:*.M4P=01;35:*.m4v=01;35:*.M4V=01;35:*.mp4=01;35:*.MP4=01;35:*.mov=01;35:*.MOV=01;35:*.mp3=01;35:*.MP3=01;35:*.mpc=01;35:*.MPC=01;35:*.mpeg=01;35:*.MPEG=01;35:*.mpg=01;35:*.MPG=01;35:*.ogg=01;35:*.OGG=01;35:*.pbm=01;35:*.pgm=01;35:*.png=01;35:*.PNG=01;35:*.ppm=01;35:*.ram=01;35:*.RAM=01;35:*.rm=01;35:*.RM=01;35:*.tga=01;35:*.TGA=01;35:*.tif=01;35:*.TIF=01;35:*.tiff=01;35:*.TIFF=01;35:*.wav=01;35:*.WAV=01;35:*.wma=01;35:*.WMA=01;35:*.wmv=01;35:*.WMV=01;35:*.xbm=01;35:*.xcf=01;35:*.xpm=01;35:*.xwd=01;35:*.XWD=01;35:*.doc=01;37:*.txt=01;37:*.dat=01;37:*.wp=01;37:*.wri=01;37:*.diz=01;37:*.html=01;37:*.htm=01;37:*.ps=01;37:*.dvi=01;37:*.tex=01;37:*.msg=01;37:*.pdf=01;37:*.log=01;37:*.faq=01;37:*.DOC=01;37:*.TXT=01;37:*.DAT=01;37:*.WP=01;37:*.WRI=01;37:*.DIZ=01;37:*.HTML=01;37:*.HTM=01;37:*.PS=01;37:*.DVI=01;37:*.TEX=01;37:*.MSG=01;37:*.PDF=01;37:*.LOG=01;37:*.FAQ=01;37:*.pas=01;33;44:*.c=01;33;44:*.cpp=01;33;44:*.pp=01;33;44:*.bas=01;33;44:*.h=01;33;44:*.tpu=01;33;44:*.awk=01;33;44:*.sh=01;33;44:*.PAS=01;33;44:*.C=01;33;44:*.CPP=01;33;44:*.PP=01;33;44:*.BAS=01;33;44:*.H=01;33;44:*.TPU=01;33;44:*.AWK=01;33;44:*.SH=01;33;44:*~=30;44:*.bak=30;44:*.orig=30;44:*.bck=30;44:*.BAK=30;44:*.ORIG=30;44:*.BCK=30;44:*.rej=01\:31\:41: $_SERVER['GDK_USE_XFT'] => 1 $_SERVER['SSH_AUTH_SOCK'] => deleted $_SERVER['TERMCAP'] => SC|screen|VT 100/ANSI X3.64 virtual terminal:\ :DO=\E[%dB:LE=\E[%dD:RI=\E[%dC:UP=\E[%dA:bs:bt=\E[Z:\ :cd=\E[J:ce=\E[K:cl=\E[H\E[J:cm=\E[%i%d;%dH:ct=\E[3g:\ :do=^J:nd=\E[C:pt:rc=\E8:rs=\Ec:sc=\E7:st=\EH:up=\EM:\ :le=^H:bl=^G:cr=^M:it#8:ho=\E[H:nw=\EE:ta=^I:is=\E)0:\ :li#79:co#118:am:xn:xv:LP:sr=\EM:al=\E[L:AL=\E[%dL:\ :cs=\E[%i%d;%dr:dl=\E[M:DL=\E[%dM:dc=\E[P:DC=\E[%dP:\ :im=\E[4h:ei=\E[4l:mi:IC=\E[%d@:ks=\E[?1h\E=:\ :ke=\E[?1l\E>:vi=\E[?25l:ve=\E[34h\E[?25h:vs=\E[34l:\ :ti=\E[?1049h:te=\E[?1049l:us=\E[4m:ue=\E[24m:so=\E[3m:\ :se=\E[23m:mb=\E[5m:md=\E[1m:mr=\E[7m:me=\E[m:ms:\ :Co#8:pa#64:AF=\E[3%dm:AB=\E[4%dm:op=\E[39;49m:AX:\ :vb=\Eg:G0:as=\E(0:ae=\E(B:\ :ac=\140\140aaffggjjkkllmmnnooppqqrrssttuuvvwwxxyyzz{{||}}~~..--++,,hhII00:\ :po=\E[5i:pf=\E[4i:k0=\E[10~:k1=\EOP:k2=\EOQ:k3=\EOR:\ :k4=\EOS:k5=\E[15~:k6=\E[17~:k7=\E[18~:k8=\E[19~:\ :k9=\E[20~:k;=\E[21~:F1=\E[23~:F2=\E[24~:F3=\E[1;2P:\ :F4=\E[1;2Q:F5=\E[1;2R:F6=\E[1;2S:F7=\E[15;2~:\ :F8=\E[17;2~:F9=\E[18;2~:FA=\E[19;2~:kb=^H:K2=\EOE:\ :kB=\E[Z:kF=\E[1;2B:kR=\E[1;2A:*4=\E[3;2~:*7=\E[1;2F:\ :#2=\E[1;2H:#3=\E[2;2~:#4=\E[1;2D:%c=\E[6;2~:%e=\E[5;2~:\ :%i=\E[1;2C:kh=\E[1~:@1=\E[1~:kH=\E[4~:@7=\E[4~:\ :kN=\E[6~:kP=\E[5~:kI=\E[2~:kD=\E[3~:ku=\EOA:kd=\EOB:\ :kr=\EOC:kl=\EOD:km: $_SERVER['ftp_proxy'] => http://192.168.246.254:800/ $_SERVER['TMOUT'] => 600 $_SERVER['MAKELEVEL'] => 1 $_SERVER['PAGER'] => less $_SERVER['MFLAGS'] => $_SERVER['T1LIB_CONFIG'] => /usr/share/t1lib/t1lib.config $_SERVER['MINICOM'] => -c on $_SERVER['PATH'] => /usr/local/sbin:/usr/sbin:/sbin:/usr/local/bin:/usr/bin:/bin:/usr/games:/usr/lib64/qt/bin $_SERVER['MAIL'] => /var/mail/root $_SERVER['STY'] => 25548.pts-0.wintermute $_SERVER['_'] => /root/apps5/php-7.0.25/sapi/cli/php $_SERVER['LC_COLLATE'] => C $_SERVER['PWD'] => /root/apps5/php-7.0.25 $_SERVER['INPUTRC'] => /etc/inputrc $_SERVER['EDITOR'] => /usr/bin/joe $_SERVER['LANG'] => en_US.UTF-8 $_SERVER['TEST_PHP_EXECUTABLE'] => /root/apps5/php-7.0.25/sapi/cli/php $_SERVER['TERMNUMBER'] => 0 $_SERVER['QT4DIR'] => /usr/lib64/qt $_SERVER['HTTPS_PROXY'] => http://192.168.246.254:800/ $_SERVER['HOME'] => /root $_SERVER['SHLVL'] => 4 $_SERVER['LESSCHARSET'] => utf-8 $_SERVER['LS_OPTIONS'] => -F -b -T 0 --color=auto $_SERVER['LOGNAME'] => root $_SERVER['G_FILENAME_ENCODING'] => @locale $_SERVER['LESS'] => -M $_SERVER['VISUAL'] => /usr/bin/joe $_SERVER['WINDOW'] => 0 $_SERVER['SSH_CONNECTION'] => deleted $_SERVER['LESSOPEN'] => |lesspipe.sh %s $_SERVER['PKG_CONFIG_PATH'] => /usr/local/lib64/pkgconfig:/usr/lib64/pkgconfig $_SERVER['CC'] => cc $_SERVER['HISTTIMEFORMAT'] => %F %T $_SERVER['G_BROKEN_FILENAMES'] => 1 $_SERVER['HISTFILE'] => /root/.bash_history0 $_SERVER['PHP_SELF'] => $_SERVER['SCRIPT_NAME'] => $_SERVER['SCRIPT_FILENAME'] => $_SERVER['PATH_TRANSLATED'] => $_SERVER['DOCUMENT_ROOT'] => $_SERVER['REQUEST_TIME_FLOAT'] => 1510192359.0343 $_SERVER['REQUEST_TIME'] => 1510192359 $_SERVER['argv'] => Array ( ) $_SERVER['argc'] => 0 PHP License This program is free software; you can redistribute it and/or modify it under the terms of the PHP License as published by the PHP Group and included in the distribution in the file: LICENSE This program is distributed in the hope that it will be useful, but WITHOUT ANY WARRANTY; without even the implied warranty of MERCHANTABILITY or FITNESS FOR A PARTICULAR PURPOSE. If you did not receive a copy of the PHP license, or have any questions about PHP licensing, please contact license@php.net.
« previous php.qa.reports (#33978) next »