Make test of php results

From: Date: Fri, 20 Apr 2018 04:17:30 +0000
Subject: Make test of php results
Groups: php.qa.reports 
Request: Send a blank email to php-qa-reports+get-33988@lists.php.net to get a copy of this message
The make test command asked that I send the results file to you. Regards Peter Whyte | Technical Specialist Information and Technology Partners ________________________________ DAF | DES | DITID | DNRME |and Partners Floor 10 | 41 George | 41 George Street, Brisbane, Q 4001 | GPO Box 2454 | Brisbane Qld 4001 Tel (07) 3087 8726 | Mob 0409 266 249 Email peter.whyte@daf.qld.gov.au<mailto:peter.whyte@daf.qld.gov.au> ------------------------------ The information in this email together with any attachments is intended only for the person or entity to which it is addressed and may contain confidential and/or privileged material. There is no waiver of any confidentiality/privilege by your inadvertent receipt of this material. Any form of review, disclosure, modification, distribution and/or publication of this email message is prohibited, unless as a necessary part of Departmental business. If you have received this message in error, you are asked to inform the sender as quickly as possible and delete this message and any copies of this message from your computer and/or your computer system network. ------------------------------

===================================================================== EXPECTED FAILED TEST SUMMARY --------------------------------------------------------------------- Test open_basedir configuration [tests/security/open_basedir_linkinfo.phpt] XFAIL REASON: BUG: open_basedir cannot delete symlink to prohibited file. See also bugs 48111 and 52176. Inconsistencies when accessing protected members [Zend/tests/access_modifiers_008.phpt] XFAIL REASON: Discussion: http://marc.info/?l=php-internals&m=120221184420957&w=2 Inconsistencies when accessing protected members - 2 [Zend/tests/access_modifiers_009.phpt] XFAIL REASON: Discussion: http://marc.info/?l=php-internals&m=120221184420957&w=2 Bug #48770 (call_user_func_array() fails to call parent from inheriting class) [Zend/tests/bug48770.phpt] XFAIL REASON: See Bug #48770 Bug #48770 (call_user_func_array() fails to call parent from inheriting class) [Zend/tests/bug48770_2.phpt] XFAIL REASON: See Bug #48770 Bug #48770 (call_user_func_array() fails to call parent from inheriting class) [Zend/tests/bug48770_3.phpt] XFAIL REASON: See Bug #48770 Bug #64896 (Segfault with gc_collect_cycles using unserialize on certain objects) [Zend/tests/bug64896.phpt] XFAIL REASON: We can not fix this bug without a significant (performace slow down) change to gc Initial value of static var in method depends on the include time of the class definition [Zend/tests/method_static_var.phpt] XFAIL REASON: Maybe not a bug DateTime::add() -- fall type2 type3 [ext/date/tests/DateTime_add-fall-type2-type3.phpt] XFAIL REASON: Various bugs exist DateTime::add() -- fall type3 type2 [ext/date/tests/DateTime_add-fall-type3-type2.phpt] XFAIL REASON: Various bugs exist DateTime::add() -- fall type3 type3 [ext/date/tests/DateTime_add-fall-type3-type3.phpt] XFAIL REASON: Various bugs exist DateTime::add() -- spring type2 type3 [ext/date/tests/DateTime_add-spring-type2-type3.phpt] XFAIL REASON: Various bugs exist DateTime::add() -- spring type3 type2 [ext/date/tests/DateTime_add-spring-type3-type2.phpt] XFAIL REASON: Various bugs exist DateTime::add() -- spring type3 type3 [ext/date/tests/DateTime_add-spring-type3-type3.phpt] XFAIL REASON: Various bugs exist DateTime::diff() -- fall type2 type3 [ext/date/tests/DateTime_diff-fall-type2-type3.phpt] XFAIL REASON: Various bugs exist DateTime::diff() -- fall type3 type2 [ext/date/tests/DateTime_diff-fall-type3-type2.phpt] XFAIL REASON: Various bugs exist DateTime::diff() -- fall type3 type3 [ext/date/tests/DateTime_diff-fall-type3-type3.phpt] XFAIL REASON: Various bugs exist DateTime::diff() -- spring type2 type3 [ext/date/tests/DateTime_diff-spring-type2-type3.phpt] XFAIL REASON: Various bugs exist DateTime::diff() -- spring type3 type2 [ext/date/tests/DateTime_diff-spring-type3-type2.phpt] XFAIL REASON: Various bugs exist DateTime::diff() -- spring type3 type3 [ext/date/tests/DateTime_diff-spring-type3-type3.phpt] XFAIL REASON: Various bugs exist DateTime::sub() -- fall type2 type3 [ext/date/tests/DateTime_sub-fall-type2-type3.phpt] XFAIL REASON: Various bugs exist DateTime::sub() -- fall type3 type2 [ext/date/tests/DateTime_sub-fall-type3-type2.phpt] XFAIL REASON: Various bugs exist DateTime::sub() -- fall type3 type3 [ext/date/tests/DateTime_sub-fall-type3-type3.phpt] XFAIL REASON: Various bugs exist DateTime::sub() -- spring type2 type3 [ext/date/tests/DateTime_sub-spring-type2-type3.phpt] XFAIL REASON: Various bugs exist DateTime::sub() -- spring type3 type2 [ext/date/tests/DateTime_sub-spring-type3-type2.phpt] XFAIL REASON: Various bugs exist DateTime::sub() -- spring type3 type3 [ext/date/tests/DateTime_sub-spring-type3-type3.phpt] XFAIL REASON: Various bugs exist RFC: DateTime and Daylight Saving Time Transitions (zone type 3, bd2) [ext/date/tests/rfc-datetime_and_daylight_saving_time-type3-bd2.phpt] XFAIL REASON: Still not quite right RFC: DateTime and Daylight Saving Time Transitions (zone type 3, fs) [ext/date/tests/rfc-datetime_and_daylight_saving_time-type3-fs.phpt] XFAIL REASON: Still not quite right Bug #42718 (unsafe_raw filter not applied when configured as default filter) [ext/filter/tests/bug42718.phpt] XFAIL REASON: FILTER_UNSAFE_RAW not applied when configured as default filter, even with flags Bug #67296 (filter_input doesn't validate variables) [ext/filter/tests/bug49184.phpt] XFAIL REASON: See Bug #49184 Bug #67167: filter_var(null,FILTER_VALIDATE_BOOLEAN,FILTER_NULL_ON_FAILURE) returns null [ext/filter/tests/bug67167.02.phpt] XFAIL REASON: Requires php_zval_filter to not use convert_to_string for all filters. Bug #72663: Create an Unexpected Object and Don't Invoke __wakeup() in Deserialization [ext/standard/tests/strings/bug72663_3.phpt] XFAIL REASON: Memory leak, TBF later. Bug #70470 (Built-in server truncates headers spanning over TCP packets) [sapi/cli/tests/bug70470.phpt] XFAIL REASON: bug is not fixed yet ===================================================================== ===================================================================== FAILED TEST SUMMARY --------------------------------------------------------------------- Test open_basedir configuration [tests/security/open_basedir_is_executable.phpt] Bug #60350 No string escape code for ESC (ascii 27), normally \e [Zend/tests/bug60350.phpt] Bug #64267 (CURLOPT_INFILE doesn't allow reset) [ext/curl/tests/bug64267.phpt] Bug #27780 (strtotime(+1 xxx) returns a wrong date/time) [ext/date/tests/bug27780.phpt] Bug #32555 (strtotime("tomorrow") can return false) [ext/date/tests/bug32555.phpt] Bug #33532 (Different output for strftime() and date()) [ext/date/tests/bug33532.phpt] Bug #45866 (decimal values fed to DateTime->modify() causes long execution times) [ext/date/tests/bug45866.phpt] Bug #53437 DateInterval unserialize bad data, 32 bit [ext/date/tests/bug53437_var3.phpt] Test 5: HTML Test [ext/dom/tests/dom005.phpt] Bug #48147 (iconv with //IGNORE cuts the string) [ext/iconv/tests/bug48147.phpt] Bug #51250 (iconv_mime_decode() does not ignore malformed Q-encoded words) [ext/iconv/tests/bug51250.phpt] Bug #52211 (iconv() returns part of string on error) [ext/iconv/tests/bug52211.phpt] EUC-JP to ISO-2022-JP [ext/iconv/tests/eucjp2iso2022jp.phpt] iconv() test 3 [ext/iconv/tests/iconv003.phpt] iconv_mime_encode() sanity cheeck. [ext/iconv/tests/iconv004.phpt] Test the basics to function iconv. [ext/iconv/tests/iconv_basic_001.phpt] Test iconv_mime_encode() function : usage variations - Pass different data types to headers arg [ext/iconv/tests/iconv_mime_decode_headers_variation1.phpt] Test iconv_mime_decode() function : usage variations - Pass different data types to header arg [ext/iconv/tests/iconv_mime_decode_variation1.phpt] Test iconv_mime_decode() function : usage variations - Pass different data types to charset arg [ext/iconv/tests/iconv_mime_decode_variation3.phpt] iconv_mime_encode() [ext/iconv/tests/iconv_mime_encode.phpt] Test iconv_strlen() function : error conditions - pass an unknown encoding [ext/iconv/tests/iconv_strlen_error2.phpt] Test iconv_strlen() function : usage variations - Pass different data types as $encoding arg [ext/iconv/tests/iconv_strlen_variation2.phpt] iconv_strpos() [ext/iconv/tests/iconv_strpos.phpt] Test iconv_strpos() function : error conditions - Pass unknown encoding [ext/iconv/tests/iconv_strpos_error2.phpt] Test iconv_strpos() function : usage variations - pass different data types as $charset arg [ext/iconv/tests/iconv_strpos_variation4.phpt] iconv_strrpos() [ext/iconv/tests/iconv_strrpos.phpt] Test iconv_strrpos() function : error conditions - pass an unknown encoding [ext/iconv/tests/iconv_strrpos_error2.phpt] Test iconv_strrpos() function : usage variations - pass different data types as $encoding arg [ext/iconv/tests/iconv_strrpos_variation3.phpt] iconv_substr() [ext/iconv/tests/iconv_substr.phpt] Test iconv_substr() function : error conditions - Pass an unknown encoding [ext/iconv/tests/iconv_substr_error2.phpt] ldap_connect() - Connection errors [ext/ldap/tests/ldap_connect_error.phpt] ldap_connect() - Variation [ext/ldap/tests/ldap_connect_variation.phpt] ldap_get_option() - More ldap_get_option() operations [ext/ldap/tests/ldap_get_option_variation.phpt] ldap_set_option() - More ldap_set_option() operations [ext/ldap/tests/ldap_set_option_variation.phpt] Bug #61367: open_basedir bypass in libxml RSHUTDOWN: write test [ext/libxml/tests/bug61367-write.phpt] Test posix_getgrgid() function : basic functionality [ext/posix/tests/posix_getgrgid_basic.phpt] SimpleXML: XPath [ext/simplexml/tests/008.phpt] Test array_change_key_case() function : usage variations - Different strings as keys [ext/standard/tests/array/array_change_key_case_variation8.phpt] Test arsort() function : usage variations - sort strings [ext/standard/tests/array/arsort_variation5.phpt] Test asort() function : usage variations - sort strings [ext/standard/tests/array/asort_variation5.phpt] Test krsort() function : usage variations - sort strings [ext/standard/tests/array/krsort_variation5.phpt] Test ksort() function : usage variations - sort strings [ext/standard/tests/array/ksort_variation5.phpt] Test natcasesort() function : usage variations - different string types [ext/standard/tests/array/natcasesort_variation4.phpt] Test rsort() function : usage variations - String values [ext/standard/tests/array/rsort_variation5.phpt] Test sort() function : usage variations - sort strings [ext/standard/tests/array/sort_variation5.phpt] Bug #43008 (php://filter uris ignore url encoded filternames and can't handle slashes) [ext/standard/tests/file/bug43008.phpt] Test disk_free_space and its alias diskfreespace() functions : basic functionality [ext/standard/tests/file/disk_free_space_basic.phpt] Test filetype() function: Check character type [ext/standard/tests/file/filetype_variation2.phpt] flock() tests [ext/standard/tests/file/flock.phpt] Test flock() function: Basic functionality [ext/standard/tests/file/flock_basic.phpt] Test flock() function: Variations [ext/standard/tests/file/flock_variation.phpt] Test glob() function: basic functions [ext/standard/tests/file/glob_basic.phpt] Test is_executable() function: usage variations - diff. path notations [ext/standard/tests/file/is_executable_variation1.phpt] Test lstat() and stat() functions: usage variations - dir/file name stored in object [ext/standard/tests/file/lstat_stat_variation18.phpt] Test lstat() and stat() functions: usage variations - dir/file names in array [ext/standard/tests/file/lstat_stat_variation19.phpt] Test lstat() and stat() functions: usage variations - link names stored in array/object [ext/standard/tests/file/lstat_stat_variation20.phpt] Test lstat() and stat() functions: usage variations - writing data into file [ext/standard/tests/file/lstat_stat_variation7.phpt] Test popen() and pclose function: error conditions [ext/standard/tests/file/popen_pclose_error-sunos.phpt] Test touch() function : basic functionality [ext/standard/tests/file/touch_basic.phpt] Test function getservbyname() [ext/standard/tests/general_functions/getservbyname_basic.phpt] Test function getservbyport() by calling it more than or less than its expected arguments [ext/standard/tests/general_functions/getservbyport_basic.phpt] Test function getservbyport() by calling it more than or less than its expected arguments [ext/standard/tests/general_functions/getservbyport_variation1.phpt] Test ip2long() function : usage variation 2, 32 bit [ext/standard/tests/network/ip2long_variation2.phpt] Bug #64146 (serialize incorrectly saving objects when they are cloned) [ext/standard/tests/serialize/bug64146.phpt] Glob wrapper bypasses open_basedir [ext/standard/tests/streams/glob-wrapper.phpt] Test setlocale() function : basic functionality - setting system locale to a specific [ext/standard/tests/strings/setlocale_basic1.phpt] Test setlocale() function : basic functionality - set locale using an array [ext/standard/tests/strings/setlocale_basic2.phpt] Test setlocale() function : basic functionality - passing multiple locales as argument [ext/standard/tests/strings/setlocale_basic3.phpt] Test setlocale() function : usage variations - passing multiple valid/invlaid locales as argument [ext/standard/tests/strings/setlocale_variation1.phpt] Test setlocale() function : usage variations - setting system locale = 0 [ext/standard/tests/strings/setlocale_variation3.phpt] Test strrchr() function : usage variations - heredoc string containing escape sequences for 'haystack' [ext/standard/tests/strings/strrchr_variation5.phpt] Test strspn() function : usage variations - with heredoc strings, varying mask & default start and len args [ext/standard/tests/strings/strspn_variation6.phpt] Test strptime() function : basic functionality [ext/standard/tests/time/strptime_basic.phpt] Bug #64230 (XMLReader does not suppress errors) [ext/xmlreader/tests/bug64230.phpt] Check cli_process_title support on Unix [sapi/cli/tests/cli_process_title_unix.phpt] ===================================================================== ===================================================================== WARNED TEST SUMMARY --------------------------------------------------------------------- Phar: bug #69958: Segfault in Phar::convertToData on invalid file [ext/phar/tests/bug69958.phpt] (warn: XFAIL section but test passes) Bug #69111 Crash in SessionHandler::read() [ext/session/tests/bug69111.phpt] (warn: XFAIL section but test passes) Bug #70172 - Use After Free Vulnerability in unserialize() [ext/standard/tests/serialize/bug70172.phpt] (warn: XFAIL section but test passes) ===================================================================== ===================================================================== TEST RESULT SUMMARY --------------------------------------------------------------------- Exts skipped : 44 Exts tested : 35 --------------------------------------------------------------------- Number of tests : 13930 9802 Tests skipped : 4128 ( 29.6%) -------- Tests warned : 3 ( 0.0%) ( 0.0%) Tests failed : 75 ( 0.5%) ( 0.8%) Expected fail : 33 ( 0.2%) ( 0.3%) Tests passed : 9691 ( 69.6%) ( 98.9%) --------------------------------------------------------------------- Time taken : 1119 seconds ===================================================================== ===================================================================== EXPECTED FAILED TEST SUMMARY --------------------------------------------------------------------- Test open_basedir configuration [tests/security/open_basedir_linkinfo.phpt] XFAIL REASON: BUG: open_basedir cannot delete symlink to prohibited file. See also bugs 48111 and 52176. Inconsistencies when accessing protected members [Zend/tests/access_modifiers_008.phpt] XFAIL REASON: Discussion: http://marc.info/?l=php-internals&m=120221184420957&w=2 Inconsistencies when accessing protected members - 2 [Zend/tests/access_modifiers_009.phpt] XFAIL REASON: Discussion: http://marc.info/?l=php-internals&m=120221184420957&w=2 Bug #48770 (call_user_func_array() fails to call parent from inheriting class) [Zend/tests/bug48770.phpt] XFAIL REASON: See Bug #48770 Bug #48770 (call_user_func_array() fails to call parent from inheriting class) [Zend/tests/bug48770_2.phpt] XFAIL REASON: See Bug #48770 Bug #48770 (call_user_func_array() fails to call parent from inheriting class) [Zend/tests/bug48770_3.phpt] XFAIL REASON: See Bug #48770 Bug #64896 (Segfault with gc_collect_cycles using unserialize on certain objects) [Zend/tests/bug64896.phpt] XFAIL REASON: We can not fix this bug without a significant (performace slow down) change to gc Initial value of static var in method depends on the include time of the class definition [Zend/tests/method_static_var.phpt] XFAIL REASON: Maybe not a bug DateTime::add() -- fall type2 type3 [ext/date/tests/DateTime_add-fall-type2-type3.phpt] XFAIL REASON: Various bugs exist DateTime::add() -- fall type3 type2 [ext/date/tests/DateTime_add-fall-type3-type2.phpt] XFAIL REASON: Various bugs exist DateTime::add() -- fall type3 type3 [ext/date/tests/DateTime_add-fall-type3-type3.phpt] XFAIL REASON: Various bugs exist DateTime::add() -- spring type2 type3 [ext/date/tests/DateTime_add-spring-type2-type3.phpt] XFAIL REASON: Various bugs exist DateTime::add() -- spring type3 type2 [ext/date/tests/DateTime_add-spring-type3-type2.phpt] XFAIL REASON: Various bugs exist DateTime::add() -- spring type3 type3 [ext/date/tests/DateTime_add-spring-type3-type3.phpt] XFAIL REASON: Various bugs exist DateTime::diff() -- fall type2 type3 [ext/date/tests/DateTime_diff-fall-type2-type3.phpt] XFAIL REASON: Various bugs exist DateTime::diff() -- fall type3 type2 [ext/date/tests/DateTime_diff-fall-type3-type2.phpt] XFAIL REASON: Various bugs exist DateTime::diff() -- fall type3 type3 [ext/date/tests/DateTime_diff-fall-type3-type3.phpt] XFAIL REASON: Various bugs exist DateTime::diff() -- spring type2 type3 [ext/date/tests/DateTime_diff-spring-type2-type3.phpt] XFAIL REASON: Various bugs exist DateTime::diff() -- spring type3 type2 [ext/date/tests/DateTime_diff-spring-type3-type2.phpt] XFAIL REASON: Various bugs exist DateTime::diff() -- spring type3 type3 [ext/date/tests/DateTime_diff-spring-type3-type3.phpt] XFAIL REASON: Various bugs exist DateTime::sub() -- fall type2 type3 [ext/date/tests/DateTime_sub-fall-type2-type3.phpt] XFAIL REASON: Various bugs exist DateTime::sub() -- fall type3 type2 [ext/date/tests/DateTime_sub-fall-type3-type2.phpt] XFAIL REASON: Various bugs exist DateTime::sub() -- fall type3 type3 [ext/date/tests/DateTime_sub-fall-type3-type3.phpt] XFAIL REASON: Various bugs exist DateTime::sub() -- spring type2 type3 [ext/date/tests/DateTime_sub-spring-type2-type3.phpt] XFAIL REASON: Various bugs exist DateTime::sub() -- spring type3 type2 [ext/date/tests/DateTime_sub-spring-type3-type2.phpt] XFAIL REASON: Various bugs exist DateTime::sub() -- spring type3 type3 [ext/date/tests/DateTime_sub-spring-type3-type3.phpt] XFAIL REASON: Various bugs exist RFC: DateTime and Daylight Saving Time Transitions (zone type 3, bd2) [ext/date/tests/rfc-datetime_and_daylight_saving_time-type3-bd2.phpt] XFAIL REASON: Still not quite right RFC: DateTime and Daylight Saving Time Transitions (zone type 3, fs) [ext/date/tests/rfc-datetime_and_daylight_saving_time-type3-fs.phpt] XFAIL REASON: Still not quite right Bug #42718 (unsafe_raw filter not applied when configured as default filter) [ext/filter/tests/bug42718.phpt] XFAIL REASON: FILTER_UNSAFE_RAW not applied when configured as default filter, even with flags Bug #67296 (filter_input doesn't validate variables) [ext/filter/tests/bug49184.phpt] XFAIL REASON: See Bug #49184 Bug #67167: filter_var(null,FILTER_VALIDATE_BOOLEAN,FILTER_NULL_ON_FAILURE) returns null [ext/filter/tests/bug67167.02.phpt] XFAIL REASON: Requires php_zval_filter to not use convert_to_string for all filters. Bug #72663: Create an Unexpected Object and Don't Invoke __wakeup() in Deserialization [ext/standard/tests/strings/bug72663_3.phpt] XFAIL REASON: Memory leak, TBF later. Bug #70470 (Built-in server truncates headers spanning over TCP packets) [sapi/cli/tests/bug70470.phpt] XFAIL REASON: bug is not fixed yet ===================================================================== ===================================================================== FAILED TEST SUMMARY --------------------------------------------------------------------- Test open_basedir configuration [tests/security/open_basedir_is_executable.phpt] Bug #60350 No string escape code for ESC (ascii 27), normally \e [Zend/tests/bug60350.phpt] Bug #64267 (CURLOPT_INFILE doesn't allow reset) [ext/curl/tests/bug64267.phpt] Bug #27780 (strtotime(+1 xxx) returns a wrong date/time) [ext/date/tests/bug27780.phpt] Bug #32555 (strtotime("tomorrow") can return false) [ext/date/tests/bug32555.phpt] Bug #33532 (Different output for strftime() and date()) [ext/date/tests/bug33532.phpt] Bug #45866 (decimal values fed to DateTime->modify() causes long execution times) [ext/date/tests/bug45866.phpt] Bug #53437 DateInterval unserialize bad data, 32 bit [ext/date/tests/bug53437_var3.phpt] Test 5: HTML Test [ext/dom/tests/dom005.phpt] Bug #48147 (iconv with //IGNORE cuts the string) [ext/iconv/tests/bug48147.phpt] Bug #51250 (iconv_mime_decode() does not ignore malformed Q-encoded words) [ext/iconv/tests/bug51250.phpt] Bug #52211 (iconv() returns part of string on error) [ext/iconv/tests/bug52211.phpt] EUC-JP to ISO-2022-JP [ext/iconv/tests/eucjp2iso2022jp.phpt] iconv() test 3 [ext/iconv/tests/iconv003.phpt] iconv_mime_encode() sanity cheeck. [ext/iconv/tests/iconv004.phpt] Test the basics to function iconv. [ext/iconv/tests/iconv_basic_001.phpt] Test iconv_mime_encode() function : usage variations - Pass different data types to headers arg [ext/iconv/tests/iconv_mime_decode_headers_variation1.phpt] Test iconv_mime_decode() function : usage variations - Pass different data types to header arg [ext/iconv/tests/iconv_mime_decode_variation1.phpt] Test iconv_mime_decode() function : usage variations - Pass different data types to charset arg [ext/iconv/tests/iconv_mime_decode_variation3.phpt] iconv_mime_encode() [ext/iconv/tests/iconv_mime_encode.phpt] Test iconv_strlen() function : error conditions - pass an unknown encoding [ext/iconv/tests/iconv_strlen_error2.phpt] Test iconv_strlen() function : usage variations - Pass different data types as $encoding arg [ext/iconv/tests/iconv_strlen_variation2.phpt] iconv_strpos() [ext/iconv/tests/iconv_strpos.phpt] Test iconv_strpos() function : error conditions - Pass unknown encoding [ext/iconv/tests/iconv_strpos_error2.phpt] Test iconv_strpos() function : usage variations - pass different data types as $charset arg [ext/iconv/tests/iconv_strpos_variation4.phpt] iconv_strrpos() [ext/iconv/tests/iconv_strrpos.phpt] Test iconv_strrpos() function : error conditions - pass an unknown encoding [ext/iconv/tests/iconv_strrpos_error2.phpt] Test iconv_strrpos() function : usage variations - pass different data types as $encoding arg [ext/iconv/tests/iconv_strrpos_variation3.phpt] iconv_substr() [ext/iconv/tests/iconv_substr.phpt] Test iconv_substr() function : error conditions - Pass an unknown encoding [ext/iconv/tests/iconv_substr_error2.phpt] ldap_connect() - Connection errors [ext/ldap/tests/ldap_connect_error.phpt] ldap_connect() - Variation [ext/ldap/tests/ldap_connect_variation.phpt] ldap_get_option() - More ldap_get_option() operations [ext/ldap/tests/ldap_get_option_variation.phpt] ldap_set_option() - More ldap_set_option() operations [ext/ldap/tests/ldap_set_option_variation.phpt] Bug #61367: open_basedir bypass in libxml RSHUTDOWN: write test [ext/libxml/tests/bug61367-write.phpt] Test posix_getgrgid() function : basic functionality [ext/posix/tests/posix_getgrgid_basic.phpt] SimpleXML: XPath [ext/simplexml/tests/008.phpt] Test array_change_key_case() function : usage variations - Different strings as keys [ext/standard/tests/array/array_change_key_case_variation8.phpt] Test arsort() function : usage variations - sort strings [ext/standard/tests/array/arsort_variation5.phpt] Test asort() function : usage variations - sort strings [ext/standard/tests/array/asort_variation5.phpt] Test krsort() function : usage variations - sort strings [ext/standard/tests/array/krsort_variation5.phpt] Test ksort() function : usage variations - sort strings [ext/standard/tests/array/ksort_variation5.phpt] Test natcasesort() function : usage variations - different string types [ext/standard/tests/array/natcasesort_variation4.phpt] Test rsort() function : usage variations - String values [ext/standard/tests/array/rsort_variation5.phpt] Test sort() function : usage variations - sort strings [ext/standard/tests/array/sort_variation5.phpt] Bug #43008 (php://filter uris ignore url encoded filternames and can't handle slashes) [ext/standard/tests/file/bug43008.phpt] Test disk_free_space and its alias diskfreespace() functions : basic functionality [ext/standard/tests/file/disk_free_space_basic.phpt] Test filetype() function: Check character type [ext/standard/tests/file/filetype_variation2.phpt] flock() tests [ext/standard/tests/file/flock.phpt] Test flock() function: Basic functionality [ext/standard/tests/file/flock_basic.phpt] Test flock() function: Variations [ext/standard/tests/file/flock_variation.phpt] Test glob() function: basic functions [ext/standard/tests/file/glob_basic.phpt] Test is_executable() function: usage variations - diff. path notations [ext/standard/tests/file/is_executable_variation1.phpt] Test lstat() and stat() functions: usage variations - dir/file name stored in object [ext/standard/tests/file/lstat_stat_variation18.phpt] Test lstat() and stat() functions: usage variations - dir/file names in array [ext/standard/tests/file/lstat_stat_variation19.phpt] Test lstat() and stat() functions: usage variations - link names stored in array/object [ext/standard/tests/file/lstat_stat_variation20.phpt] Test lstat() and stat() functions: usage variations - writing data into file [ext/standard/tests/file/lstat_stat_variation7.phpt] Test popen() and pclose function: error conditions [ext/standard/tests/file/popen_pclose_error-sunos.phpt] Test touch() function : basic functionality [ext/standard/tests/file/touch_basic.phpt] Test function getservbyname() [ext/standard/tests/general_functions/getservbyname_basic.phpt] Test function getservbyport() by calling it more than or less than its expected arguments [ext/standard/tests/general_functions/getservbyport_basic.phpt] Test function getservbyport() by calling it more than or less than its expected arguments [ext/standard/tests/general_functions/getservbyport_variation1.phpt] Test ip2long() function : usage variation 2, 32 bit [ext/standard/tests/network/ip2long_variation2.phpt] Bug #64146 (serialize incorrectly saving objects when they are cloned) [ext/standard/tests/serialize/bug64146.phpt] Glob wrapper bypasses open_basedir [ext/standard/tests/streams/glob-wrapper.phpt] Test setlocale() function : basic functionality - setting system locale to a specific [ext/standard/tests/strings/setlocale_basic1.phpt] Test setlocale() function : basic functionality - set locale using an array [ext/standard/tests/strings/setlocale_basic2.phpt] Test setlocale() function : basic functionality - passing multiple locales as argument [ext/standard/tests/strings/setlocale_basic3.phpt] Test setlocale() function : usage variations - passing multiple valid/invlaid locales as argument [ext/standard/tests/strings/setlocale_variation1.phpt] Test setlocale() function : usage variations - setting system locale = 0 [ext/standard/tests/strings/setlocale_variation3.phpt] Test strrchr() function : usage variations - heredoc string containing escape sequences for 'haystack' [ext/standard/tests/strings/strrchr_variation5.phpt] Test strspn() function : usage variations - with heredoc strings, varying mask & default start and len args [ext/standard/tests/strings/strspn_variation6.phpt] Test strptime() function : basic functionality [ext/standard/tests/time/strptime_basic.phpt] Bug #64230 (XMLReader does not suppress errors) [ext/xmlreader/tests/bug64230.phpt] Check cli_process_title support on Unix [sapi/cli/tests/cli_process_title_unix.phpt] ===================================================================== ===================================================================== WARNED TEST SUMMARY --------------------------------------------------------------------- Phar: bug #69958: Segfault in Phar::convertToData on invalid file [ext/phar/tests/bug69958.phpt] (warn: XFAIL section but test passes) Bug #69111 Crash in SessionHandler::read() [ext/session/tests/bug69111.phpt] (warn: XFAIL section but test passes) Bug #70172 - Use After Free Vulnerability in unserialize() [ext/standard/tests/serialize/bug70172.phpt] (warn: XFAIL section but test passes) ===================================================================== ================================================================================ /home/contppw/php/php-5.6.34/tests/security/open_basedir_is_executable.phpt ================================================================================ *** Testing open_basedir configuration [is_executable] *** bool(true) bool(true) bool(true) bool(true) bool(true) Warning: is_executable(): open_basedir restriction in effect. File(../bad) is not within the allowed path(s): (.) in /home/contppw/php/php-5.6.34/tests/security/open_basedir.inc on line 78 bool(false) Warning: is_executable(): open_basedir restriction in effect. File(../bad/bad.txt) is not within the allowed path(s): (.) in /home/contppw/php/php-5.6.34/tests/security/open_basedir.inc on line 79 bool(false) Warning: is_executable(): open_basedir restriction in effect. File(..) is not within the allowed path(s): (.) in /home/contppw/php/php-5.6.34/tests/security/open_basedir.inc on line 80 bool(false) Warning: is_executable(): open_basedir restriction in effect. File(../) is not within the allowed path(s): (.) in /home/contppw/php/php-5.6.34/tests/security/open_basedir.inc on line 81 bool(false) Warning: is_executable(): open_basedir restriction in effect. File(/) is not within the allowed path(s): (.) in /home/contppw/php/php-5.6.34/tests/security/open_basedir.inc on line 82 bool(false) Warning: is_executable(): open_basedir restriction in effect. File(../bad/.) is not within the allowed path(s): (.) in /home/contppw/php/php-5.6.34/tests/security/open_basedir.inc on line 83 bool(false) Warning: is_executable(): open_basedir restriction in effect. File(/home/contppw/php/php-5.6.34/test/bad/bad.txt) is not within the allowed path(s): (.) in /home/contppw/php/php-5.6.34/tests/security/open_basedir.inc on line 85 bool(false) Warning: is_executable(): open_basedir restriction in effect. File(/home/contppw/php/php-5.6.34/test/bad/../bad/bad.txt) is not within the allowed path(s): (.) in /home/contppw/php/php-5.6.34/tests/security/open_basedir.inc on line 86 bool(false) bool(true) bool(true) bool(true) bool(true) *** Finished testing open_basedir configuration [is_executable] *** ================================================================================ 031+ bool(true) 032+ bool(true) 033+ bool(true) 034+ bool(true) 031- bool(false) 032- bool(false) 033- bool(false) 034- bool(false) ================================================================================ ================================================================================ /home/contppw/php/php-5.6.34/Zend/tests/bug60350.phpt ================================================================================ ================================================================================ 001+ 001- Works ================================================================================ ================================================================================ /home/contppw/php/php-5.6.34/ext/curl/tests/bug64267.phpt ================================================================================ TEST bool(true) bool(true) int(0) ===DONE=== ================================================================================ 004+ int(0) 004- int(30%d) ================================================================================ ================================================================================ /home/contppw/php/php-5.6.34/ext/date/tests/bug27780.phpt ================================================================================ America/Chicago 1076824799 [2004-02-14 23:59:59 AEST] [2004-04-07 00:00:00 -2 months +7 days +23 hours +59 minutes +59 seconds] 1076824800 [2004-02-15 00:00:00 AEST] [2004-04-07 00:00:00 -2 months +7 days +23 hours +59 minutes +60 seconds] 1076824801 [2004-02-15 00:00:01 AEST] [2004-04-07 00:00:00 -2 months +7 days +23 hours +59 minutes +61 seconds] 1079503200 [2004-03-17 00:00:00 AEST] [2004-04-07 00:00:00 -21 days] 1080367200 [2004-03-27 00:00:00 AEST] [2004-04-07 00:00:00 11 days ago] 1080460800 [2004-03-28 02:00:00 AEST] [2004-04-07 00:00:00 -10 day +2 hours] 1081227600 [2004-04-06 00:00:00 AEDT] [2004-04-07 00:00:00 -1 day] 1081314000 [2004-04-07 00:00:00 AEDT] [2004-04-07 00:00:00] 1081317600 [2004-04-07 01:00:00 AEDT] [2004-04-07 00:00:00 +1 hour] 1081321200 [2004-04-07 02:00:00 AEDT] [2004-04-07 00:00:00 +2 hour] 1081400400 [2004-04-08 00:00:00 AEDT] [2004-04-07 00:00:00 +1 day] 1081400400 [2004-04-08 00:00:00 AEDT] [2004-04-07 00:00:00 1 day] 1083128400 [2004-04-28 00:00:00 AEDT] [2004-04-07 00:00:00 +21 days] Europe/Amsterdam 1076799599 [2004-02-14 23:59:59 AEST] [2004-04-07 00:00:00 -2 months +7 days +23 hours +59 minutes +59 seconds] 1076799600 [2004-02-15 00:00:00 AEST] [2004-04-07 00:00:00 -2 months +7 days +23 hours +59 minutes +60 seconds] 1076799601 [2004-02-15 00:00:01 AEST] [2004-04-07 00:00:00 -2 months +7 days +23 hours +59 minutes +61 seconds] 1079478000 [2004-03-17 00:00:00 AEST] [2004-04-07 00:00:00 -21 days] 1080342000 [2004-03-27 00:00:00 AEST] [2004-04-07 00:00:00 11 days ago] 1080435600 [2004-03-28 03:00:00 AEDT] [2004-04-07 00:00:00 -10 day +2 hours] 1081202400 [2004-04-06 00:00:00 AEDT] [2004-04-07 00:00:00 -1 day] 1081288800 [2004-04-07 00:00:00 AEDT] [2004-04-07 00:00:00] 1081292400 [2004-04-07 01:00:00 AEDT] [2004-04-07 00:00:00 +1 hour] 1081296000 [2004-04-07 02:00:00 AEDT] [2004-04-07 00:00:00 +2 hour] 1081375200 [2004-04-08 00:00:00 AEDT] [2004-04-07 00:00:00 +1 day] 1081375200 [2004-04-08 00:00:00 AEDT] [2004-04-07 00:00:00 1 day] 1083103200 [2004-04-28 00:00:00 AEDT] [2004-04-07 00:00:00 +21 days] Asia/Jerusalem 1076795999 [2004-02-14 23:59:59 AEST] [2004-04-07 00:00:00 -2 months +7 days +23 hours +59 minutes +59 seconds] 1076796000 [2004-02-15 00:00:00 AEST] [2004-04-07 00:00:00 -2 months +7 days +23 hours +59 minutes +60 seconds] 1076796001 [2004-02-15 00:00:01 AEST] [2004-04-07 00:00:00 -2 months +7 days +23 hours +59 minutes +61 seconds] 1079474400 [2004-03-17 00:00:00 AEST] [2004-04-07 00:00:00 -21 days] 1080338400 [2004-03-27 00:00:00 AEST] [2004-04-07 00:00:00 11 days ago] 1080432000 [2004-03-28 02:00:00 AEST] [2004-04-07 00:00:00 -10 day +2 hours] 1081202400 [2004-04-06 00:00:00 AEST] [2004-04-07 00:00:00 -1 day] 1081288800 [2004-04-07 00:00:00 AEST] [2004-04-07 00:00:00] 1081292400 [2004-04-07 02:00:00 AEDT] [2004-04-07 00:00:00 +1 hour] 1081292400 [2004-04-07 02:00:00 AEDT] [2004-04-07 00:00:00 +2 hour] 1081371600 [2004-04-08 00:00:00 AEDT] [2004-04-07 00:00:00 +1 day] 1081371600 [2004-04-08 00:00:00 AEDT] [2004-04-07 00:00:00 1 day] 1083099600 [2004-04-28 00:00:00 AEDT] [2004-04-07 00:00:00 +21 days] Asia/Singapore 1076774399 [2004-02-14 23:59:59 AEST] [2004-04-07 00:00:00 -2 months +7 days +23 hours +59 minutes +59 seconds] 1076774400 [2004-02-15 00:00:00 AEST] [2004-04-07 00:00:00 -2 months +7 days +23 hours +59 minutes +60 seconds] 1076774401 [2004-02-15 00:00:01 AEST] [2004-04-07 00:00:00 -2 months +7 days +23 hours +59 minutes +61 seconds] 1079452800 [2004-03-17 00:00:00 AEST] [2004-04-07 00:00:00 -21 days] 1080316800 [2004-03-27 00:00:00 AEST] [2004-04-07 00:00:00 11 days ago] 1080410400 [2004-03-28 02:00:00 AEST] [2004-04-07 00:00:00 -10 day +2 hours] 1081180800 [2004-04-06 00:00:00 AEST] [2004-04-07 00:00:00 -1 day] 1081267200 [2004-04-07 00:00:00 AEST] [2004-04-07 00:00:00] 1081270800 [2004-04-07 01:00:00 AEST] [2004-04-07 00:00:00 +1 hour] 1081274400 [2004-04-07 02:00:00 AEST] [2004-04-07 00:00:00 +2 hour] 1081353600 [2004-04-08 00:00:00 AEST] [2004-04-07 00:00:00 +1 day] 1081353600 [2004-04-08 00:00:00 AEST] [2004-04-07 00:00:00 1 day] 1083081600 [2004-04-28 00:00:00 AEST] [2004-04-07 00:00:00 +21 days] America/Sao_Paulo 1076810399 [2004-02-14 23:59:59 AEDT] [2004-04-07 00:00:00 -2 months +7 days +23 hours +59 minutes +59 seconds] 1076814000 [2004-02-15 00:00:00 AEST] [2004-04-07 00:00:00 -2 months +7 days +23 hours +59 minutes +60 seconds] 1076814001 [2004-02-15 00:00:01 AEST] [2004-04-07 00:00:00 -2 months +7 days +23 hours +59 minutes +61 seconds] 1079492400 [2004-03-17 00:00:00 AEST] [2004-04-07 00:00:00 -21 days] 1080356400 [2004-03-27 00:00:00 AEST] [2004-04-07 00:00:00 11 days ago] 1080450000 [2004-03-28 02:00:00 AEST] [2004-04-07 00:00:00 -10 day +2 hours] 1081220400 [2004-04-06 00:00:00 AEST] [2004-04-07 00:00:00 -1 day] 1081306800 [2004-04-07 00:00:00 AEST] [2004-04-07 00:00:00] 1081310400 [2004-04-07 01:00:00 AEST] [2004-04-07 00:00:00 +1 hour] 1081314000 [2004-04-07 02:00:00 AEST] [2004-04-07 00:00:00 +2 hour] 1081393200 [2004-04-08 00:00:00 AEST] [2004-04-07 00:00:00 +1 day] 1081393200 [2004-04-08 00:00:00 AEST] [2004-04-07 00:00:00 1 day] 1083121200 [2004-04-28 00:00:00 AEST] [2004-04-07 00:00:00 +21 days] ================================================================================ 002+ 1076824799 [2004-02-14 23:59:59 AEST] [2004-04-07 00:00:00 -2 months +7 days +23 hours +59 minutes +59 seconds] 003+ 1076824800 [2004-02-15 00:00:00 AEST] [2004-04-07 00:00:00 -2 months +7 days +23 hours +59 minutes +60 seconds] 004+ 1076824801 [2004-02-15 00:00:01 AEST] [2004-04-07 00:00:00 -2 months +7 days +23 hours +59 minutes +61 seconds] 005+ 1079503200 [2004-03-17 00:00:00 AEST] [2004-04-07 00:00:00 -21 days] 006+ 1080367200 [2004-03-27 00:00:00 AEST] [2004-04-07 00:00:00 11 days ago] 007+ 1080460800 [2004-03-28 02:00:00 AEST] [2004-04-07 00:00:00 -10 day +2 hours] 008+ 1081227600 [2004-04-06 00:00:00 AEDT] [2004-04-07 00:00:00 -1 day] 009+ 1081314000 [2004-04-07 00:00:00 AEDT] [2004-04-07 00:00:00] 010+ 1081317600 [2004-04-07 01:00:00 AEDT] [2004-04-07 00:00:00 +1 hour] 011+ 1081321200 [2004-04-07 02:00:00 AEDT] [2004-04-07 00:00:00 +2 hour] 012+ 1081400400 [2004-04-08 00:00:00 AEDT] [2004-04-07 00:00:00 +1 day] 013+ 1081400400 [2004-04-08 00:00:00 AEDT] [2004-04-07 00:00:00 1 day] 014+ 1083128400 [2004-04-28 00:00:00 AEDT] [2004-04-07 00:00:00 +21 days] 002- 1076824799 [2004-02-14 23:59:59 CST] [2004-04-07 00:00:00 -2 months +7 days +23 hours +59 minutes +59 seconds] 003- 1076824800 [2004-02-15 00:00:00 CST] [2004-04-07 00:00:00 -2 months +7 days +23 hours +59 minutes +60 seconds] 004- 1076824801 [2004-02-15 00:00:01 CST] [2004-04-07 00:00:00 -2 months +7 days +23 hours +59 minutes +61 seconds] 005- 1079503200 [2004-03-17 00:00:00 CST] [2004-04-07 00:00:00 -21 days] 006- 1080367200 [2004-03-27 00:00:00 CST] [2004-04-07 00:00:00 11 days ago] 007- 1080460800 [2004-03-28 02:00:00 CST] [2004-04-07 00:00:00 -10 day +2 hours] 008- 1081227600 [2004-04-06 00:00:00 CDT] [2004-04-07 00:00:00 -1 day] 009- 1081314000 [2004-04-07 00:00:00 CDT] [2004-04-07 00:00:00] 010- 1081317600 [2004-04-07 01:00:00 CDT] [2004-04-07 00:00:00 +1 hour] 011- 1081321200 [2004-04-07 02:00:00 CDT] [2004-04-07 00:00:00 +2 hour] 012- 1081400400 [2004-04-08 00:00:00 CDT] [2004-04-07 00:00:00 +1 day] 013- 1081400400 [2004-04-08 00:00:00 CDT] [2004-04-07 00:00:00 1 day] 014- 1083128400 [2004-04-28 00:00:00 CDT] [2004-04-07 00:00:00 +21 days] 017+ 1076799599 [2004-02-14 23:59:59 AEST] [2004-04-07 00:00:00 -2 months +7 days +23 hours +59 minutes +59 seconds] 018+ 1076799600 [2004-02-15 00:00:00 AEST] [2004-04-07 00:00:00 -2 months +7 days +23 hours +59 minutes +60 seconds] 019+ 1076799601 [2004-02-15 00:00:01 AEST] [2004-04-07 00:00:00 -2 months +7 days +23 hours +59 minutes +61 seconds] 020+ 1079478000 [2004-03-17 00:00:00 AEST] [2004-04-07 00:00:00 -21 days] 021+ 1080342000 [2004-03-27 00:00:00 AEST] [2004-04-07 00:00:00 11 days ago] 022+ 1080435600 [2004-03-28 03:00:00 AEDT] [2004-04-07 00:00:00 -10 day +2 hours] 023+ 1081202400 [2004-04-06 00:00:00 AEDT] [2004-04-07 00:00:00 -1 day] 024+ 1081288800 [2004-04-07 00:00:00 AEDT] [2004-04-07 00:00:00] 025+ 1081292400 [2004-04-07 01:00:00 AEDT] [2004-04-07 00:00:00 +1 hour] 026+ 1081296000 [2004-04-07 02:00:00 AEDT] [2004-04-07 00:00:00 +2 hour] 027+ 1081375200 [2004-04-08 00:00:00 AEDT] [2004-04-07 00:00:00 +1 day] 028+ 1081375200 [2004-04-08 00:00:00 AEDT] [2004-04-07 00:00:00 1 day] 029+ 1083103200 [2004-04-28 00:00:00 AEDT] [2004-04-07 00:00:00 +21 days] 017- 1076799599 [2004-02-14 23:59:59 CET] [2004-04-07 00:00:00 -2 months +7 days +23 hours +59 minutes +59 seconds] 018- 1076799600 [2004-02-15 00:00:00 CET] [2004-04-07 00:00:00 -2 months +7 days +23 hours +59 minutes +60 seconds] 019- 1076799601 [2004-02-15 00:00:01 CET] [2004-04-07 00:00:00 -2 months +7 days +23 hours +59 minutes +61 seconds] 020- 1079478000 [2004-03-17 00:00:00 CET] [2004-04-07 00:00:00 -21 days] 021- 1080342000 [2004-03-27 00:00:00 CET] [2004-04-07 00:00:00 11 days ago] 022- 1080435600 [2004-03-28 03:00:00 CEST] [2004-04-07 00:00:00 -10 day +2 hours] 023- 1081202400 [2004-04-06 00:00:00 CEST] [2004-04-07 00:00:00 -1 day] 024- 1081288800 [2004-04-07 00:00:00 CEST] [2004-04-07 00:00:00] 025- 1081292400 [2004-04-07 01:00:00 CEST] [2004-04-07 00:00:00 +1 hour] 026- 1081296000 [2004-04-07 02:00:00 CEST] [2004-04-07 00:00:00 +2 hour] 027- 1081375200 [2004-04-08 00:00:00 CEST] [2004-04-07 00:00:00 +1 day] 028- 1081375200 [2004-04-08 00:00:00 CEST] [2004-04-07 00:00:00 1 day] 029- 1083103200 [2004-04-28 00:00:00 CEST] [2004-04-07 00:00:00 +21 days] 032+ 1076795999 [2004-02-14 23:59:59 AEST] [2004-04-07 00:00:00 -2 months +7 days +23 hours +59 minutes +59 seconds] 033+ 1076796000 [2004-02-15 00:00:00 AEST] [2004-04-07 00:00:00 -2 months +7 days +23 hours +59 minutes +60 seconds] 034+ 1076796001 [2004-02-15 00:00:01 AEST] [2004-04-07 00:00:00 -2 months +7 days +23 hours +59 minutes +61 seconds] 035+ 1079474400 [2004-03-17 00:00:00 AEST] [2004-04-07 00:00:00 -21 days] 036+ 1080338400 [2004-03-27 00:00:00 AEST] [2004-04-07 00:00:00 11 days ago] 037+ 1080432000 [2004-03-28 02:00:00 AEST] [2004-04-07 00:00:00 -10 day +2 hours] 038+ 1081202400 [2004-04-06 00:00:00 AEST] [2004-04-07 00:00:00 -1 day] 039+ 1081288800 [2004-04-07 00:00:00 AEST] [2004-04-07 00:00:00] 040+ 1081292400 [2004-04-07 02:00:00 AEDT] [2004-04-07 00:00:00 +1 hour] 041+ 1081292400 [2004-04-07 02:00:00 AEDT] [2004-04-07 00:00:00 +2 hour] 042+ 1081371600 [2004-04-08 00:00:00 AEDT] [2004-04-07 00:00:00 +1 day] 043+ 1081371600 [2004-04-08 00:00:00 AEDT] [2004-04-07 00:00:00 1 day] 044+ 1083099600 [2004-04-28 00:00:00 AEDT] [2004-04-07 00:00:00 +21 days] 032- 1076795999 [2004-02-14 23:59:59 IST] [2004-04-07 00:00:00 -2 months +7 days +23 hours +59 minutes +59 seconds] 033- 1076796000 [2004-02-15 00:00:00 IST] [2004-04-07 00:00:00 -2 months +7 days +23 hours +59 minutes +60 seconds] 034- 1076796001 [2004-02-15 00:00:01 IST] [2004-04-07 00:00:00 -2 months +7 days +23 hours +59 minutes +61 seconds] 035- 1079474400 [2004-03-17 00:00:00 IST] [2004-04-07 00:00:00 -21 days] 036- 1080338400 [2004-03-27 00:00:00 IST] [2004-04-07 00:00:00 11 days ago] 037- 1080432000 [2004-03-28 02:00:00 IST] [2004-04-07 00:00:00 -10 day +2 hours] 038- 1081202400 [2004-04-06 00:00:00 IST] [2004-04-07 00:00:00 -1 day] 039- 1081288800 [2004-04-07 00:00:00 IST] [2004-04-07 00:00:00] 040- 1081292400 [2004-04-07 02:00:00 IDT] [2004-04-07 00:00:00 +1 hour] 041- 1081292400 [2004-04-07 02:00:00 IDT] [2004-04-07 00:00:00 +2 hour] 042- 1081371600 [2004-04-08 00:00:00 IDT] [2004-04-07 00:00:00 +1 day] 043- 1081371600 [2004-04-08 00:00:00 IDT] [2004-04-07 00:00:00 1 day] 044- 1083099600 [2004-04-28 00:00:00 IDT] [2004-04-07 00:00:00 +21 days] 047+ 1076774399 [2004-02-14 23:59:59 AEST] [2004-04-07 00:00:00 -2 months +7 days +23 hours +59 minutes +59 seconds] 048+ 1076774400 [2004-02-15 00:00:00 AEST] [2004-04-07 00:00:00 -2 months +7 days +23 hours +59 minutes +60 seconds] 049+ 1076774401 [2004-02-15 00:00:01 AEST] [2004-04-07 00:00:00 -2 months +7 days +23 hours +59 minutes +61 seconds] 050+ 1079452800 [2004-03-17 00:00:00 AEST] [2004-04-07 00:00:00 -21 days] 051+ 1080316800 [2004-03-27 00:00:00 AEST] [2004-04-07 00:00:00 11 days ago] 052+ 1080410400 [2004-03-28 02:00:00 AEST] [2004-04-07 00:00:00 -10 day +2 hours] 053+ 1081180800 [2004-04-06 00:00:00 AEST] [2004-04-07 00:00:00 -1 day] 054+ 1081267200 [2004-04-07 00:00:00 AEST] [2004-04-07 00:00:00] 055+ 1081270800 [2004-04-07 01:00:00 AEST] [2004-04-07 00:00:00 +1 hour] 056+ 1081274400 [2004-04-07 02:00:00 AEST] [2004-04-07 00:00:00 +2 hour] 057+ 1081353600 [2004-04-08 00:00:00 AEST] [2004-04-07 00:00:00 +1 day] 058+ 1081353600 [2004-04-08 00:00:00 AEST] [2004-04-07 00:00:00 1 day] 059+ 1083081600 [2004-04-28 00:00:00 AEST] [2004-04-07 00:00:00 +21 days] 047- 1076774399 [2004-02-14 23:59:59 SGT] [2004-04-07 00:00:00 -2 months +7 days +23 hours +59 minutes +59 seconds] 048- 1076774400 [2004-02-15 00:00:00 SGT] [2004-04-07 00:00:00 -2 months +7 days +23 hours +59 minutes +60 seconds] 049- 1076774401 [2004-02-15 00:00:01 SGT] [2004-04-07 00:00:00 -2 months +7 days +23 hours +59 minutes +61 seconds] 050- 1079452800 [2004-03-17 00:00:00 SGT] [2004-04-07 00:00:00 -21 days] 051- 1080316800 [2004-03-27 00:00:00 SGT] [2004-04-07 00:00:00 11 days ago] 052- 1080410400 [2004-03-28 02:00:00 SGT] [2004-04-07 00:00:00 -10 day +2 hours] 053- 1081180800 [2004-04-06 00:00:00 SGT] [2004-04-07 00:00:00 -1 day] 054- 1081267200 [2004-04-07 00:00:00 SGT] [2004-04-07 00:00:00] 055- 1081270800 [2004-04-07 01:00:00 SGT] [2004-04-07 00:00:00 +1 hour] 056- 1081274400 [2004-04-07 02:00:00 SGT] [2004-04-07 00:00:00 +2 hour] 057- 1081353600 [2004-04-08 00:00:00 SGT] [2004-04-07 00:00:00 +1 day] 058- 1081353600 [2004-04-08 00:00:00 SGT] [2004-04-07 00:00:00 1 day] 059- 1083081600 [2004-04-28 00:00:00 SGT] [2004-04-07 00:00:00 +21 days] 062+ 1076810399 [2004-02-14 23:59:59 AEDT] [2004-04-07 00:00:00 -2 months +7 days +23 hours +59 minutes +59 seconds] 063+ 1076814000 [2004-02-15 00:00:00 AEST] [2004-04-07 00:00:00 -2 months +7 days +23 hours +59 minutes +60 seconds] 064+ 1076814001 [2004-02-15 00:00:01 AEST] [2004-04-07 00:00:00 -2 months +7 days +23 hours +59 minutes +61 seconds] 065+ 1079492400 [2004-03-17 00:00:00 AEST] [2004-04-07 00:00:00 -21 days] 066+ 1080356400 [2004-03-27 00:00:00 AEST] [2004-04-07 00:00:00 11 days ago] 067+ 1080450000 [2004-03-28 02:00:00 AEST] [2004-04-07 00:00:00 -10 day +2 hours] 068+ 1081220400 [2004-04-06 00:00:00 AEST] [2004-04-07 00:00:00 -1 day] 069+ 1081306800 [2004-04-07 00:00:00 AEST] [2004-04-07 00:00:00] 070+ 1081310400 [2004-04-07 01:00:00 AEST] [2004-04-07 00:00:00 +1 hour] 071+ 1081314000 [2004-04-07 02:00:00 AEST] [2004-04-07 00:00:00 +2 hour] 072+ 1081393200 [2004-04-08 00:00:00 AEST] [2004-04-07 00:00:00 +1 day] 073+ 1081393200 [2004-04-08 00:00:00 AEST] [2004-04-07 00:00:00 1 day] 074+ 1083121200 [2004-04-28 00:00:00 AEST] [2004-04-07 00:00:00 +21 days] 062- 1076810399 [2004-02-14 23:59:59 BRST] [2004-04-07 00:00:00 -2 months +7 days +23 hours +59 minutes +59 seconds] 063- 1076814000 [2004-02-15 00:00:00 BRT] [2004-04-07 00:00:00 -2 months +7 days +23 hours +59 minutes +60 seconds] 064- 1076814001 [2004-02-15 00:00:01 BRT] [2004-04-07 00:00:00 -2 months +7 days +23 hours +59 minutes +61 seconds] 065- 1079492400 [2004-03-17 00:00:00 BRT] [2004-04-07 00:00:00 -21 days] 066- 1080356400 [2004-03-27 00:00:00 BRT] [2004-04-07 00:00:00 11 days ago] 067- 1080450000 [2004-03-28 02:00:00 BRT] [2004-04-07 00:00:00 -10 day +2 hours] 068- 1081220400 [2004-04-06 00:00:00 BRT] [2004-04-07 00:00:00 -1 day] 069- 1081306800 [2004-04-07 00:00:00 BRT] [2004-04-07 00:00:00] 070- 1081310400 [2004-04-07 01:00:00 BRT] [2004-04-07 00:00:00 +1 hour] 071- 1081314000 [2004-04-07 02:00:00 BRT] [2004-04-07 00:00:00 +2 hour] 072- 1081393200 [2004-04-08 00:00:00 BRT] [2004-04-07 00:00:00 +1 day] 073- 1081393200 [2004-04-08 00:00:00 BRT] [2004-04-07 00:00:00 1 day] 074- 1083121200 [2004-04-28 00:00:00 BRT] [2004-04-07 00:00:00 +21 days] ================================================================================ ================================================================================ /home/contppw/php/php-5.6.34/ext/date/tests/bug32555.phpt ================================================================================ Sat Apr 2 02:30:00 2005 AEST Sun Apr 3 00:00:00 2005 AEST Sun Apr 3 03:30:00 2005 AEDT Mon Apr 4 02:30:00 2005 AEDT ================================================================================ 001+ Sat Apr 2 02:30:00 2005 AEST 002+ Sun Apr 3 00:00:00 2005 AEST 003+ Sun Apr 3 03:30:00 2005 AEDT 004+ Mon Apr 4 02:30:00 2005 AEDT 001- Sat Apr 2 02:30:00 2005 EST 002- Sun Apr 3 00:00:00 2005 EST 003- Sun Apr 3 03:30:00 2005 EDT 004- Mon Apr 4 02:30:00 2005 EDT ================================================================================ ================================================================================ /home/contppw/php/php-5.6.34/ext/date/tests/bug33532.phpt ================================================================================ TZ has NOT been set Should strftime==datestr? Strftime seems to assume GMT tStamp. input 10:00:00 AM July 1 2005 strftime 10:00:00 AM July 1 2005 AEST +1000 datestr 10:00:00 AM July 1 2005 UTC Setting TZ input 10:00:00 AM July 1 2005 strftime 10:00:00 AM July 1 2005 AEST +1000 datestr 10:00:00 AM July 1 2005 AEST ================================================================================ 004+ strftime 10:00:00 AM July 1 2005 AEST +1000 004- strftime 10:00:00 AM July 1 2005 UTC +0000 ================================================================================ ================================================================================ /home/contppw/php/php-5.6.34/ext/date/tests/bug45866.phpt ================================================================================ Thu, 14 Aug 168488594 16:44:23 +0000 Thu, 14 Aug 168488594 16:44:23 +0000 Thu, 14 Aug 168488594 16:44:23 +0000 ================================================================================ 003+ Thu, 14 Aug 168488594 16:44:23 +0000 003- 004- Warning: DateTime::modify(): Failed to parse time string (£61538461538 day) at position 0 (%s): Unexpected character in %sbug45866.php on line 11 005- Wed, 29 Jul 2009 16:44:23 +0100 ================================================================================ ================================================================================ /home/contppw/php/php-5.6.34/ext/date/tests/bug53437_var3.phpt ================================================================================ object(DateInterval)#1 (15) { ["y"]=> int(-1) ["m"]=> int(-1) ["d"]=> int(-1) ["h"]=> int(-1) ["i"]=> int(-1) ["s"]=> int(-1) ["weekday"]=> int(10) ["weekday_behavior"]=> int(10) ["first_last_day_of"]=> int(0) ["invert"]=> int(0) ["days"]=> int(0) ["special_type"]=> int(0) ["special_amount"]=> int(2012522599) ["have_weekday_relative"]=> int(0) ["have_special_relative"]=> int(0) } ==DONE== ================================================================================ 027+ int(2012522599) 027- int(-1) ================================================================================ ================================================================================ /home/contppw/php/php-5.6.34/ext/dom/tests/dom005.phpt ================================================================================ --- save as XML <?xml version="1.0" standalone="yes"?> <!DOCTYPE html PUBLIC "-//W3C//DTD HTML 4.0 Transitional//EN" "http://www.w3.org/TR/REC-html40/loose.dtd"> <html> <head> <title>Hello world</title> </head> <body> This is a not well-formed<br/> html files with undeclared entities&#xA0; </body> </html> --- save as HTML <!DOCTYPE html PUBLIC "-//W3C//DTD HTML 4.0 Transitional//EN" "http://www.w3.org/TR/REC-html40/loose.dtd"> <html> <head> <title>Hello world</title> </head> <body> This is a not well-formed<br> html files with undeclared entities&nbsp; </body> </html> ================================================================================ 004+ <html> 005+ <head> 006+ <title>Hello world</title> 007+ </head> 008+ <body> 004- <html><head><title>Hello world</title></head><body> 007- </body></html> 010- <html><head><title>Hello world</title></head><body> 011+ </body> 012+ </html> 013- </body></html> 015+ <html> 016+ <head> 017+ <title>Hello world</title> 018+ </head> 019+ <body> 022+ </body> 023+ </html> ================================================================================ ================================================================================ /home/contppw/php/php-5.6.34/ext/iconv/tests/bug48147.phpt ================================================================================ Notice: iconv(): Unknown error (88) in /home/contppw/php/php-5.6.34/ext/iconv/tests/bug48147.php on line 3 bool(false) string(16) "aa%C3%C3%C3%B8aa" string(3) "%C3" string(14) "%C3%C3%C3%B8aa" string(11) "aa%C3%C3%C3" ================================================================================ 001+ Notice: iconv(): Unknown error (88) in /home/contppw/php/php-5.6.34/ext/iconv/tests/bug48147.php on line 3 001- Notice: iconv(): Detected an illegal character in input string in %s on line %d 003+ string(16) "aa%C3%C3%C3%B8aa" 004+ string(3) "%C3" 005+ string(14) "%C3%C3%C3%B8aa" 006+ string(11) "aa%C3%C3%C3" 003- string(10) "aa%C3%B8aa" 004- 005- Notice: iconv(): Detected an incomplete multibyte character in input string in %s on line %d 006- string(0) "" 007- string(8) "%C3%B8aa" 008- 009- Notice: iconv(): Detected an incomplete multibyte character in input string in %s on line %d 010- string(0) "" ================================================================================ ================================================================================ /home/contppw/php/php-5.6.34/ext/iconv/tests/bug51250.phpt ================================================================================ string(23) "Legal encoded-word: * ." string(23) "Legal encoded-word: * ." string(24) "Illegal encoded-word: ." string(33) "Illegal encoded-word: =?utf-8?Q?." string(23) "Legal encoded-word: * ." string(23) "Legal encoded-word: * ." string(24) "Illegal encoded-word: ." Notice: iconv_mime_decode(): Unknown error (88) in /home/contppw/php/php-5.6.34/ext/iconv/tests/bug51250.php on line 12 bool(false) ================================================================================ 004+ string(33) "Illegal encoded-word: =?utf-8?Q?." 004- string(23) "Illegal encoded-word: ." 009+ Notice: iconv_mime_decode(): Unknown error (88) in /home/contppw/php/php-5.6.34/ext/iconv/tests/bug51250.php on line 12 009- Notice: iconv_mime_decode(): Detected an illegal character in input string in %s on line %d ================================================================================ ================================================================================ /home/contppw/php/php-5.6.34/ext/iconv/tests/bug52211.phpt ================================================================================ Notice: iconv(): Unknown error (22) in /home/contppw/php/php-5.6.34/ext/iconv/tests/bug52211.php on line 4 bool(false) ================================================================================ 001+ Notice: iconv(): Unknown error (22) in /home/contppw/php/php-5.6.34/ext/iconv/tests/bug52211.php on line 4 001- Notice: iconv(): Detected an illegal character in input string in %s on line %d ================================================================================ ================================================================================ /home/contppw/php/php-5.6.34/ext/iconv/tests/eucjp2iso2022jp.phpt ================================================================================ 1b2442467c4b5c386c2546252d2539254824481b284a20456e676c69736820746578741b2442467c4b5c386c2546252d2539254824481b284a20456e676c69736820746578741b2442467c4b5c386c2546252d2539254824481b284a20456e676c69736820746578741b2442467c4b5c386c2546252d2539254824481b284a20456e676c69736820746578741b2442467c4b5c386c2546252d2539254824481b284a20456e676c69736820746578741b2442467c4b5c386c2546252d2539254824481b284a20456e676c69736820746578741b2442467c4b5c386c2546252d2539254824481b284a20456e676c69736820746578741b2442467c4b5c386c2546252d2539254824481b284a20456e676c69736820746578741b2442467c4b5c386c2546252d2539254824481b284a20456e676c69736820746578741b2442467c4b5c386c2546252d2539254824481b284a20456e676c69736820746578741b2442467c4b5c386c2546252d2539254824481b284a20456e676c69736820746578741b2442467c4b5c386c2546252d2539254824481b284a20456e676c69736820746578741b2442467c4b5c386c2546252d2539254824481b284a20456e676c69736820746578741b2442467c4b5c386c2546252d2539254824481b284a20456e676c69736820746578741b2442467c4b5c386c2546252d2539254824481b284a20456e676c69736820746578741b2442467c4b5c386c2546252d2539254824481b284a20456e676c69736820746578741b2442467c4b5c386c2546252d2539254824481b284a20456e676c69736820746578741b2442467c4b5c386c2546252d2539254824481b284a20456e676c69736820746578741b2442467c4b5c386c2546252d2539254824481b284a20456e676c69736820746578741b2442467c4b5c386c2546252d2539254824481b284a20456e676c69736820746578741b2442467c4b5c386c2546252d2539254824481b284a20456e676c69736820746578741b2442467c4b5c386c2546252d2539254824481b284a20456e676c69736820746578741b2442467c4b5c386c2546252d2539254824481b284a20456e676c69736820746578741b2442467c4b5c386c2546252d2539254824481b284a20456e676c69736820746578741b2442467c4b5c386c2546252d2539254824481b284a20456e676c69736820746578741b2442467c4b5c386c2546252d2539254824481b284a20456e676c69736820746578741b2442467c4b5c386c2546252d2539254824481b284a20456e676c69736820746578741b2442467c4b5c386c2546252d2539254824481b284a20456e676c69736820746578741b2442467c4b5c386c2546252d2539254824481b284a20456e676c69736820746578741b2442467c4b5c386c2546252d2539254824481b284a20456e676c69736820746578741b2442467c4b5c386c1b284a ================================================================================ 001+ 1b2442467c4b5c386c2546252d2539254824481b284a20456e676c69736820746578741b2442467c4b5c386c2546252d2539254824481b284a20456e676c69736820746578741b2442467c4b5c386c2546252d2539254824481b284a20456e676c69736820746578741b2442467c4b5c386c2546252d2539254824481b284a20456e676c69736820746578741b2442467c4b5c386c2546252d2539254824481b284a20456e676c69736820746578741b2442467c4b5c386c2546252d2539254824481b284a20456e676c69736820746578741b2442467c4b5c386c2546252d2539254824481b284a20456e676c69736820746578741b2442467c4b5c386c2546252d2539254824481b284a20456e676c69736820746578741b2442467c4b5c386c2546252d2539254824481b284a20456e676c69736820746578741b2442467c4b5c386c2546252d2539254824481b284a20456e676c69736820746578741b2442467c4b5c386c2546252d2539254824481b284a20456e676c69736820746578741b2442467c4b5c386c2546252d2539254824481b284a20456e676c69736820746578741b2442467c4b5c386c2546252d2539254824481b284a20456e676c69736820746578741b2442467c4b5c386c2546252d2539254824481b284a20456e676c69736820746578741b2442467c4b5c386c2546252d2539254824481b284a20456e676c69736820746578741b2442467c4b5c386c2546252d2539254824481b284a20456e676c69736820746578741b2442467c4b5c386c2546252d2539254824481b284a20456e676c69736820746578741b2442467c4b5c386c2546252d2539254824481b284a20456e676c69736820746578741b2442467c4b5c386c2546252d2539254824481b284a20456e676c69736820746578741b2442467c4b5c386c2546252d2539254824481b284a20456e676c69736820746578741b2442467c4b5c386c2546252d2539254824481b284a20456e676c69736820746578741b2442467c4b5c386c2546252d2539254824481b284a20456e676c69736820746578741b2442467c4b5c386c2546252d2539254824481b284a20456e676c69736820746578741b2442467c4b5c386c2546252d2539254824481b284a20456e676c69736820746578741b2442467c4b5c386c2546252d2539254824481b284a20456e676c69736820746578741b2442467c4b5c386c2546252d2539254824481b284a20456e676c69736820746578741b2442467c4b5c386c2546252d2539254824481b284a20456e676c69736820746578741b2442467c4b5c386c2546252d2539254824481b284a20456e676c69736820746578741b2442467c4b5c386c2546252d2539254824481b284a20456e676c69736820746578741b2442467c4b5c386c2546252d2539254824481b284a20456e676c69736820746578741b2442467c4b5c386c1b284a 001- 1b2442467c4b5c386c2546252d2539254824481b284220456e676c69736820746578741b2442467c4b5c386c2546252d2539254824481b284220456e676c69736820746578741b2442467c4b5c386c2546252d2539254824481b284220456e676c69736820746578741b2442467c4b5c386c2546252d2539254824481b284220456e676c69736820746578741b2442467c4b5c386c2546252d2539254824481b284220456e676c69736820746578741b2442467c4b5c386c2546252d2539254824481b284220456e676c69736820746578741b2442467c4b5c386c2546252d2539254824481b284220456e676c69736820746578741b2442467c4b5c386c2546252d2539254824481b284220456e676c69736820746578741b2442467c4b5c386c2546252d2539254824481b284220456e676c69736820746578741b2442467c4b5c386c2546252d2539254824481b284220456e676c69736820746578741b2442467c4b5c386c2546252d2539254824481b284220456e676c69736820746578741b2442467c4b5c386c2546252d2539254824481b284220456e676c69736820746578741b2442467c4b5c386c2546252d2539254824481b284220456e676c69736820746578741b2442467c4b5c386c2546252d2539254824481b284220456e676c69736820746578741b2442467c4b5c386c2546252d2539254824481b284220456e676c69736820746578741b2442467c4b5c386c2546252d2539254824481b284220456e676c69736820746578741b2442467c4b5c386c2546252d2539254824481b284220456e676c69736820746578741b2442467c4b5c386c2546252d2539254824481b284220456e676c69736820746578741b2442467c4b5c386c2546252d2539254824481b284220456e676c69736820746578741b2442467c4b5c386c2546252d2539254824481b284220456e676c69736820746578741b2442467c4b5c386c2546252d2539254824481b284220456e676c69736820746578741b2442467c4b5c386c2546252d2539254824481b284220456e676c69736820746578741b2442467c4b5c386c2546252d2539254824481b284220456e676c69736820746578741b2442467c4b5c386c2546252d2539254824481b284220456e676c69736820746578741b2442467c4b5c386c2546252d2539254824481b284220456e676c69736820746578741b2442467c4b5c386c2546252d2539254824481b284220456e676c69736820746578741b2442467c4b5c386c2546252d2539254824481b284220456e676c69736820746578741b2442467c4b5c386c2546252d2539254824481b284220456e676c69736820746578741b2442467c4b5c386c2546252d2539254824481b284220456e676c69736820746578741b2442467c4b5c386c2546252d2539254824481b284220456e676c69736820746578741b2442467c4b5c386c1b2842 ================================================================================ ================================================================================ /home/contppw/php/php-5.6.34/ext/iconv/tests/iconv003.phpt ================================================================================ failed ================================================================================ 001+ failed 001- success ================================================================================ ================================================================================ /home/contppw/php/php-5.6.34/ext/iconv/tests/iconv004.phpt ================================================================================ Notice: iconv_mime_encode(): Unknown error (22) in /home/contppw/php/php-5.6.34/ext/iconv/tests/iconv004.php on line 2 bool(false) Notice: iconv_mime_encode(): Unknown error (22) in /home/contppw/php/php-5.6.34/ext/iconv/tests/iconv004.php on line 3 bool(false) ================================================================================ 001+ Notice: iconv_mime_encode(): Unknown error (22) in /home/contppw/php/php-5.6.34/ext/iconv/tests/iconv004.php on line 2 002+ bool(false) 001- string(19) ": =?ISO-8859-1?B??=" 002- string(19) ": =?ISO-8859-1?B??=" 003+ 004+ Notice: iconv_mime_encode(): Unknown error (22) in /home/contppw/php/php-5.6.34/ext/iconv/tests/iconv004.php on line 3 005+ bool(false) ================================================================================ ================================================================================ /home/contppw/php/php-5.6.34/ext/iconv/tests/iconv_basic_001.phpt ================================================================================ string(15) "?lu?ou?k? k??\n" ================================================================================ 001+ string(15) "?lu?ou?k? k??\n" 001- string(15) "Zlutoucky kun\n" ================================================================================ ================================================================================ /home/contppw/php/php-5.6.34/ext/iconv/tests/iconv_mime_decode_headers_variation1.phpt ================================================================================ *** Testing iconv_mime_decode_headers() : usage variations *** -- Iteration 1 -- Notice: iconv_mime_decode_headers(): Unknown error (22) in /home/contppw/php/php-5.6.34/ext/iconv/tests/iconv_mime_decode_headers_variation1.php on line 103 bool(false) -- Iteration 2 -- Notice: iconv_mime_decode_headers(): Unknown error (22) in /home/contppw/php/php-5.6.34/ext/iconv/tests/iconv_mime_decode_headers_variation1.php on line 103 bool(false) -- Iteration 3 -- Notice: iconv_mime_decode_headers(): Unknown error (22) in /home/contppw/php/php-5.6.34/ext/iconv/tests/iconv_mime_decode_headers_variation1.php on line 103 bool(false) -- Iteration 4 -- Notice: iconv_mime_decode_headers(): Unknown error (22) in /home/contppw/php/php-5.6.34/ext/iconv/tests/iconv_mime_decode_headers_variation1.php on line 103 bool(false) -- Iteration 5 -- Notice: iconv_mime_decode_headers(): Unknown error (22) in /home/contppw/php/php-5.6.34/ext/iconv/tests/iconv_mime_decode_headers_variation1.php on line 103 bool(false) -- Iteration 6 -- Notice: iconv_mime_decode_headers(): Unknown error (22) in /home/contppw/php/php-5.6.34/ext/iconv/tests/iconv_mime_decode_headers_variation1.php on line 103 bool(false) -- Iteration 7 -- Notice: iconv_mime_decode_headers(): Unknown error (22) in /home/contppw/php/php-5.6.34/ext/iconv/tests/iconv_mime_decode_headers_variation1.php on line 103 bool(false) -- Iteration 8 -- Notice: iconv_mime_decode_headers(): Unknown error (22) in /home/contppw/php/php-5.6.34/ext/iconv/tests/iconv_mime_decode_headers_variation1.php on line 103 bool(false) -- Iteration 9 -- Notice: iconv_mime_decode_headers(): Unknown error (22) in /home/contppw/php/php-5.6.34/ext/iconv/tests/iconv_mime_decode_headers_variation1.php on line 103 bool(false) -- Iteration 10 -- array(0) { } -- Iteration 11 -- array(0) { } -- Iteration 12 -- Notice: iconv_mime_decode_headers(): Unknown error (22) in /home/contppw/php/php-5.6.34/ext/iconv/tests/iconv_mime_decode_headers_variation1.php on line 103 bool(false) -- Iteration 13 -- array(0) { } -- Iteration 14 -- Notice: iconv_mime_decode_headers(): Unknown error (22) in /home/contppw/php/php-5.6.34/ext/iconv/tests/iconv_mime_decode_headers_variation1.php on line 103 bool(false) -- Iteration 15 -- array(0) { } -- Iteration 16 -- array(0) { } -- Iteration 17 -- array(0) { } -- Iteration 18 -- Notice: iconv_mime_decode_headers(): Unknown error (22) in /home/contppw/php/php-5.6.34/ext/iconv/tests/iconv_mime_decode_headers_variation1.php on line 103 bool(false) -- Iteration 19 -- Notice: iconv_mime_decode_headers(): Unknown error (22) in /home/contppw/php/php-5.6.34/ext/iconv/tests/iconv_mime_decode_headers_variation1.php on line 103 bool(false) -- Iteration 20 -- Notice: iconv_mime_decode_headers(): Unknown error (22) in /home/contppw/php/php-5.6.34/ext/iconv/tests/iconv_mime_decode_headers_variation1.php on line 103 bool(false) -- Iteration 21 -- Notice: iconv_mime_decode_headers(): Unknown error (22) in /home/contppw/php/php-5.6.34/ext/iconv/tests/iconv_mime_decode_headers_variation1.php on line 103 bool(false) -- Iteration 22 -- array(0) { } -- Iteration 23 -- array(0) { } -- Iteration 24 -- Warning: iconv_mime_decode_headers() expects parameter 1 to be string, resource given in /home/contppw/php/php-5.6.34/ext/iconv/tests/iconv_mime_decode_headers_variation1.php on line 103 bool(false) Done ================================================================================ 004+ 005+ Notice: iconv_mime_decode_headers(): Unknown error (22) in /home/contppw/php/php-5.6.34/ext/iconv/tests/iconv_mime_decode_headers_variation1.php on line 103 006+ bool(false) 004- array(0) { 005- } 008- array(0) { 009- } 009+ 010+ Notice: iconv_mime_decode_headers(): Unknown error (22) in /home/contppw/php/php-5.6.34/ext/iconv/tests/iconv_mime_decode_headers_variation1.php on line 103 011+ bool(false) 012- array(0) { 013- } 014+ 015+ Notice: iconv_mime_decode_headers(): Unknown error (22) in /home/contppw/php/php-5.6.34/ext/iconv/tests/iconv_mime_decode_headers_variation1.php on line 103 016+ bool(false) 016- array(0) { 017- } 019+ 020+ Notice: iconv_mime_decode_headers(): Unknown error (22) in /home/contppw/php/php-5.6.34/ext/iconv/tests/iconv_mime_decode_headers_variation1.php on line 103 021+ bool(false) 020- array(0) { 021- } 024+ 025+ Notice: iconv_mime_decode_headers(): Unknown error (22) in /home/contppw/php/php-5.6.34/ext/iconv/tests/iconv_mime_decode_headers_variation1.php on line 103 026+ bool(false) 024- array(0) { 025- } 028- array(0) { 029- } 029+ 030+ Notice: iconv_mime_decode_headers(): Unknown error (22) in /home/contppw/php/php-5.6.34/ext/iconv/tests/iconv_mime_decode_headers_variation1.php on line 103 031+ bool(false) 032- array(0) { 033- } 034+ 035+ Notice: iconv_mime_decode_headers(): Unknown error (22) in /home/contppw/php/php-5.6.34/ext/iconv/tests/iconv_mime_decode_headers_variation1.php on line 103 036+ bool(false) 035- -- Iteration 9 -- 036- array(0) { 037- } 038- 039+ 040+ Notice: iconv_mime_decode_headers(): Unknown error (22) in /home/contppw/php/php-5.6.34/ext/iconv/tests/iconv_mime_decode_headers_variation1.php on line 103 041+ bool(false) 042+ 043+ -- Iteration 9 -- 044+ 045+ Notice: iconv_mime_decode_headers(): Unknown error (22) in /home/contppw/php/php-5.6.34/ext/iconv/tests/iconv_mime_decode_headers_variation1.php on line 103 046+ bool(false) 048- array(0) { 049- } 056- array(0) { 057- } 057+ 058+ Notice: iconv_mime_decode_headers(): Unknown error (22) in /home/contppw/php/php-5.6.34/ext/iconv/tests/iconv_mime_decode_headers_variation1.php on line 103 059+ bool(false) 066+ 067+ Notice: iconv_mime_decode_headers(): Unknown error (22) in /home/contppw/php/php-5.6.34/ext/iconv/tests/iconv_mime_decode_headers_variation1.php on line 103 068+ bool(false) 072- array(0) { 073- } 076- array(0) { 077- } 080- array(0) { 081- } 083+ 084+ Notice: iconv_mime_decode_headers(): Unknown error (22) in /home/contppw/php/php-5.6.34/ext/iconv/tests/iconv_mime_decode_headers_variation1.php on line 103 085+ bool(false) 083- -- Iteration 21 -- 084- array(0) { 085- } 086- 088+ 089+ Notice: iconv_mime_decode_headers(): Unknown error (22) in /home/contppw/php/php-5.6.34/ext/iconv/tests/iconv_mime_decode_headers_variation1.php on line 103 090+ bool(false) 093+ 094+ Notice: iconv_mime_decode_headers(): Unknown error (22) in /home/contppw/php/php-5.6.34/ext/iconv/tests/iconv_mime_decode_headers_variation1.php on line 103 095+ bool(false) 096+ 097+ -- Iteration 21 -- 098+ 099+ Notice: iconv_mime_decode_headers(): Unknown error (22) in /home/contppw/php/php-5.6.34/ext/iconv/tests/iconv_mime_decode_headers_variation1.php on line 103 100+ bool(false) ================================================================================ ================================================================================ /home/contppw/php/php-5.6.34/ext/iconv/tests/iconv_mime_decode_variation1.phpt ================================================================================ *** Testing iconv_mime_decode() : usage variations *** -- Iteration 1 -- Notice: iconv_mime_decode(): Unknown error (22) in /home/contppw/php/php-5.6.34/ext/iconv/tests/iconv_mime_decode_variation1.php on line 91 bool(false) -- Iteration 2 -- Notice: iconv_mime_decode(): Unknown error (22) in /home/contppw/php/php-5.6.34/ext/iconv/tests/iconv_mime_decode_variation1.php on line 91 bool(false) -- Iteration 3 -- Notice: iconv_mime_decode(): Unknown error (22) in /home/contppw/php/php-5.6.34/ext/iconv/tests/iconv_mime_decode_variation1.php on line 91 bool(false) -- Iteration 4 -- Notice: iconv_mime_decode(): Unknown error (22) in /home/contppw/php/php-5.6.34/ext/iconv/tests/iconv_mime_decode_variation1.php on line 91 bool(false) -- Iteration 5 -- Notice: iconv_mime_decode(): Unknown error (22) in /home/contppw/php/php-5.6.34/ext/iconv/tests/iconv_mime_decode_variation1.php on line 91 bool(false) -- Iteration 6 -- Notice: iconv_mime_decode(): Unknown error (22) in /home/contppw/php/php-5.6.34/ext/iconv/tests/iconv_mime_decode_variation1.php on line 91 bool(false) -- Iteration 7 -- Notice: iconv_mime_decode(): Unknown error (22) in /home/contppw/php/php-5.6.34/ext/iconv/tests/iconv_mime_decode_variation1.php on line 91 bool(false) -- Iteration 8 -- Notice: iconv_mime_decode(): Unknown error (22) in /home/contppw/php/php-5.6.34/ext/iconv/tests/iconv_mime_decode_variation1.php on line 91 bool(false) -- Iteration 9 -- Notice: iconv_mime_decode(): Unknown error (22) in /home/contppw/php/php-5.6.34/ext/iconv/tests/iconv_mime_decode_variation1.php on line 91 bool(false) -- Iteration 10 -- Notice: iconv_mime_decode(): Unknown error (22) in /home/contppw/php/php-5.6.34/ext/iconv/tests/iconv_mime_decode_variation1.php on line 91 bool(false) -- Iteration 11 -- Notice: iconv_mime_decode(): Unknown error (22) in /home/contppw/php/php-5.6.34/ext/iconv/tests/iconv_mime_decode_variation1.php on line 91 bool(false) -- Iteration 12 -- Notice: iconv_mime_decode(): Unknown error (22) in /home/contppw/php/php-5.6.34/ext/iconv/tests/iconv_mime_decode_variation1.php on line 91 bool(false) -- Iteration 13 -- Notice: iconv_mime_decode(): Unknown error (22) in /home/contppw/php/php-5.6.34/ext/iconv/tests/iconv_mime_decode_variation1.php on line 91 bool(false) -- Iteration 14 -- Notice: iconv_mime_decode(): Unknown error (22) in /home/contppw/php/php-5.6.34/ext/iconv/tests/iconv_mime_decode_variation1.php on line 91 bool(false) -- Iteration 15 -- Notice: iconv_mime_decode(): Unknown error (22) in /home/contppw/php/php-5.6.34/ext/iconv/tests/iconv_mime_decode_variation1.php on line 91 bool(false) -- Iteration 16 -- Notice: iconv_mime_decode(): Unknown error (22) in /home/contppw/php/php-5.6.34/ext/iconv/tests/iconv_mime_decode_variation1.php on line 91 bool(false) -- Iteration 17 -- Notice: iconv_mime_decode(): Unknown error (22) in /home/contppw/php/php-5.6.34/ext/iconv/tests/iconv_mime_decode_variation1.php on line 91 bool(false) -- Iteration 18 -- Notice: iconv_mime_decode(): Unknown error (22) in /home/contppw/php/php-5.6.34/ext/iconv/tests/iconv_mime_decode_variation1.php on line 91 bool(false) -- Iteration 19 -- Notice: iconv_mime_decode(): Unknown error (22) in /home/contppw/php/php-5.6.34/ext/iconv/tests/iconv_mime_decode_variation1.php on line 91 bool(false) -- Iteration 20 -- Notice: iconv_mime_decode(): Unknown error (22) in /home/contppw/php/php-5.6.34/ext/iconv/tests/iconv_mime_decode_variation1.php on line 91 bool(false) -- Iteration 21 -- Notice: iconv_mime_decode(): Unknown error (22) in /home/contppw/php/php-5.6.34/ext/iconv/tests/iconv_mime_decode_variation1.php on line 91 bool(false) -- Iteration 22 -- Notice: iconv_mime_decode(): Unknown error (22) in /home/contppw/php/php-5.6.34/ext/iconv/tests/iconv_mime_decode_variation1.php on line 91 bool(false) -- Iteration 23 -- Notice: iconv_mime_decode(): Unknown error (22) in /home/contppw/php/php-5.6.34/ext/iconv/tests/iconv_mime_decode_variation1.php on line 91 bool(false) -- Iteration 24 -- Warning: iconv_mime_decode() expects parameter 1 to be string, resource given in /home/contppw/php/php-5.6.34/ext/iconv/tests/iconv_mime_decode_variation1.php on line 91 bool(false) Done ================================================================================ 004- string(1) "0" 005+ Notice: iconv_mime_decode(): Unknown error (22) in /home/contppw/php/php-5.6.34/ext/iconv/tests/iconv_mime_decode_variation1.php on line 91 006+ bool(false) 007+ 007- string(1) "1" 010+ Notice: iconv_mime_decode(): Unknown error (22) in /home/contppw/php/php-5.6.34/ext/iconv/tests/iconv_mime_decode_variation1.php on line 91 011+ bool(false) 012+ 010- string(5) "12345" 013- string(5) "-2345" 015+ Notice: iconv_mime_decode(): Unknown error (22) in /home/contppw/php/php-5.6.34/ext/iconv/tests/iconv_mime_decode_variation1.php on line 91 016+ bool(false) 017+ 016- string(4) "10.5" 019- string(5) "-10.5" 020+ Notice: iconv_mime_decode(): Unknown error (22) in /home/contppw/php/php-5.6.34/ext/iconv/tests/iconv_mime_decode_variation1.php on line 91 021+ bool(false) 022+ 022- string(12) "123456789000" 025+ Notice: iconv_mime_decode(): Unknown error (22) in /home/contppw/php/php-5.6.34/ext/iconv/tests/iconv_mime_decode_variation1.php on line 91 026+ bool(false) 027+ 025- string(13) "1.23456789E-9" 028- string(3) "0.5" 030+ Notice: iconv_mime_decode(): Unknown error (22) in /home/contppw/php/php-5.6.34/ext/iconv/tests/iconv_mime_decode_variation1.php on line 91 031+ bool(false) 032+ 031- string(0) "" 034- string(0) "" 035+ Notice: iconv_mime_decode(): Unknown error (22) in /home/contppw/php/php-5.6.34/ext/iconv/tests/iconv_mime_decode_variation1.php on line 91 036+ bool(false) 037+ 037- string(1) "1" 040+ Notice: iconv_mime_decode(): Unknown error (22) in /home/contppw/php/php-5.6.34/ext/iconv/tests/iconv_mime_decode_variation1.php on line 91 041+ bool(false) 042+ 040- string(0) "" 043- string(1) "1" 045+ Notice: iconv_mime_decode(): Unknown error (22) in /home/contppw/php/php-5.6.34/ext/iconv/tests/iconv_mime_decode_variation1.php on line 91 046+ bool(false) 047+ 046- string(0) "" 049- string(0) "" 050+ Notice: iconv_mime_decode(): Unknown error (22) in /home/contppw/php/php-5.6.34/ext/iconv/tests/iconv_mime_decode_variation1.php on line 91 051+ bool(false) 052+ 052- string(0) "" 055+ Notice: iconv_mime_decode(): Unknown error (22) in /home/contppw/php/php-5.6.34/ext/iconv/tests/iconv_mime_decode_variation1.php on line 91 056+ bool(false) 057+ 055- string(6) "string" 058- string(6) "string" 060+ Notice: iconv_mime_decode(): Unknown error (22) in /home/contppw/php/php-5.6.34/ext/iconv/tests/iconv_mime_decode_variation1.php on line 91 061+ bool(false) 062+ 061- string(11) "hello world" 064- string(14) "Class A object" 065+ Notice: iconv_mime_decode(): Unknown error (22) in /home/contppw/php/php-5.6.34/ext/iconv/tests/iconv_mime_decode_variation1.php on line 91 066+ bool(false) 067+ 067- string(0) "" 070+ Notice: iconv_mime_decode(): Unknown error (22) in /home/contppw/php/php-5.6.34/ext/iconv/tests/iconv_mime_decode_variation1.php on line 91 071+ bool(false) 072+ 070- string(0) "" 075+ Notice: iconv_mime_decode(): Unknown error (22) in /home/contppw/php/php-5.6.34/ext/iconv/tests/iconv_mime_decode_variation1.php on line 91 076+ bool(false) 077+ 080+ Notice: iconv_mime_decode(): Unknown error (22) in /home/contppw/php/php-5.6.34/ext/iconv/tests/iconv_mime_decode_variation1.php on line 91 081+ bool(false) 082+ 085+ Notice: iconv_mime_decode(): Unknown error (22) in /home/contppw/php/php-5.6.34/ext/iconv/tests/iconv_mime_decode_variation1.php on line 91 086+ bool(false) 087+ 090+ Notice: iconv_mime_decode(): Unknown error (22) in /home/contppw/php/php-5.6.34/ext/iconv/tests/iconv_mime_decode_variation1.php on line 91 091+ bool(false) 092+ 095+ Notice: iconv_mime_decode(): Unknown error (22) in /home/contppw/php/php-5.6.34/ext/iconv/tests/iconv_mime_decode_variation1.php on line 91 096+ bool(false) 097+ 100+ Notice: iconv_mime_decode(): Unknown error (22) in /home/contppw/php/php-5.6.34/ext/iconv/tests/iconv_mime_decode_variation1.php on line 91 101+ bool(false) 102+ 105+ Notice: iconv_mime_decode(): Unknown error (22) in /home/contppw/php/php-5.6.34/ext/iconv/tests/iconv_mime_decode_variation1.php on line 91 106+ bool(false) 107+ 110+ Notice: iconv_mime_decode(): Unknown error (22) in /home/contppw/php/php-5.6.34/ext/iconv/tests/iconv_mime_decode_variation1.php on line 91 111+ bool(false) 112+ 114+ 115+ Notice: iconv_mime_decode(): Unknown error (22) in /home/contppw/php/php-5.6.34/ext/iconv/tests/iconv_mime_decode_variation1.php on line 91 116+ bool(false) ================================================================================ ================================================================================ /home/contppw/php/php-5.6.34/ext/iconv/tests/iconv_mime_decode_variation3.phpt ================================================================================ *** Testing iconv_mime_decode() : usage variations *** -- Iteration 1 -- Notice: iconv_mime_decode(): Unknown error (22) in /home/contppw/php/php-5.6.34/ext/iconv/tests/iconv_mime_decode_variation3.php on line 94 bool(false) -- Iteration 2 -- Notice: iconv_mime_decode(): Unknown error (22) in /home/contppw/php/php-5.6.34/ext/iconv/tests/iconv_mime_decode_variation3.php on line 94 bool(false) -- Iteration 3 -- Notice: iconv_mime_decode(): Unknown error (22) in /home/contppw/php/php-5.6.34/ext/iconv/tests/iconv_mime_decode_variation3.php on line 94 bool(false) -- Iteration 4 -- Notice: iconv_mime_decode(): Unknown error (22) in /home/contppw/php/php-5.6.34/ext/iconv/tests/iconv_mime_decode_variation3.php on line 94 bool(false) -- Iteration 5 -- Notice: iconv_mime_decode(): Unknown error (22) in /home/contppw/php/php-5.6.34/ext/iconv/tests/iconv_mime_decode_variation3.php on line 94 bool(false) -- Iteration 6 -- Notice: iconv_mime_decode(): Unknown error (22) in /home/contppw/php/php-5.6.34/ext/iconv/tests/iconv_mime_decode_variation3.php on line 94 bool(false) -- Iteration 7 -- Notice: iconv_mime_decode(): Unknown error (22) in /home/contppw/php/php-5.6.34/ext/iconv/tests/iconv_mime_decode_variation3.php on line 94 bool(false) -- Iteration 8 -- Notice: iconv_mime_decode(): Unknown error (22) in /home/contppw/php/php-5.6.34/ext/iconv/tests/iconv_mime_decode_variation3.php on line 94 bool(false) -- Iteration 9 -- Notice: iconv_mime_decode(): Unknown error (22) in /home/contppw/php/php-5.6.34/ext/iconv/tests/iconv_mime_decode_variation3.php on line 94 bool(false) -- Iteration 10 -- string(44) "5375626a6563743a20412053616d706c652054657374" -- Iteration 11 -- string(44) "5375626a6563743a20412053616d706c652054657374" -- Iteration 12 -- Notice: iconv_mime_decode(): Unknown error (22) in /home/contppw/php/php-5.6.34/ext/iconv/tests/iconv_mime_decode_variation3.php on line 94 bool(false) -- Iteration 13 -- string(44) "5375626a6563743a20412053616d706c652054657374" -- Iteration 14 -- Notice: iconv_mime_decode(): Unknown error (22) in /home/contppw/php/php-5.6.34/ext/iconv/tests/iconv_mime_decode_variation3.php on line 94 bool(false) -- Iteration 15 -- string(44) "5375626a6563743a20412053616d706c652054657374" -- Iteration 16 -- string(44) "5375626a6563743a20412053616d706c652054657374" -- Iteration 17 -- string(44) "5375626a6563743a20412053616d706c652054657374" -- Iteration 18 -- Notice: iconv_mime_decode(): Unknown error (22) in /home/contppw/php/php-5.6.34/ext/iconv/tests/iconv_mime_decode_variation3.php on line 94 bool(false) -- Iteration 19 -- Notice: iconv_mime_decode(): Unknown error (22) in /home/contppw/php/php-5.6.34/ext/iconv/tests/iconv_mime_decode_variation3.php on line 94 bool(false) -- Iteration 20 -- Notice: iconv_mime_decode(): Unknown error (22) in /home/contppw/php/php-5.6.34/ext/iconv/tests/iconv_mime_decode_variation3.php on line 94 bool(false) -- Iteration 21 -- Notice: iconv_mime_decode(): Unknown error (22) in /home/contppw/php/php-5.6.34/ext/iconv/tests/iconv_mime_decode_variation3.php on line 94 bool(false) -- Iteration 22 -- string(44) "5375626a6563743a20412053616d706c652054657374" -- Iteration 23 -- string(44) "5375626a6563743a20412053616d706c652054657374" -- Iteration 24 -- Warning: iconv_mime_decode() expects parameter 3 to be string, resource given in /home/contppw/php/php-5.6.34/ext/iconv/tests/iconv_mime_decode_variation3.php on line 94 bool(false) Done ================================================================================ 005+ Notice: iconv_mime_decode(): Unknown error (22) in /home/contppw/php/php-5.6.34/ext/iconv/tests/iconv_mime_decode_variation3.php on line 94 005- Notice: iconv_mime_decode(): Wrong charset, conversion from `???' to `0' is not allowed in %s on line %d 010+ Notice: iconv_mime_decode(): Unknown error (22) in /home/contppw/php/php-5.6.34/ext/iconv/tests/iconv_mime_decode_variation3.php on line 94 010- Notice: iconv_mime_decode(): Wrong charset, conversion from `???' to `1' is not allowed in %s on line %d 015+ Notice: iconv_mime_decode(): Unknown error (22) in /home/contppw/php/php-5.6.34/ext/iconv/tests/iconv_mime_decode_variation3.php on line 94 015- Notice: iconv_mime_decode(): Wrong charset, conversion from `???' to `12345' is not allowed in %s on line %d 020+ Notice: iconv_mime_decode(): Unknown error (22) in /home/contppw/php/php-5.6.34/ext/iconv/tests/iconv_mime_decode_variation3.php on line 94 020- Notice: iconv_mime_decode(): Wrong charset, conversion from `???' to `-2345' is not allowed in %s on line %d 025+ Notice: iconv_mime_decode(): Unknown error (22) in /home/contppw/php/php-5.6.34/ext/iconv/tests/iconv_mime_decode_variation3.php on line 94 025- Notice: iconv_mime_decode(): Wrong charset, conversion from `???' to `10.5' is not allowed in %s on line %d 030+ Notice: iconv_mime_decode(): Unknown error (22) in /home/contppw/php/php-5.6.34/ext/iconv/tests/iconv_mime_decode_variation3.php on line 94 030- Notice: iconv_mime_decode(): Wrong charset, conversion from `???' to `-10.5' is not allowed in %s on line %d 035+ Notice: iconv_mime_decode(): Unknown error (22) in /home/contppw/php/php-5.6.34/ext/iconv/tests/iconv_mime_decode_variation3.php on line 94 035- Notice: iconv_mime_decode(): Wrong charset, conversion from `???' to `123456789000' is not allowed in %s on line %d 040+ Notice: iconv_mime_decode(): Unknown error (22) in /home/contppw/php/php-5.6.34/ext/iconv/tests/iconv_mime_decode_variation3.php on line 94 040- Notice: iconv_mime_decode(): Wrong charset, conversion from `???' to `1.23456789E-9' is not allowed in %s on line %d 045+ Notice: iconv_mime_decode(): Unknown error (22) in /home/contppw/php/php-5.6.34/ext/iconv/tests/iconv_mime_decode_variation3.php on line 94 045- Notice: iconv_mime_decode(): Wrong charset, conversion from `???' to `0.5' is not allowed in %s on line %d 056+ Notice: iconv_mime_decode(): Unknown error (22) in /home/contppw/php/php-5.6.34/ext/iconv/tests/iconv_mime_decode_variation3.php on line 94 056- Notice: iconv_mime_decode(): Wrong charset, conversion from `???' to `1' is not allowed in %s on line %d 064+ Notice: iconv_mime_decode(): Unknown error (22) in /home/contppw/php/php-5.6.34/ext/iconv/tests/iconv_mime_decode_variation3.php on line 94 064- Notice: iconv_mime_decode(): Wrong charset, conversion from `???' to `1' is not allowed in %s on line %d 078+ Notice: iconv_mime_decode(): Unknown error (22) in /home/contppw/php/php-5.6.34/ext/iconv/tests/iconv_mime_decode_variation3.php on line 94 078- Notice: iconv_mime_decode(): Wrong charset, conversion from `???' to `string' is not allowed in %s on line %d 083+ Notice: iconv_mime_decode(): Unknown error (22) in /home/contppw/php/php-5.6.34/ext/iconv/tests/iconv_mime_decode_variation3.php on line 94 083- Notice: iconv_mime_decode(): Wrong charset, conversion from `???' to `string' is not allowed in %s on line %d 088+ Notice: iconv_mime_decode(): Unknown error (22) in /home/contppw/php/php-5.6.34/ext/iconv/tests/iconv_mime_decode_variation3.php on line 94 088- Notice: iconv_mime_decode(): Wrong charset, conversion from `???' to `hello world' is not allowed in %s on line %d 093+ Notice: iconv_mime_decode(): Unknown error (22) in /home/contppw/php/php-5.6.34/ext/iconv/tests/iconv_mime_decode_variation3.php on line 94 093- Notice: iconv_mime_decode(): Wrong charset, conversion from `???' to `Class A object' is not allowed in %s on line %d ================================================================================ ================================================================================ /home/contppw/php/php-5.6.34/ext/iconv/tests/iconv_mime_encode.phpt ================================================================================ -------- line length=0 2: iconv_mime_encode(): Buffer length exceeded bool(false) -------- -------- line length=1 2: iconv_mime_encode(): Buffer length exceeded bool(false) -------- -------- line length=2 2: iconv_mime_encode(): Buffer length exceeded bool(false) -------- -------- line length=3 2: iconv_mime_encode(): Buffer length exceeded bool(false) -------- -------- line length=4 2: iconv_mime_encode(): Buffer length exceeded bool(false) -------- -------- line length=5 2: iconv_mime_encode(): Buffer length exceeded bool(false) -------- -------- line length=6 2: iconv_mime_encode(): Buffer length exceeded bool(false) -------- -------- line length=7 2: iconv_mime_encode(): Buffer length exceeded bool(false) -------- -------- line length=8 2: iconv_mime_encode(): Buffer length exceeded bool(false) -------- -------- line length=9 2: iconv_mime_encode(): Buffer length exceeded bool(false) -------- -------- line length=10 2: iconv_mime_encode(): Buffer length exceeded bool(false) -------- -------- line length=11 2: iconv_mime_encode(): Buffer length exceeded bool(false) -------- -------- line length=12 2: iconv_mime_encode(): Buffer length exceeded bool(false) -------- -------- line length=13 2: iconv_mime_encode(): Buffer length exceeded bool(false) -------- -------- line length=14 2: iconv_mime_encode(): Buffer length exceeded bool(false) -------- -------- line length=15 2: iconv_mime_encode(): Buffer length exceeded bool(false) -------- -------- line length=16 2: iconv_mime_encode(): Buffer length exceeded bool(false) -------- -------- line length=17 2: iconv_mime_encode(): Buffer length exceeded bool(false) -------- -------- line length=18 2: iconv_mime_encode(): Buffer length exceeded bool(false) -------- -------- line length=19 2: iconv_mime_encode(): Buffer length exceeded bool(false) -------- -------- line length=20 2: iconv_mime_encode(): Buffer length exceeded bool(false) -------- -------- line length=21 2: iconv_mime_encode(): Buffer length exceeded bool(false) -------- -------- line length=22 2: iconv_mime_encode(): Buffer length exceeded bool(false) -------- -------- line length=23 2: iconv_mime_encode(): Buffer length exceeded bool(false) -------- -------- line length=24 8: iconv_mime_encode(): Unknown error (22) bool(false) -------- -------- line length=25 8: iconv_mime_encode(): Unknown error (22) bool(false) -------- -------- line length=26 8: iconv_mime_encode(): Unknown error (22) bool(false) -------- -------- line length=27 8: iconv_mime_encode(): Unknown error (22) bool(false) -------- -------- line length=28 8: iconv_mime_encode(): Unknown error (22) bool(false) -------- -------- line length=29 8: iconv_mime_encode(): Unknown error (22) bool(false) -------- -------- line length=30 8: iconv_mime_encode(): Unknown error (22) bool(false) -------- -------- line length=31 8: iconv_mime_encode(): Unknown error (22) bool(false) -------- -------- line length=32 8: iconv_mime_encode(): Unknown error (22) bool(false) -------- -------- line length=33 8: iconv_mime_encode(): Unknown error (22) bool(false) -------- -------- line length=34 8: iconv_mime_encode(): Unknown error (22) bool(false) -------- -------- line length=35 8: iconv_mime_encode(): Unknown error (22) bool(false) -------- -------- line length=36 8: iconv_mime_encode(): Unknown error (22) bool(false) -------- -------- line length=37 8: iconv_mime_encode(): Unknown error (22) bool(false) -------- -------- line length=38 8: iconv_mime_encode(): Unknown error (22) bool(false) -------- -------- line length=39 8: iconv_mime_encode(): Unknown error (22) bool(false) -------- -------- line length=40 8: iconv_mime_encode(): Unknown error (22) bool(false) -------- -------- line length=41 8: iconv_mime_encode(): Unknown error (22) bool(false) -------- -------- line length=42 8: iconv_mime_encode(): Unknown error (22) bool(false) -------- -------- line length=43 8: iconv_mime_encode(): Unknown error (22) bool(false) -------- -------- line length=44 8: iconv_mime_encode(): Unknown error (22) bool(false) -------- -------- line length=45 8: iconv_mime_encode(): Unknown error (22) bool(false) -------- -------- line length=46 8: iconv_mime_encode(): Unknown error (22) bool(false) -------- -------- line length=47 8: iconv_mime_encode(): Unknown error (22) bool(false) -------- -------- line length=48 8: iconv_mime_encode(): Unknown error (22) bool(false) -------- -------- line length=49 8: iconv_mime_encode(): Unknown error (22) bool(false) -------- -------- line length=50 8: iconv_mime_encode(): Unknown error (22) bool(false) -------- -------- line length=51 8: iconv_mime_encode(): Unknown error (22) bool(false) -------- -------- line length=52 8: iconv_mime_encode(): Unknown error (22) bool(false) -------- -------- line length=53 8: iconv_mime_encode(): Unknown error (22) bool(false) -------- -------- line length=54 8: iconv_mime_encode(): Unknown error (22) bool(false) -------- -------- line length=55 8: iconv_mime_encode(): Unknown error (22) bool(false) -------- -------- line length=56 8: iconv_mime_encode(): Unknown error (22) bool(false) -------- -------- line length=57 8: iconv_mime_encode(): Unknown error (22) bool(false) -------- -------- line length=58 8: iconv_mime_encode(): Unknown error (22) bool(false) -------- -------- line length=59 8: iconv_mime_encode(): Unknown error (22) bool(false) -------- -------- line length=60 8: iconv_mime_encode(): Unknown error (22) bool(false) -------- -------- line length=61 8: iconv_mime_encode(): Unknown error (22) bool(false) -------- -------- line length=62 8: iconv_mime_encode(): Unknown error (22) bool(false) -------- -------- line length=63 8: iconv_mime_encode(): Unknown error (22) bool(false) -------- -------- line length=64 8: iconv_mime_encode(): Unknown error (22) bool(false) -------- -------- line length=65 8: iconv_mime_encode(): Unknown error (22) bool(false) -------- -------- line length=66 8: iconv_mime_encode(): Unknown error (22) bool(false) -------- -------- line length=67 8: iconv_mime_encode(): Unknown error (22) bool(false) -------- -------- line length=68 8: iconv_mime_encode(): Unknown error (22) bool(false) -------- -------- line length=69 8: iconv_mime_encode(): Unknown error (22) bool(false) -------- -------- line length=70 8: iconv_mime_encode(): Unknown error (22) bool(false) -------- -------- line length=71 8: iconv_mime_encode(): Unknown error (22) bool(false) -------- -------- line length=72 8: iconv_mime_encode(): Unknown error (22) bool(false) -------- -------- line length=73 8: iconv_mime_encode(): Unknown error (22) bool(false) -------- -------- line length=74 8: iconv_mime_encode(): Unknown error (22) bool(false) -------- -------- line length=75 8: iconv_mime_encode(): Unknown error (22) bool(false) -------- -------- line length=76 8: iconv_mime_encode(): Unknown error (22) bool(false) -------- -------- line length=77 8: iconv_mime_encode(): Unknown error (22) bool(false) -------- -------- line length=78 8: iconv_mime_encode(): Unknown error (22) bool(false) -------- -------- line length=79 8: iconv_mime_encode(): Unknown error (22) bool(false) -------- ================================================================================ 098+ 8: iconv_mime_encode(): Unknown error (22) 098- 2: %s 102+ 8: iconv_mime_encode(): Unknown error (22) 102- 2: %s 106+ 8: iconv_mime_encode(): Unknown error (22) 106- 2: %s 110+ 8: iconv_mime_encode(): Unknown error (22) 110- 2: %s 114+ 8: iconv_mime_encode(): Unknown error (22) 114- 2: %s 118+ 8: iconv_mime_encode(): Unknown error (22) 118- 2: %s 122+ 8: iconv_mime_encode(): Unknown error (22) 122- 2: %s 126+ 8: iconv_mime_encode(): Unknown error (22) 126- 2: %s 130+ 8: iconv_mime_encode(): Unknown error (22) 130- 2: %s 134+ 8: iconv_mime_encode(): Unknown error (22) 134- 2: %s 138+ 8: iconv_mime_encode(): Unknown error (22) 138- 2: %s 142+ 8: iconv_mime_encode(): Unknown error (22) 142- 2: %s 146+ 8: iconv_mime_encode(): Unknown error (22) 147+ bool(false) 148+ -------- 149+ -------- line length=37 150+ 8: iconv_mime_encode(): Unknown error (22) 151+ bool(false) 152+ -------- 153+ -------- line length=38 154+ 8: iconv_mime_encode(): Unknown error (22) 155+ bool(false) 156+ -------- 157+ -------- line length=39 158+ 8: iconv_mime_encode(): Unknown error (22) 159+ bool(false) 160+ -------- 161+ -------- line length=40 162+ 8: iconv_mime_encode(): Unknown error (22) 163+ bool(false) 164+ -------- 165+ -------- line length=41 166+ 8: iconv_mime_encode(): Unknown error (22) 167+ bool(false) 168+ -------- 169+ -------- line length=42 170+ 8: iconv_mime_encode(): Unknown error (22) 171+ bool(false) 172+ -------- 173+ -------- line length=43 174+ 8: iconv_mime_encode(): Unknown error (22) 175+ bool(false) 176+ -------- 177+ -------- line length=44 178+ 8: iconv_mime_encode(): Unknown error (22) 179+ bool(false) 180+ -------- 181+ -------- line length=45 182+ 8: iconv_mime_encode(): Unknown error (22) 183+ bool(false) 184+ -------- 185+ -------- line length=46 186+ 8: iconv_mime_encode(): Unknown error (22) 187+ bool(false) 188+ -------- 189+ -------- line length=47 190+ 8: iconv_mime_encode(): Unknown error (22) 191+ bool(false) 192+ -------- 193+ -------- line length=48 194+ 8: iconv_mime_encode(): Unknown error (22) 195+ bool(false) 196+ -------- 197+ -------- line length=49 198+ 8: iconv_mime_encode(): Unknown error (22) 199+ bool(false) 200+ -------- 201+ -------- line length=50 202+ 8: iconv_mime_encode(): Unknown error (22) 203+ bool(false) 204+ -------- 205+ -------- line length=51 206+ 8: iconv_mime_encode(): Unknown error (22) 207+ bool(false) 208+ -------- 209+ -------- line length=52 210+ 8: iconv_mime_encode(): Unknown error (22) 211+ bool(false) 212+ -------- 213+ -------- line length=53 214+ 8: iconv_mime_encode(): Unknown error (22) 215+ bool(false) 216+ -------- 217+ -------- line length=54 218+ 8: iconv_mime_encode(): Unknown error (22) 219+ bool(false) 220+ -------- 221+ -------- line length=55 222+ 8: iconv_mime_encode(): Unknown error (22) 223+ bool(false) 224+ -------- 225+ -------- line length=56 226+ 8: iconv_mime_encode(): Unknown error (22) 227+ bool(false) 228+ -------- 229+ -------- line length=57 230+ 8: iconv_mime_encode(): Unknown error (22) 231+ bool(false) 232+ -------- 233+ -------- line length=58 234+ 8: iconv_mime_encode(): Unknown error (22) 235+ bool(false) 236+ -------- 237+ -------- line length=59 238+ 8: iconv_mime_encode(): Unknown error (22) 239+ bool(false) 240+ -------- 241+ -------- line length=60 242+ 8: iconv_mime_encode(): Unknown error (22) 243+ bool(false) 244+ -------- 245+ -------- line length=61 246+ 8: iconv_mime_encode(): Unknown error (22) 247+ bool(false) 248+ -------- 249+ -------- line length=62 250+ 8: iconv_mime_encode(): Unknown error (22) 251+ bool(false) 252+ -------- 253+ -------- line length=63 254+ 8: iconv_mime_encode(): Unknown error (22) 255+ bool(false) 256+ -------- 257+ -------- line length=64 258+ 8: iconv_mime_encode(): Unknown error (22) 259+ bool(false) 260+ -------- 261+ -------- line length=65 262+ 8: iconv_mime_encode(): Unknown error (22) 263+ bool(false) 264+ -------- 265+ -------- line length=66 266+ 8: iconv_mime_encode(): Unknown error (22) 267+ bool(false) 268+ -------- 269+ -------- line length=67 270+ 8: iconv_mime_encode(): Unknown error (22) 271+ bool(false) 272+ -------- 273+ -------- line length=68 274+ 8: iconv_mime_encode(): Unknown error (22) 275+ bool(false) 276+ -------- 277+ -------- line length=69 278+ 8: iconv_mime_encode(): Unknown error (22) 279+ bool(false) 280+ -------- 281+ -------- line length=70 282+ 8: iconv_mime_encode(): Unknown error (22) 283+ bool(false) 284+ -------- 285+ -------- line length=71 286+ 8: iconv_mime_encode(): Unknown error (22) 287+ bool(false) 288+ -------- 289+ -------- line length=72 290+ 8: iconv_mime_encode(): Unknown error (22) 291+ bool(false) 292+ -------- 293+ -------- line length=73 294+ 8: iconv_mime_encode(): Unknown error (22) 295+ bool(false) 296+ -------- 297+ -------- line length=74 298+ 8: iconv_mime_encode(): Unknown error (22) 299+ bool(false) 300+ -------- 301+ -------- line length=75 302+ 8: iconv_mime_encode(): Unknown error (22) 303+ bool(false) 304+ -------- 305+ -------- line length=76 306+ 8: iconv_mime_encode(): Unknown error (22) 307+ bool(false) 308+ -------- 309+ -------- line length=77 310+ 8: iconv_mime_encode(): Unknown error (22) 311+ bool(false) 312+ -------- 313+ -------- line length=78 314+ 8: iconv_mime_encode(): Unknown error (22) 315+ bool(false) 316+ -------- 317+ -------- line length=79 318+ 8: iconv_mime_encode(): Unknown error (22) 319+ bool(false) 320+ -------- 146- string(396) "From: =?ISO-2022-JP?B?GyRCJTUbKEI=?= 147- =?ISO-2022-JP?B?GyRCJXMlVxsoQg==?= 148- =?ISO-2022-JP?B?GyRCJWtKOBsoQg==?= 149- =?ISO-2022-JP?B?GyRCO3pOcxsoQg==?= 150- =?ISO-2022-JP?B?GyRCJTUlcxsoQg==?= 151- =?ISO-2022-JP?B?GyRCJVclaxsoQg==?= 152- =?ISO-2022-JP?B?GyRCSjg7ehsoQg==?= 153- =?ISO-2022-JP?B?GyRCTnNGfBsoQg==?= 154- =?ISO-2022-JP?B?GyRCS1w4bBsoQg==?= 155- =?ISO-2022-JP?B?GyRCJUYlLRsoQg==?= 156- =?ISO-2022-JP?B?GyRCJTklSBsoQg==?=" 157- -------- bool(true) 158- -------- line length=37 159- string(396) "From: =?ISO-2022-JP?B?GyRCJTUbKEI=?= 160- =?ISO-2022-JP?B?GyRCJXMlVxsoQg==?= 161- =?ISO-2022-JP?B?GyRCJWtKOBsoQg==?= 162- =?ISO-2022-JP?B?GyRCO3pOcxsoQg==?= 163- =?ISO-2022-JP?B?GyRCJTUlcxsoQg==?= 164- =?ISO-2022-JP?B?GyRCJVclaxsoQg==?= 165- =?ISO-2022-JP?B?GyRCSjg7ehsoQg==?= 166- =?ISO-2022-JP?B?GyRCTnNGfBsoQg==?= 167- =?ISO-2022-JP?B?GyRCS1w4bBsoQg==?= 168- =?ISO-2022-JP?B?GyRCJUYlLRsoQg==?= 169- =?ISO-2022-JP?B?GyRCJTklSBsoQg==?=" 170- -------- bool(true) 171- -------- line length=38 172- string(396) "From: =?ISO-2022-JP?B?GyRCJTUbKEI=?= 173- =?ISO-2022-JP?B?GyRCJXMlVxsoQg==?= 174- =?ISO-2022-JP?B?GyRCJWtKOBsoQg==?= 175- =?ISO-2022-JP?B?GyRCO3pOcxsoQg==?= 176- =?ISO-2022-JP?B?GyRCJTUlcxsoQg==?= 177- =?ISO-2022-JP?B?GyRCJVclaxsoQg==?= 178- =?ISO-2022-JP?B?GyRCSjg7ehsoQg==?= 179- =?ISO-2022-JP?B?GyRCTnNGfBsoQg==?= 180- =?ISO-2022-JP?B?GyRCS1w4bBsoQg==?= 181- =?ISO-2022-JP?B?GyRCJUYlLRsoQg==?= 182- =?ISO-2022-JP?B?GyRCJTklSBsoQg==?=" 183- -------- bool(true) 184- -------- line length=39 185- string(236) "From: =?ISO-2022-JP?B?GyRCJTUbKEI=?= 186- =?ISO-2022-JP?B?GyRCJXMlVyVrSjgbKEI=?= 187- =?ISO-2022-JP?B?GyRCO3pOcyU1JXMbKEI=?= 188- =?ISO-2022-JP?B?GyRCJVcla0o4O3obKEI=?= 189- =?ISO-2022-JP?B?GyRCTnNGfEtcOGwbKEI=?= 190- =?ISO-2022-JP?B?GyRCJUYlLSU5JUgbKEI=?=" 191- -------- bool(true) 192- -------- line length=40 193- string(236) "From: =?ISO-2022-JP?B?GyRCJTUlcxsoQg==?= 194- =?ISO-2022-JP?B?GyRCJVcla0o4O3obKEI=?= 195- =?ISO-2022-JP?B?GyRCTnMlNSVzJVcbKEI=?= 196- =?ISO-2022-JP?B?GyRCJWtKODt6TnMbKEI=?= 197- =?ISO-2022-JP?B?GyRCRnxLXDhsJUYbKEI=?= 198- =?ISO-2022-JP?B?GyRCJS0lOSVIGyhC?=" 199- -------- bool(true) 200- -------- line length=41 201- string(236) "From: =?ISO-2022-JP?B?GyRCJTUlcxsoQg==?= 202- =?ISO-2022-JP?B?GyRCJVcla0o4O3obKEI=?= 203- =?ISO-2022-JP?B?GyRCTnMlNSVzJVcbKEI=?= 204- =?ISO-2022-JP?B?GyRCJWtKODt6TnMbKEI=?= 205- =?ISO-2022-JP?B?GyRCRnxLXDhsJUYbKEI=?= 206- =?ISO-2022-JP?B?GyRCJS0lOSVIGyhC?=" 207- -------- bool(true) 208- -------- line length=42 209- string(236) "From: =?ISO-2022-JP?B?GyRCJTUlcxsoQg==?= 210- =?ISO-2022-JP?B?GyRCJVcla0o4O3obKEI=?= 211- =?ISO-2022-JP?B?GyRCTnMlNSVzJVcbKEI=?= 212- =?ISO-2022-JP?B?GyRCJWtKODt6TnMbKEI=?= 213- =?ISO-2022-JP?B?GyRCRnxLXDhsJUYbKEI=?= 214- =?ISO-2022-JP?B?GyRCJS0lOSVIGyhC?=" 215- -------- bool(true) 216- -------- line length=43 217- string(212) "From: =?ISO-2022-JP?B?GyRCJTUlcxsoQg==?= 218- =?ISO-2022-JP?B?GyRCJVcla0o4O3pOcxsoQg==?= 219- =?ISO-2022-JP?B?GyRCJTUlcyVXJWtKOBsoQg==?= 220- =?ISO-2022-JP?B?GyRCO3pOc0Z8S1w4bBsoQg==?= 221- =?ISO-2022-JP?B?GyRCJUYlLSU5JUgbKEI=?=" 222- -------- bool(true) 223- -------- line length=44 224- string(212) "From: =?ISO-2022-JP?B?GyRCJTUlcyVXJWsbKEI=?= 225- =?ISO-2022-JP?B?GyRCSjg7ek5zJTUlcxsoQg==?= 226- =?ISO-2022-JP?B?GyRCJVcla0o4O3pOcxsoQg==?= 227- =?ISO-2022-JP?B?GyRCRnxLXDhsJUYlLRsoQg==?= 228- =?ISO-2022-JP?B?GyRCJTklSBsoQg==?=" 229- -------- bool(true) 230- -------- line length=45 231- string(212) "From: =?ISO-2022-JP?B?GyRCJTUlcyVXJWsbKEI=?= 232- =?ISO-2022-JP?B?GyRCSjg7ek5zJTUlcxsoQg==?= 233- =?ISO-2022-JP?B?GyRCJVcla0o4O3pOcxsoQg==?= 234- =?ISO-2022-JP?B?GyRCRnxLXDhsJUYlLRsoQg==?= 235- =?ISO-2022-JP?B?GyRCJTklSBsoQg==?=" 236- -------- bool(true) 237- -------- line length=46 238- string(212) "From: =?ISO-2022-JP?B?GyRCJTUlcyVXJWsbKEI=?= 239- =?ISO-2022-JP?B?GyRCSjg7ek5zJTUlcxsoQg==?= 240- =?ISO-2022-JP?B?GyRCJVcla0o4O3pOcxsoQg==?= 241- =?ISO-2022-JP?B?GyRCRnxLXDhsJUYlLRsoQg==?= 242- =?ISO-2022-JP?B?GyRCJTklSBsoQg==?=" 243- -------- bool(true) 244- -------- line length=47 245- string(176) "From: =?ISO-2022-JP?B?GyRCJTUlcyVXJWsbKEI=?= 246- =?ISO-2022-JP?B?GyRCSjg7ek5zJTUlcyVXJWsbKEI=?= 247- =?ISO-2022-JP?B?GyRCSjg7ek5zRnxLXDhsJUYbKEI=?= 248- =?ISO-2022-JP?B?GyRCJS0lOSVIGyhC?=" 249- -------- bool(true) 250- -------- line length=48 251- string(180) "From: =?ISO-2022-JP?B?GyRCJTUlcyVXJWtKOBsoQg==?= 252- =?ISO-2022-JP?B?GyRCO3pOcyU1JXMlVyVrSjgbKEI=?= 253- =?ISO-2022-JP?B?GyRCO3pOc0Z8S1w4bCVGJS0bKEI=?= 254- =?ISO-2022-JP?B?GyRCJTklSBsoQg==?=" 255- -------- bool(true) 256- -------- line length=49 257- string(180) "From: =?ISO-2022-JP?B?GyRCJTUlcyVXJWtKOBsoQg==?= 258- =?ISO-2022-JP?B?GyRCO3pOcyU1JXMlVyVrSjgbKEI=?= 259- =?ISO-2022-JP?B?GyRCO3pOc0Z8S1w4bCVGJS0bKEI=?= 260- =?ISO-2022-JP?B?GyRCJTklSBsoQg==?=" 261- -------- bool(true) 262- -------- line length=50 263- string(180) "From: =?ISO-2022-JP?B?GyRCJTUlcyVXJWtKOBsoQg==?= 264- =?ISO-2022-JP?B?GyRCO3pOcyU1JXMlVyVrSjgbKEI=?= 265- =?ISO-2022-JP?B?GyRCO3pOc0Z8S1w4bCVGJS0bKEI=?= 266- =?ISO-2022-JP?B?GyRCJTklSBsoQg==?=" 267- -------- bool(true) 268- -------- line length=51 269- string(152) "From: =?ISO-2022-JP?B?GyRCJTUlcyVXJWtKOBsoQg==?= 270- =?ISO-2022-JP?B?GyRCO3pOcyU1JXMlVyVrSjg7ehsoQg==?= 271- =?ISO-2022-JP?B?GyRCTnNGfEtcOGwlRiUtJTklSBsoQg==?=" 272- -------- bool(true) 273- -------- line length=52 274- string(148) "From: =?ISO-2022-JP?B?GyRCJTUlcyVXJWtKODt6TnMbKEI=?= 275- =?ISO-2022-JP?B?GyRCJTUlcyVXJWtKODt6TnNGfBsoQg==?= 276- =?ISO-2022-JP?B?GyRCS1w4bCVGJS0lOSVIGyhC?=" 277- -------- bool(true) 278- -------- line length=53 279- string(148) "From: =?ISO-2022-JP?B?GyRCJTUlcyVXJWtKODt6TnMbKEI=?= 280- =?ISO-2022-JP?B?GyRCJTUlcyVXJWtKODt6TnNGfBsoQg==?= 281- =?ISO-2022-JP?B?GyRCS1w4bCVGJS0lOSVIGyhC?=" 282- -------- bool(true) 283- -------- line length=54 284- string(148) "From: =?ISO-2022-JP?B?GyRCJTUlcyVXJWtKODt6TnMbKEI=?= 285- =?ISO-2022-JP?B?GyRCJTUlcyVXJWtKODt6TnNGfBsoQg==?= 286- =?ISO-2022-JP?B?GyRCS1w4bCVGJS0lOSVIGyhC?=" 287- -------- bool(true) 288- -------- line length=55 289- string(148) "From: =?ISO-2022-JP?B?GyRCJTUlcyVXJWtKODt6TnMbKEI=?= 290- =?ISO-2022-JP?B?GyRCJTUlcyVXJWtKODt6TnNGfEtcOGwbKEI=?= 291- =?ISO-2022-JP?B?GyRCJUYlLSU5JUgbKEI=?=" 292- -------- bool(true) 293- -------- line length=56 294- string(148) "From: =?ISO-2022-JP?B?GyRCJTUlcyVXJWtKODt6TnMlNRsoQg==?= 295- =?ISO-2022-JP?B?GyRCJXMlVyVrSjg7ek5zRnxLXDhsJUYbKEI=?= 296- =?ISO-2022-JP?B?GyRCJS0lOSVIGyhC?=" 297- -------- bool(true) 298- -------- line length=57 299- string(148) "From: =?ISO-2022-JP?B?GyRCJTUlcyVXJWtKODt6TnMlNRsoQg==?= 300- =?ISO-2022-JP?B?GyRCJXMlVyVrSjg7ek5zRnxLXDhsJUYbKEI=?= 301- =?ISO-2022-JP?B?GyRCJS0lOSVIGyhC?=" 302- -------- bool(true) 303- -------- line length=58 304- string(148) "From: =?ISO-2022-JP?B?GyRCJTUlcyVXJWtKODt6TnMlNRsoQg==?= 305- =?ISO-2022-JP?B?GyRCJXMlVyVrSjg7ek5zRnxLXDhsJUYbKEI=?= 306- =?ISO-2022-JP?B?GyRCJS0lOSVIGyhC?=" 307- -------- bool(true) 308- -------- line length=59 309- string(152) "From: =?ISO-2022-JP?B?GyRCJTUlcyVXJWtKODt6TnMlNRsoQg==?= 310- =?ISO-2022-JP?B?GyRCJXMlVyVrSjg7ek5zRnxLXDhsJUYlLRsoQg==?= 311- =?ISO-2022-JP?B?GyRCJTklSBsoQg==?=" 312- -------- bool(true) 313- -------- line length=60 314- string(120) "From: =?ISO-2022-JP?B?GyRCJTUlcyVXJWtKODt6TnMlNSVzJVcbKEI=?= 315- =?ISO-2022-JP?B?GyRCJWtKODt6TnNGfEtcOGwlRiUtJTklSBsoQg==?=" 316- -------- bool(true) 317- -------- line length=61 318- string(120) "From: =?ISO-2022-JP?B?GyRCJTUlcyVXJWtKODt6TnMlNSVzJVcbKEI=?= 319- =?ISO-2022-JP?B?GyRCJWtKODt6TnNGfEtcOGwlRiUtJTklSBsoQg==?=" 320- -------- bool(true) 321- -------- line length=62 322- string(120) "From: =?ISO-2022-JP?B?GyRCJTUlcyVXJWtKODt6TnMlNSVzJVcbKEI=?= 323- =?ISO-2022-JP?B?GyRCJWtKODt6TnNGfEtcOGwlRiUtJTklSBsoQg==?=" 324- -------- bool(true) 325- -------- line length=63 326- string(120) "From: =?ISO-2022-JP?B?GyRCJTUlcyVXJWtKODt6TnMlNSVzJVcbKEI=?= 327- =?ISO-2022-JP?B?GyRCJWtKODt6TnNGfEtcOGwlRiUtJTklSBsoQg==?=" 328- -------- bool(true) 329- -------- line length=64 330- string(120) "From: =?ISO-2022-JP?B?GyRCJTUlcyVXJWtKODt6TnMlNSVzJVclaxsoQg==?= 331- =?ISO-2022-JP?B?GyRCSjg7ek5zRnxLXDhsJUYlLSU5JUgbKEI=?=" 332- -------- bool(true) 333- -------- line length=65 334- string(120) "From: =?ISO-2022-JP?B?GyRCJTUlcyVXJWtKODt6TnMlNSVzJVclaxsoQg==?= 335- =?ISO-2022-JP?B?GyRCSjg7ek5zRnxLXDhsJUYlLSU5JUgbKEI=?=" 336- -------- bool(true) 337- -------- line length=66 338- string(120) "From: =?ISO-2022-JP?B?GyRCJTUlcyVXJWtKODt6TnMlNSVzJVclaxsoQg==?= 339- =?ISO-2022-JP?B?GyRCSjg7ek5zRnxLXDhsJUYlLSU5JUgbKEI=?=" 340- -------- bool(true) 341- -------- line length=67 342- string(120) "From: =?ISO-2022-JP?B?GyRCJTUlcyVXJWtKODt6TnMlNSVzJVclaxsoQg==?= 343- =?ISO-2022-JP?B?GyRCSjg7ek5zRnxLXDhsJUYlLSU5JUgbKEI=?=" 344- -------- bool(true) 345- -------- line length=68 346- string(120) "From: =?ISO-2022-JP?B?GyRCJTUlcyVXJWtKODt6TnMlNSVzJVcla0o4O3obKEI=?= 347- =?ISO-2022-JP?B?GyRCTnNGfEtcOGwlRiUtJTklSBsoQg==?=" 348- -------- bool(true) 349- -------- line length=69 350- string(120) "From: =?ISO-2022-JP?B?GyRCJTUlcyVXJWtKODt6TnMlNSVzJVcla0o4O3obKEI=?= 351- =?ISO-2022-JP?B?GyRCTnNGfEtcOGwlRiUtJTklSBsoQg==?=" 352- -------- bool(true) 353- -------- line length=70 354- string(120) "From: =?ISO-2022-JP?B?GyRCJTUlcyVXJWtKODt6TnMlNSVzJVcla0o4O3obKEI=?= 355- =?ISO-2022-JP?B?GyRCTnNGfEtcOGwlRiUtJTklSBsoQg==?=" 356- -------- bool(true) 357- -------- line length=71 358- string(120) "From: =?ISO-2022-JP?B?GyRCJTUlcyVXJWtKODt6TnMlNSVzJVcla0o4O3obKEI=?= 359- =?ISO-2022-JP?B?GyRCTnNGfEtcOGwlRiUtJTklSBsoQg==?=" 360- -------- bool(true) 361- -------- line length=72 362- string(120) "From: =?ISO-2022-JP?B?GyRCJTUlcyVXJWtKODt6TnMlNSVzJVcla0o4O3pOcxsoQg==?= 363- =?ISO-2022-JP?B?GyRCRnxLXDhsJUYlLSU5JUgbKEI=?=" 364- -------- bool(true) 365- -------- line length=73 366- string(120) "From: =?ISO-2022-JP?B?GyRCJTUlcyVXJWtKODt6TnMlNSVzJVcla0o4O3pOcxsoQg==?= 367- =?ISO-2022-JP?B?GyRCRnxLXDhsJUYlLSU5JUgbKEI=?=" 368- -------- bool(true) 369- -------- line length=74 370- string(120) "From: =?ISO-2022-JP?B?GyRCJTUlcyVXJWtKODt6TnMlNSVzJVcla0o4O3pOcxsoQg==?= 371- =?ISO-2022-JP?B?GyRCRnxLXDhsJUYlLSU5JUgbKEI=?=" 372- -------- bool(true) 373- -------- line length=75 374- string(120) "From: =?ISO-2022-JP?B?GyRCJTUlcyVXJWtKODt6TnMlNSVzJVcla0o4O3pOcxsoQg==?= 375- =?ISO-2022-JP?B?GyRCRnxLXDhsJUYlLSU5JUgbKEI=?=" 376- -------- bool(true) 377- -------- line length=76 378- string(120) "From: =?ISO-2022-JP?B?GyRCJTUlcyVXJWtKODt6TnMlNSVzJVcla0o4O3pOc0Z8S1wbKEI=?= 379- =?ISO-2022-JP?B?GyRCOGwlRiUtJTklSBsoQg==?=" 380- -------- bool(true) 381- -------- line length=77 382- string(120) "From: =?ISO-2022-JP?B?GyRCJTUlcyVXJWtKODt6TnMlNSVzJVcla0o4O3pOc0Z8S1wbKEI=?= 383- =?ISO-2022-JP?B?GyRCOGwlRiUtJTklSBsoQg==?=" 384- -------- bool(true) 385- -------- line length=78 386- string(120) "From: =?ISO-2022-JP?B?GyRCJTUlcyVXJWtKODt6TnMlNSVzJVcla0o4O3pOc0Z8S1wbKEI=?= 387- =?ISO-2022-JP?B?GyRCOGwlRiUtJTklSBsoQg==?=" 388- -------- bool(true) 389- -------- line length=79 390- string(120) "From: =?ISO-2022-JP?B?GyRCJTUlcyVXJWtKODt6TnMlNSVzJVcla0o4O3pOc0Z8S1wbKEI=?= 391- =?ISO-2022-JP?B?GyRCOGwlRiUtJTklSBsoQg==?=" 392- -------- bool(true) ================================================================================ ================================================================================ /home/contppw/php/php-5.6.34/ext/iconv/tests/iconv_strlen_error2.phpt ================================================================================ *** Testing iconv_strlen() : error *** Notice: iconv_strlen(): Unknown error (22) in /home/contppw/php/php-5.6.34/ext/iconv/tests/iconv_strlen_error2.php on line 17 bool(false) ===DONE=== ================================================================================ 003+ Notice: iconv_strlen(): Unknown error (22) in /home/contppw/php/php-5.6.34/ext/iconv/tests/iconv_strlen_error2.php on line 17 003- Notice: iconv_strlen(): Wrong charset, conversion from `unknown-encoding' to `UCS-4LE' is not allowed in %s on line %d ================================================================================ ================================================================================ /home/contppw/php/php-5.6.34/ext/iconv/tests/iconv_strlen_variation2.phpt ================================================================================ *** Testing iconv_strlen() : usage variations *** -- Iteration 1 -- Notice: iconv_strlen(): Unknown error (22) in /home/contppw/php/php-5.6.34/ext/iconv/tests/iconv_strlen_variation2.php on line 89 bool(false) -- Iteration 2 -- Notice: iconv_strlen(): Unknown error (22) in /home/contppw/php/php-5.6.34/ext/iconv/tests/iconv_strlen_variation2.php on line 89 bool(false) -- Iteration 3 -- Notice: iconv_strlen(): Unknown error (22) in /home/contppw/php/php-5.6.34/ext/iconv/tests/iconv_strlen_variation2.php on line 89 bool(false) -- Iteration 4 -- Notice: iconv_strlen(): Unknown error (22) in /home/contppw/php/php-5.6.34/ext/iconv/tests/iconv_strlen_variation2.php on line 89 bool(false) -- Iteration 5 -- Notice: iconv_strlen(): Unknown error (22) in /home/contppw/php/php-5.6.34/ext/iconv/tests/iconv_strlen_variation2.php on line 89 bool(false) -- Iteration 6 -- Notice: iconv_strlen(): Unknown error (22) in /home/contppw/php/php-5.6.34/ext/iconv/tests/iconv_strlen_variation2.php on line 89 bool(false) -- Iteration 7 -- Notice: iconv_strlen(): Unknown error (22) in /home/contppw/php/php-5.6.34/ext/iconv/tests/iconv_strlen_variation2.php on line 89 bool(false) -- Iteration 8 -- Notice: iconv_strlen(): Unknown error (22) in /home/contppw/php/php-5.6.34/ext/iconv/tests/iconv_strlen_variation2.php on line 89 bool(false) -- Iteration 9 -- Notice: iconv_strlen(): Unknown error (22) in /home/contppw/php/php-5.6.34/ext/iconv/tests/iconv_strlen_variation2.php on line 89 bool(false) -- Iteration 10 -- int(12) -- Iteration 11 -- int(12) -- Iteration 12 -- Notice: iconv_strlen(): Unknown error (22) in /home/contppw/php/php-5.6.34/ext/iconv/tests/iconv_strlen_variation2.php on line 89 bool(false) -- Iteration 13 -- int(12) -- Iteration 14 -- Notice: iconv_strlen(): Unknown error (22) in /home/contppw/php/php-5.6.34/ext/iconv/tests/iconv_strlen_variation2.php on line 89 bool(false) -- Iteration 15 -- int(12) -- Iteration 16 -- int(12) -- Iteration 17 -- int(12) -- Iteration 18 -- int(12) -- Iteration 19 -- int(12) -- Iteration 20 -- int(12) -- Iteration 21 -- int(12) -- Iteration 22 -- int(12) -- Iteration 23 -- int(12) -- Iteration 24 -- Warning: iconv_strlen() expects parameter 2 to be string, resource given in /home/contppw/php/php-5.6.34/ext/iconv/tests/iconv_strlen_variation2.php on line 89 bool(false) Done ================================================================================ 005+ Notice: iconv_strlen(): Unknown error (22) in /home/contppw/php/php-5.6.34/ext/iconv/tests/iconv_strlen_variation2.php on line 89 005- Notice: iconv_strlen(): Wrong charset, conversion from `0' to `UCS-4LE' is not allowed in %s on line %d 010+ Notice: iconv_strlen(): Unknown error (22) in /home/contppw/php/php-5.6.34/ext/iconv/tests/iconv_strlen_variation2.php on line 89 010- Notice: iconv_strlen(): Wrong charset, conversion from `1' to `UCS-4LE' is not allowed in %s on line %d 015+ Notice: iconv_strlen(): Unknown error (22) in /home/contppw/php/php-5.6.34/ext/iconv/tests/iconv_strlen_variation2.php on line 89 015- Notice: iconv_strlen(): Wrong charset, conversion from `12345' to `UCS-4LE' is not allowed in %s on line %d 020+ Notice: iconv_strlen(): Unknown error (22) in /home/contppw/php/php-5.6.34/ext/iconv/tests/iconv_strlen_variation2.php on line 89 020- Notice: iconv_strlen(): Wrong charset, conversion from `-2345' to `UCS-4LE' is not allowed in %s on line %d 025+ Notice: iconv_strlen(): Unknown error (22) in /home/contppw/php/php-5.6.34/ext/iconv/tests/iconv_strlen_variation2.php on line 89 025- Notice: iconv_strlen(): Wrong charset, conversion from `10.5' to `UCS-4LE' is not allowed in %s on line %d 030+ Notice: iconv_strlen(): Unknown error (22) in /home/contppw/php/php-5.6.34/ext/iconv/tests/iconv_strlen_variation2.php on line 89 030- Notice: iconv_strlen(): Wrong charset, conversion from `-10.5' to `UCS-4LE' is not allowed in %s on line %d 035+ Notice: iconv_strlen(): Unknown error (22) in /home/contppw/php/php-5.6.34/ext/iconv/tests/iconv_strlen_variation2.php on line 89 035- Notice: iconv_strlen(): Wrong charset, conversion from `123456789000' to `UCS-4LE' is not allowed in %s on line %d 040+ Notice: iconv_strlen(): Unknown error (22) in /home/contppw/php/php-5.6.34/ext/iconv/tests/iconv_strlen_variation2.php on line 89 040- Notice: iconv_strlen(): Wrong charset, conversion from `1.23456789E-9' to `UCS-4LE' is not allowed in %s on line %d 045+ Notice: iconv_strlen(): Unknown error (22) in /home/contppw/php/php-5.6.34/ext/iconv/tests/iconv_strlen_variation2.php on line 89 045- Notice: iconv_strlen(): Wrong charset, conversion from `0.5' to `UCS-4LE' is not allowed in %s on line %d 056+ Notice: iconv_strlen(): Unknown error (22) in /home/contppw/php/php-5.6.34/ext/iconv/tests/iconv_strlen_variation2.php on line 89 056- Notice: iconv_strlen(): Wrong charset, conversion from `1' to `UCS-4LE' is not allowed in %s on line %d 064+ Notice: iconv_strlen(): Unknown error (22) in /home/contppw/php/php-5.6.34/ext/iconv/tests/iconv_strlen_variation2.php on line 89 064- Notice: iconv_strlen(): Wrong charset, conversion from `1' to `UCS-4LE' is not allowed in %s on line %d ================================================================================ ================================================================================ /home/contppw/php/php-5.6.34/ext/iconv/tests/iconv_strpos.phpt ================================================================================ 2: strpos(): Offset not contained in string bool(false) 2: iconv_strpos(): Offset not contained in string. bool(false) 2: strpos(): Offset not contained in string bool(false) bool(false) int(7) int(7) int(16) int(16) int(300) int(300) int(302) int(151) int(1) 8: iconv_strpos(): Unknown error (22) bool(false) bool(false) bool(false) ================================================================================ 017+ 8: iconv_strpos(): Unknown error (22) 018+ bool(false) 017- int(300) ================================================================================ ================================================================================ /home/contppw/php/php-5.6.34/ext/iconv/tests/iconv_strpos_error2.phpt ================================================================================ *** Testing iconv_strpos() : error conditions *** Notice: iconv_strpos(): Unknown error (22) in /home/contppw/php/php-5.6.34/ext/iconv/tests/iconv_strpos_error2.php on line 17 bool(false) Done ================================================================================ 003+ Notice: iconv_strpos(): Unknown error (22) in /home/contppw/php/php-5.6.34/ext/iconv/tests/iconv_strpos_error2.php on line 17 003- Notice: iconv_strpos(): Wrong charset, conversion from `unknown-encoding' to `UCS-4LE' is not allowed in %s on line %d ================================================================================ ================================================================================ /home/contppw/php/php-5.6.34/ext/iconv/tests/iconv_strpos_variation4.phpt ================================================================================ *** Testing iconv_strpos() : usage variations *** -- Iteration 1 -- Notice: iconv_strpos(): Unknown error (22) in /home/contppw/php/php-5.6.34/ext/iconv/tests/iconv_strpos_variation4.php on line 92 bool(false) -- Iteration 2 -- Notice: iconv_strpos(): Unknown error (22) in /home/contppw/php/php-5.6.34/ext/iconv/tests/iconv_strpos_variation4.php on line 92 bool(false) -- Iteration 3 -- Notice: iconv_strpos(): Unknown error (22) in /home/contppw/php/php-5.6.34/ext/iconv/tests/iconv_strpos_variation4.php on line 92 bool(false) -- Iteration 4 -- Notice: iconv_strpos(): Unknown error (22) in /home/contppw/php/php-5.6.34/ext/iconv/tests/iconv_strpos_variation4.php on line 92 bool(false) -- Iteration 5 -- Notice: iconv_strpos(): Unknown error (22) in /home/contppw/php/php-5.6.34/ext/iconv/tests/iconv_strpos_variation4.php on line 92 bool(false) -- Iteration 6 -- Notice: iconv_strpos(): Unknown error (22) in /home/contppw/php/php-5.6.34/ext/iconv/tests/iconv_strpos_variation4.php on line 92 bool(false) -- Iteration 7 -- Notice: iconv_strpos(): Unknown error (22) in /home/contppw/php/php-5.6.34/ext/iconv/tests/iconv_strpos_variation4.php on line 92 bool(false) -- Iteration 8 -- Notice: iconv_strpos(): Unknown error (22) in /home/contppw/php/php-5.6.34/ext/iconv/tests/iconv_strpos_variation4.php on line 92 bool(false) -- Iteration 9 -- Notice: iconv_strpos(): Unknown error (22) in /home/contppw/php/php-5.6.34/ext/iconv/tests/iconv_strpos_variation4.php on line 92 bool(false) -- Iteration 10 -- int(7) -- Iteration 11 -- int(7) -- Iteration 12 -- Notice: iconv_strpos(): Unknown error (22) in /home/contppw/php/php-5.6.34/ext/iconv/tests/iconv_strpos_variation4.php on line 92 bool(false) -- Iteration 13 -- int(7) -- Iteration 14 -- Notice: iconv_strpos(): Unknown error (22) in /home/contppw/php/php-5.6.34/ext/iconv/tests/iconv_strpos_variation4.php on line 92 bool(false) -- Iteration 15 -- int(7) -- Iteration 16 -- int(7) -- Iteration 17 -- int(7) -- Iteration 18 -- int(7) -- Iteration 19 -- int(7) -- Iteration 20 -- int(7) -- Iteration 21 -- int(7) -- Iteration 22 -- int(7) -- Iteration 23 -- int(7) -- Iteration 24 -- Warning: iconv_strpos() expects parameter 4 to be string, resource given in /home/contppw/php/php-5.6.34/ext/iconv/tests/iconv_strpos_variation4.php on line 92 bool(false) Done ================================================================================ 005+ Notice: iconv_strpos(): Unknown error (22) in /home/contppw/php/php-5.6.34/ext/iconv/tests/iconv_strpos_variation4.php on line 92 005- Notice: iconv_strpos(): Wrong charset, conversion from `0' to `UCS-4LE' is not allowed in %s on line %d 010+ Notice: iconv_strpos(): Unknown error (22) in /home/contppw/php/php-5.6.34/ext/iconv/tests/iconv_strpos_variation4.php on line 92 010- Notice: iconv_strpos(): Wrong charset, conversion from `1' to `UCS-4LE' is not allowed in %s on line %d 015+ Notice: iconv_strpos(): Unknown error (22) in /home/contppw/php/php-5.6.34/ext/iconv/tests/iconv_strpos_variation4.php on line 92 015- Notice: iconv_strpos(): Wrong charset, conversion from `12345' to `UCS-4LE' is not allowed in %s on line %d 020+ Notice: iconv_strpos(): Unknown error (22) in /home/contppw/php/php-5.6.34/ext/iconv/tests/iconv_strpos_variation4.php on line 92 020- Notice: iconv_strpos(): Wrong charset, conversion from `-2345' to `UCS-4LE' is not allowed in %s on line %d 025+ Notice: iconv_strpos(): Unknown error (22) in /home/contppw/php/php-5.6.34/ext/iconv/tests/iconv_strpos_variation4.php on line 92 025- Notice: iconv_strpos(): Wrong charset, conversion from `10.5' to `UCS-4LE' is not allowed in %s on line %d 030+ Notice: iconv_strpos(): Unknown error (22) in /home/contppw/php/php-5.6.34/ext/iconv/tests/iconv_strpos_variation4.php on line 92 030- Notice: iconv_strpos(): Wrong charset, conversion from `-10.5' to `UCS-4LE' is not allowed in %s on line %d 035+ Notice: iconv_strpos(): Unknown error (22) in /home/contppw/php/php-5.6.34/ext/iconv/tests/iconv_strpos_variation4.php on line 92 035- Notice: iconv_strpos(): Wrong charset, conversion from `123456789000' to `UCS-4LE' is not allowed in %s on line %d 040+ Notice: iconv_strpos(): Unknown error (22) in /home/contppw/php/php-5.6.34/ext/iconv/tests/iconv_strpos_variation4.php on line 92 040- Notice: iconv_strpos(): Wrong charset, conversion from `1.23456789E-9' to `UCS-4LE' is not allowed in %s on line %d 045+ Notice: iconv_strpos(): Unknown error (22) in /home/contppw/php/php-5.6.34/ext/iconv/tests/iconv_strpos_variation4.php on line 92 045- Notice: iconv_strpos(): Wrong charset, conversion from `0.5' to `UCS-4LE' is not allowed in %s on line %d 056+ Notice: iconv_strpos(): Unknown error (22) in /home/contppw/php/php-5.6.34/ext/iconv/tests/iconv_strpos_variation4.php on line 92 056- Notice: iconv_strpos(): Wrong charset, conversion from `1' to `UCS-4LE' is not allowed in %s on line %d 064+ Notice: iconv_strpos(): Unknown error (22) in /home/contppw/php/php-5.6.34/ext/iconv/tests/iconv_strpos_variation4.php on line 92 064- Notice: iconv_strpos(): Wrong charset, conversion from `1' to `UCS-4LE' is not allowed in %s on line %d ================================================================================ ================================================================================ /home/contppw/php/php-5.6.34/ext/iconv/tests/iconv_strrpos.phpt ================================================================================ int(14) int(9) int(605) int(300) int(305) int(151) 8: iconv_strlen(): Unknown error (22) bool(false) 8: iconv_strrpos(): Unknown error (22) bool(false) 8: iconv_strlen(): Unknown error (22) bool(false) 8: iconv_strrpos(): Unknown error (22) bool(false) 8: iconv_strlen(): Unknown error (22) bool(false) 8: iconv_strrpos(): Unknown error (22) bool(false) 8: iconv_strlen(): Unknown error (22) bool(false) 8: iconv_strrpos(): Unknown error (22) bool(false) 8: iconv_strlen(): Unknown error (22) bool(false) 8: iconv_strrpos(): Unknown error (22) bool(false) 8: iconv_strlen(): Unknown error (22) bool(false) 8: iconv_strrpos(): Unknown error (22) bool(false) 8: iconv_strlen(): Unknown error (22) bool(false) 8: iconv_strrpos(): Unknown error (22) bool(false) bool(false) bool(false) ================================================================================ 007+ 8: iconv_strlen(): Unknown error (22) 008+ bool(false) 009+ 8: iconv_strrpos(): Unknown error (22) 010+ bool(false) 011+ 8: iconv_strlen(): Unknown error (22) 012+ bool(false) 013+ 8: iconv_strrpos(): Unknown error (22) 014+ bool(false) 015+ 8: iconv_strlen(): Unknown error (22) 016+ bool(false) 017+ 8: iconv_strrpos(): Unknown error (22) 018+ bool(false) 019+ 8: iconv_strlen(): Unknown error (22) 020+ bool(false) 021+ 8: iconv_strrpos(): Unknown error (22) 022+ bool(false) 023+ 8: iconv_strlen(): Unknown error (22) 024+ bool(false) 025+ 8: iconv_strrpos(): Unknown error (22) 026+ bool(false) 027+ 8: iconv_strlen(): Unknown error (22) 028+ bool(false) 029+ 8: iconv_strrpos(): Unknown error (22) 030+ bool(false) 031+ 8: iconv_strlen(): Unknown error (22) 032+ bool(false) 033+ 8: iconv_strrpos(): Unknown error (22) 034+ bool(false) 035+ bool(false) 007- int(600) 009- int(601) 010- int(300) 011- int(602) 012- int(301) 013- int(603) 014- int(302) 015- int(604) 016- int(303) 017- int(605) 018- int(304) 019- int(606) 020- int(305) 021- bool(false) 022- bool(false) ================================================================================ ================================================================================ /home/contppw/php/php-5.6.34/ext/iconv/tests/iconv_strrpos_error2.phpt ================================================================================ *** Testing iconv_strrpos() : error conditions *** Notice: iconv_strrpos(): Unknown error (22) in /home/contppw/php/php-5.6.34/ext/iconv/tests/iconv_strrpos_error2.php on line 18 bool(false) Done ================================================================================ 003+ Notice: iconv_strrpos(): Unknown error (22) in /home/contppw/php/php-5.6.34/ext/iconv/tests/iconv_strrpos_error2.php on line 18 003- Notice: iconv_strrpos(): Wrong charset, conversion from `unknown-encoding' to `UCS-4LE' is not allowed in %s on line %d ================================================================================ ================================================================================ /home/contppw/php/php-5.6.34/ext/iconv/tests/iconv_strrpos_variation3.phpt ================================================================================ *** Testing iconv_strrpos() : usage variations *** -- Iteration 1 -- Notice: iconv_strrpos(): Unknown error (22) in /home/contppw/php/php-5.6.34/ext/iconv/tests/iconv_strrpos_variation3.php on line 90 bool(false) -- Iteration 2 -- Notice: iconv_strrpos(): Unknown error (22) in /home/contppw/php/php-5.6.34/ext/iconv/tests/iconv_strrpos_variation3.php on line 90 bool(false) -- Iteration 3 -- Notice: iconv_strrpos(): Unknown error (22) in /home/contppw/php/php-5.6.34/ext/iconv/tests/iconv_strrpos_variation3.php on line 90 bool(false) -- Iteration 4 -- Notice: iconv_strrpos(): Unknown error (22) in /home/contppw/php/php-5.6.34/ext/iconv/tests/iconv_strrpos_variation3.php on line 90 bool(false) -- Iteration 5 -- Notice: iconv_strrpos(): Unknown error (22) in /home/contppw/php/php-5.6.34/ext/iconv/tests/iconv_strrpos_variation3.php on line 90 bool(false) -- Iteration 6 -- Notice: iconv_strrpos(): Unknown error (22) in /home/contppw/php/php-5.6.34/ext/iconv/tests/iconv_strrpos_variation3.php on line 90 bool(false) -- Iteration 7 -- Notice: iconv_strrpos(): Unknown error (22) in /home/contppw/php/php-5.6.34/ext/iconv/tests/iconv_strrpos_variation3.php on line 90 bool(false) -- Iteration 8 -- Notice: iconv_strrpos(): Unknown error (22) in /home/contppw/php/php-5.6.34/ext/iconv/tests/iconv_strrpos_variation3.php on line 90 bool(false) -- Iteration 9 -- Notice: iconv_strrpos(): Unknown error (22) in /home/contppw/php/php-5.6.34/ext/iconv/tests/iconv_strrpos_variation3.php on line 90 bool(false) -- Iteration 10 -- int(7) -- Iteration 11 -- int(7) -- Iteration 12 -- Notice: iconv_strrpos(): Unknown error (22) in /home/contppw/php/php-5.6.34/ext/iconv/tests/iconv_strrpos_variation3.php on line 90 bool(false) -- Iteration 13 -- int(7) -- Iteration 14 -- Notice: iconv_strrpos(): Unknown error (22) in /home/contppw/php/php-5.6.34/ext/iconv/tests/iconv_strrpos_variation3.php on line 90 bool(false) -- Iteration 15 -- int(7) -- Iteration 16 -- int(7) -- Iteration 17 -- int(7) -- Iteration 18 -- int(7) -- Iteration 19 -- int(7) -- Iteration 20 -- int(7) -- Iteration 21 -- int(7) -- Iteration 22 -- int(7) -- Iteration 23 -- int(7) -- Iteration 24 -- Warning: iconv_strrpos() expects parameter 3 to be string, resource given in /home/contppw/php/php-5.6.34/ext/iconv/tests/iconv_strrpos_variation3.php on line 90 bool(false) Done ================================================================================ 005+ Notice: iconv_strrpos(): Unknown error (22) in /home/contppw/php/php-5.6.34/ext/iconv/tests/iconv_strrpos_variation3.php on line 90 005- Notice: iconv_strrpos(): Wrong charset, conversion from `0' to `UCS-4LE' is not allowed in %s on line %d 010+ Notice: iconv_strrpos(): Unknown error (22) in /home/contppw/php/php-5.6.34/ext/iconv/tests/iconv_strrpos_variation3.php on line 90 010- Notice: iconv_strrpos(): Wrong charset, conversion from `1' to `UCS-4LE' is not allowed in %s on line %d 015+ Notice: iconv_strrpos(): Unknown error (22) in /home/contppw/php/php-5.6.34/ext/iconv/tests/iconv_strrpos_variation3.php on line 90 015- Notice: iconv_strrpos(): Wrong charset, conversion from `12345' to `UCS-4LE' is not allowed in %s on line %d 020+ Notice: iconv_strrpos(): Unknown error (22) in /home/contppw/php/php-5.6.34/ext/iconv/tests/iconv_strrpos_variation3.php on line 90 020- Notice: iconv_strrpos(): Wrong charset, conversion from `-2345' to `UCS-4LE' is not allowed in %s on line %d 025+ Notice: iconv_strrpos(): Unknown error (22) in /home/contppw/php/php-5.6.34/ext/iconv/tests/iconv_strrpos_variation3.php on line 90 025- Notice: iconv_strrpos(): Wrong charset, conversion from `10.5' to `UCS-4LE' is not allowed in %s on line %d 030+ Notice: iconv_strrpos(): Unknown error (22) in /home/contppw/php/php-5.6.34/ext/iconv/tests/iconv_strrpos_variation3.php on line 90 030- Notice: iconv_strrpos(): Wrong charset, conversion from `-10.5' to `UCS-4LE' is not allowed in %s on line %d 035+ Notice: iconv_strrpos(): Unknown error (22) in /home/contppw/php/php-5.6.34/ext/iconv/tests/iconv_strrpos_variation3.php on line 90 035- Notice: iconv_strrpos(): Wrong charset, conversion from `123456789000' to `UCS-4LE' is not allowed in %s on line %d 040+ Notice: iconv_strrpos(): Unknown error (22) in /home/contppw/php/php-5.6.34/ext/iconv/tests/iconv_strrpos_variation3.php on line 90 040- Notice: iconv_strrpos(): Wrong charset, conversion from `1.23456789E-9' to `UCS-4LE' is not allowed in %s on line %d 045+ Notice: iconv_strrpos(): Unknown error (22) in /home/contppw/php/php-5.6.34/ext/iconv/tests/iconv_strrpos_variation3.php on line 90 045- Notice: iconv_strrpos(): Wrong charset, conversion from `0.5' to `UCS-4LE' is not allowed in %s on line %d 056+ Notice: iconv_strrpos(): Unknown error (22) in /home/contppw/php/php-5.6.34/ext/iconv/tests/iconv_strrpos_variation3.php on line 90 056- Notice: iconv_strrpos(): Wrong charset, conversion from `1' to `UCS-4LE' is not allowed in %s on line %d 064+ Notice: iconv_strrpos(): Unknown error (22) in /home/contppw/php/php-5.6.34/ext/iconv/tests/iconv_strrpos_variation3.php on line 90 064- Notice: iconv_strrpos(): Wrong charset, conversion from `1' to `UCS-4LE' is not allowed in %s on line %d ================================================================================ ================================================================================ /home/contppw/php/php-5.6.34/ext/iconv/tests/iconv_substr.phpt ================================================================================ 666768696a6b6c 666768696a6b6c a6a4a8a4aaa4ab a4aba4ada4afa4b1a4b3a4b5a4b7 bool(false) bool(false) string(14) "This is a test" string(14) "This is a test" string(3) "est" string(3) "est" string(5) "This " string(5) "This " bool(false) bool(false) bool(false) bool(false) Notice: iconv_substr(): Unknown error (22) in /home/contppw/php/php-5.6.34/ext/iconv/tests/iconv_substr.php on line 33 string(0) "" ================================================================================ 017+ 017- string(10) "¤Á¤Ï ISO-2" 018+ Notice: iconv_substr(): Unknown error (22) in /home/contppw/php/php-5.6.34/ext/iconv/tests/iconv_substr.php on line 33 019+ string(0) "" ================================================================================ ================================================================================ /home/contppw/php/php-5.6.34/ext/iconv/tests/iconv_substr_error2.phpt ================================================================================ *** Testing iconv_substr() : error conditions *** Notice: iconv_substr(): Unknown error (22) in /home/contppw/php/php-5.6.34/ext/iconv/tests/iconv_substr_error2.php on line 18 bool(false) Done ================================================================================ 003+ Notice: iconv_substr(): Unknown error (22) in /home/contppw/php/php-5.6.34/ext/iconv/tests/iconv_substr_error2.php on line 18 003- Notice: iconv_substr(): Wrong charset, conversion from `unknown-encoding' to `UCS-4LE' is not allowed in %s on line %d ================================================================================ ================================================================================ /home/contppw/php/php-5.6.34/ext/ldap/tests/ldap_connect_error.phpt ================================================================================ Warning: ldap_connect() expects at most 2 parameters, 3 given in /home/contppw/php/php-5.6.34/ext/ldap/tests/ldap_connect_error.php on line 5 bool(false) resource(5) of type (ldap link) Warning: ldap_connect(): Too many open links (1) in /home/contppw/php/php-5.6.34/ext/ldap/tests/ldap_connect_error.php on line 10 ===DONE=== ================================================================================ 003+ resource(5) of type (ldap link) 004- Warning: ldap_connect(): Could not create session handle: %s in %s on line %d 005- bool(false) 006- ================================================================================ ================================================================================ /home/contppw/php/php-5.6.34/ext/ldap/tests/ldap_connect_variation.phpt ================================================================================ resource(5) of type (ldap link) resource(6) of type (ldap link) resource(7) of type (ldap link) Warning: ldap_connect(): Could not create session handle in /home/contppw/php/php-5.6.34/ext/ldap/tests/ldap_connect_variation.php on line 17 bool(false) resource(8) of type (ldap link) resource(9) of type (ldap link) ===DONE=== ================================================================================ 004+ 005+ Warning: ldap_connect(): Could not create session handle in /home/contppw/php/php-5.6.34/ext/ldap/tests/ldap_connect_variation.php on line 17 006+ bool(false) 006- resource(%d) of type (ldap link) ================================================================================ ================================================================================ /home/contppw/php/php-5.6.34/ext/ldap/tests/ldap_get_option_variation.phpt ================================================================================ Notice: Use of undefined constant LDAP_OPT_TIMEOUT - assumed 'LDAP_OPT_TIMEOUT' in /home/contppw/php/php-5.6.34/ext/ldap/tests/ldap_get_option_variation.php on line 16 Warning: ldap_set_option() expects parameter 2 to be long, string given in /home/contppw/php/php-5.6.34/ext/ldap/tests/ldap_get_option_variation.php on line 16 Notice: Use of undefined constant LDAP_OPT_TIMEOUT - assumed 'LDAP_OPT_TIMEOUT' in /home/contppw/php/php-5.6.34/ext/ldap/tests/ldap_get_option_variation.php on line 31 Warning: ldap_get_option() expects parameter 2 to be long, string given in /home/contppw/php/php-5.6.34/ext/ldap/tests/ldap_get_option_variation.php on line 31 bool(true) int(0) bool(true) int(123) bool(true) int(33) bool(false) int(33) NULL int(33) bool(true) int(0) bool(true) int(0) bool(false) int(0) bool(false) int(0) ===DONE=== ================================================================================ 001+ Notice: Use of undefined constant LDAP_OPT_TIMEOUT - assumed 'LDAP_OPT_TIMEOUT' in /home/contppw/php/php-5.6.34/ext/ldap/tests/ldap_get_option_variation.php on line 16 002+ 003+ Warning: ldap_set_option() expects parameter 2 to be long, string given in /home/contppw/php/php-5.6.34/ext/ldap/tests/ldap_get_option_variation.php on line 16 004+ 005+ Notice: Use of undefined constant LDAP_OPT_TIMEOUT - assumed 'LDAP_OPT_TIMEOUT' in /home/contppw/php/php-5.6.34/ext/ldap/tests/ldap_get_option_variation.php on line 31 006+ 007+ Warning: ldap_get_option() expects parameter 2 to be long, string given in /home/contppw/php/php-5.6.34/ext/ldap/tests/ldap_get_option_variation.php on line 31 007- bool(true) 008- int(44) 010- int(55) 011- bool(true) 014+ bool(false) 015+ int(33) 016+ NULL 017+ int(33) ================================================================================ ================================================================================ /home/contppw/php/php-5.6.34/ext/ldap/tests/ldap_set_option_variation.phpt ================================================================================ bool(true) bool(true) bool(true) int(123) bool(true) int(33) bool(false) int(33) bool(true) bool(true) bool(true) bool(false) bool(true) int(0) bool(true) int(0) bool(true) string(14) "dc=test,dc=com" ===DONE=== ================================================================================ 007+ bool(false) 008+ int(33) 008- int(44) 011- bool(true) ================================================================================ ================================================================================ /home/contppw/php/php-5.6.34/ext/libxml/tests/bug61367-write.phpt ================================================================================ bool(true) bool(true) int(4) bool(true) Warning: DOMDocument::save(): open_basedir restriction in effect. File(/home/contppw/php/php-5.6.34/test_bug_61367-write/bad) is not within the allowed path(s): (.) in /home/contppw/php/php-5.6.34/ext/libxml/tests/bug61367-write.php on line 7 Warning: DOMDocument::save(/home/contppw/php/php-5.6.34/test_bug_61367-write/bad): failed to open stream: Not owner in /home/contppw/php/php-5.6.34/ext/libxml/tests/bug61367-write.php on line 7 bool(false) ================================================================================ 008+ Warning: DOMDocument::save(/home/contppw/php/php-5.6.34/test_bug_61367-write/bad): failed to open stream: Not owner in /home/contppw/php/php-5.6.34/ext/libxml/tests/bug61367-write.php on line 7 008- Warning: DOMDocument::save(%s): failed to open stream: Operation not permitted in %s on line %d ================================================================================ ================================================================================ /home/contppw/php/php-5.6.34/ext/posix/tests/posix_getgrgid_basic.phpt ================================================================================ Basic test of POSIX getgid and getgrid fucntions Array ( [name] => root [passwd] => [members] => Array ( ) [gid] => 0 ) ===DONE=== ================================================================================ 005+ [passwd] => 005- [passwd] => %a 008+ ) ================================================================================ ================================================================================ /home/contppw/php/php-5.6.34/ext/simplexml/tests/008.phpt ================================================================================ array(1) { [0]=> object(SimpleXMLElement)#2 (1) { ["test"]=> object(SimpleXMLElement)#3 (0) { } } } array(0) { } Warning: SimpleXMLElement::xpath(): Invalid expression in /home/contppw/php/php-5.6.34/ext/simplexml/tests/008.php on line 26 bool(false) ================================================================================ 013- 014- Warning: SimpleXMLElement::xpath(): xmlXPathEval: evaluation failed in %s on line %d ================================================================================ ================================================================================ /home/contppw/php/php-5.6.34/ext/standard/tests/array/array_change_key_case_variation8.phpt ================================================================================ *** Testing array_change_key_case() : usage variations *** -- $case = default -- array(10) { [""]=> int(2) ["\a"]=> int(3) ["\cx"]=> int(4) ["e"]=> int(5) [" "]=> int(6) [" "]=> int(7) [" "]=> int(8) ["\xhh"]=> int(9) ["\ddd"]=> int(10) [" "]=> int(11) } -- $case = upper -- array(10) { [""]=> int(2) ["\A"]=> int(3) ["\CX"]=> int(4) ["E"]=> int(5) [" "]=> int(6) [" "]=> int(7) [" "]=> int(8) ["\XHH"]=> int(9) ["\DDD"]=> int(10) [" "]=> int(11) } -- $case = default -- array(9) { ["lemon"]=> int(1) ["orange"]=> int(11) ["banana"]=> int(12) ["apple"]=> int(4) ["test"]=> int(5) ["tttt"]=> int(6) ["ttt"]=> int(7) ["ww"]=> int(8) ["x"]=> int(10) } -- $case = upper -- array(9) { ["LEMON"]=> int(1) ["ORANGE"]=> int(11) ["BANANA"]=> int(12) ["APPLE"]=> int(4) ["TEST"]=> int(5) ["TTTT"]=> int(6) ["TTT"]=> int(7) ["WW"]=> int(8) ["X"]=> int(10) } Done ================================================================================ 011+ ["e"]=> 011- [""]=> 035+ ["E"]=> 035- [""]=> ================================================================================ ================================================================================ /home/contppw/php/php-5.6.34/ext/standard/tests/array/arsort_variation5.phpt ================================================================================ *** Testing arsort() : usage variations *** -- Testing arsort() by supplying various string arrays -- -- Iteration 1 -- - With default sort_flag - bool(true) array(12) { ["e"]=> string(1) "e" ["\xhh"]=> string(4) "\xhh" ["\ddd"]=> string(4) "\ddd" ["\cx"]=> string(3) "\cx" ["\a"]=> string(2) "\a" [" "]=> string(1) " " [" "]=> string(1) " " [" "]=> string(1) " " [" "]=> string(1) " " [" "]=> string(1) " " ["null"]=> NULL ["NULL"]=> NULL } - Sort_flag = SORT_REGULAR - bool(true) array(12) { ["e"]=> string(1) "e" ["\xhh"]=> string(4) "\xhh" ["\ddd"]=> string(4) "\ddd" ["\cx"]=> string(3) "\cx" ["\a"]=> string(2) "\a" [" "]=> string(1) " " [" "]=> string(1) " " [" "]=> string(1) " " [" "]=> string(1) " " [" "]=> string(1) " " ["null"]=> NULL ["NULL"]=> NULL } - Sort_flag = SORT_STRING - bool(true) array(12) { ["e"]=> string(1) "e" ["\xhh"]=> string(4) "\xhh" ["\ddd"]=> string(4) "\ddd" ["\cx"]=> string(3) "\cx" ["\a"]=> string(2) "\a" [" "]=> string(1) " " [" "]=> string(1) " " [" "]=> string(1) " " [" "]=> string(1) " " [" "]=> string(1) " " ["null"]=> NULL ["NULL"]=> NULL } -- Iteration 2 -- - With default sort_flag - bool(true) array(12) { ["x"]=> string(1) "x" ["w"]=> string(2) "ww" ["t"]=> string(3) "ttt" ["o"]=> string(6) "oraNGe" ["l"]=> string(5) "lemoN" ["b"]=> string(6) "banana" ["a"]=> string(5) "apple" ["X"]=> string(1) "X" ["Te"]=> string(4) "Test" ["T"]=> string(4) "TTTT" ["O"]=> string(6) "Orange" ["B"]=> string(6) "BANANA" } - Sort_flag = SORT_REGULAR - bool(true) array(12) { ["x"]=> string(1) "x" ["w"]=> string(2) "ww" ["t"]=> string(3) "ttt" ["o"]=> string(6) "oraNGe" ["l"]=> string(5) "lemoN" ["b"]=> string(6) "banana" ["a"]=> string(5) "apple" ["X"]=> string(1) "X" ["Te"]=> string(4) "Test" ["T"]=> string(4) "TTTT" ["O"]=> string(6) "Orange" ["B"]=> string(6) "BANANA" } - Sort_flag = SORT_STRING - bool(true) array(12) { ["x"]=> string(1) "x" ["w"]=> string(2) "ww" ["t"]=> string(3) "ttt" ["o"]=> string(6) "oraNGe" ["l"]=> string(5) "lemoN" ["b"]=> string(6) "banana" ["a"]=> string(5) "apple" ["X"]=> string(1) "X" ["Te"]=> string(4) "Test" ["T"]=> string(4) "TTTT" ["O"]=> string(6) "Orange" ["B"]=> string(6) "BANANA" } Done ================================================================================ 009+ ["e"]=> 010+ string(1) "e" 017- [""]=> 018- string(1) "" 039+ ["e"]=> 040+ string(1) "e" 047- [""]=> 048- string(1) "" 069+ ["e"]=> 070+ string(1) "e" 077- [""]=> 078- string(1) "" ================================================================================ ================================================================================ /home/contppw/php/php-5.6.34/ext/standard/tests/array/asort_variation5.phpt ================================================================================ *** Testing asort() : usage variations *** -- Testing asort() by supplying various string arrays -- -- Iteration 1 -- - With default sort_flag - bool(true) array(12) { ["null"]=> NULL ["NULL"]=> NULL [" "]=> string(1) " " [" "]=> string(1) " " [" "]=> string(1) " " [" "]=> string(1) " " [" "]=> string(1) " " ["\a"]=> string(2) "\a" ["\cx"]=> string(3) "\cx" ["\ddd"]=> string(4) "\ddd" ["\xhh"]=> string(4) "\xhh" ["e"]=> string(1) "e" } - Sort_flag = SORT_REGULAR - bool(true) array(12) { ["null"]=> NULL ["NULL"]=> NULL [" "]=> string(1) " " [" "]=> string(1) " " [" "]=> string(1) " " [" "]=> string(1) " " [" "]=> string(1) " " ["\a"]=> string(2) "\a" ["\cx"]=> string(3) "\cx" ["\ddd"]=> string(4) "\ddd" ["\xhh"]=> string(4) "\xhh" ["e"]=> string(1) "e" } - Sort_flag = SORT_STRING - bool(true) array(12) { ["null"]=> NULL ["NULL"]=> NULL [" "]=> string(1) " " [" "]=> string(1) " " [" "]=> string(1) " " [" "]=> string(1) " " [" "]=> string(1) " " ["\a"]=> string(2) "\a" ["\cx"]=> string(3) "\cx" ["\ddd"]=> string(4) "\ddd" ["\xhh"]=> string(4) "\xhh" ["e"]=> string(1) "e" } -- Iteration 2 -- - With default sort_flag - bool(true) array(12) { ["B"]=> string(6) "BANANA" ["O"]=> string(6) "Orange" ["T"]=> string(4) "TTTT" ["Te"]=> string(4) "Test" ["X"]=> string(1) "X" ["a"]=> string(5) "apple" ["b"]=> string(6) "banana" ["l"]=> string(5) "lemoN" ["o"]=> string(6) "oraNGe" ["t"]=> string(3) "ttt" ["w"]=> string(2) "ww" ["x"]=> string(1) "x" } - Sort_flag = SORT_REGULAR - bool(true) array(12) { ["B"]=> string(6) "BANANA" ["O"]=> string(6) "Orange" ["T"]=> string(4) "TTTT" ["Te"]=> string(4) "Test" ["X"]=> string(1) "X" ["a"]=> string(5) "apple" ["b"]=> string(6) "banana" ["l"]=> string(5) "lemoN" ["o"]=> string(6) "oraNGe" ["t"]=> string(3) "ttt" ["w"]=> string(2) "ww" ["x"]=> string(1) "x" } - Sort_flag = SORT_STRING - bool(true) array(12) { ["B"]=> string(6) "BANANA" ["O"]=> string(6) "Orange" ["T"]=> string(4) "TTTT" ["Te"]=> string(4) "Test" ["X"]=> string(1) "X" ["a"]=> string(5) "apple" ["b"]=> string(6) "banana" ["l"]=> string(5) "lemoN" ["o"]=> string(6) "oraNGe" ["t"]=> string(3) "ttt" ["w"]=> string(2) "ww" ["x"]=> string(1) "x" } Done ================================================================================ 025- [""]=> 026- string(1) "" 033+ ["e"]=> 034+ string(1) "e" 055- [""]=> 056- string(1) "" 063+ ["e"]=> 064+ string(1) "e" 085- [""]=> 086- string(1) "" 093+ ["e"]=> 094+ string(1) "e" ================================================================================ ================================================================================ /home/contppw/php/php-5.6.34/ext/standard/tests/array/krsort_variation5.phpt ================================================================================ *** Testing krsort() : usage variations *** -- Testing krsort() by supplying various string arrays -- -- Iteration 1 -- - With defualt sort flag - bool(true) array(11) { ["e"]=> string(1) "e" ["\xhh"]=> string(4) "\xhh" ["\ddd"]=> string(4) "\ddd" ["\cx"]=> string(3) "\cx" ["\a"]=> string(2) "\a" [" "]=> string(1) " " [" "]=> string(1) " " [" "]=> string(1) " " [" "]=> string(1) " " [" "]=> string(1) " " [""]=> NULL } - Sort flag = SORT_REGULAR - bool(true) array(11) { ["e"]=> string(1) "e" ["\xhh"]=> string(4) "\xhh" ["\ddd"]=> string(4) "\ddd" ["\cx"]=> string(3) "\cx" ["\a"]=> string(2) "\a" [" "]=> string(1) " " [" "]=> string(1) " " [" "]=> string(1) " " [" "]=> string(1) " " [" "]=> string(1) " " [""]=> NULL } - Sort flag = SORT_STRING - bool(true) array(11) { ["e"]=> string(1) "e" ["\xhh"]=> string(4) "\xhh" ["\ddd"]=> string(4) "\ddd" ["\cx"]=> string(3) "\cx" ["\a"]=> string(2) "\a" [" "]=> string(1) " " [" "]=> string(1) " " [" "]=> string(1) " " [" "]=> string(1) " " [" "]=> string(1) " " [""]=> NULL } -- Iteration 2 -- - With defualt sort flag - bool(true) array(11) { ["x"]=> string(1) "X" ["te"]=> string(4) "Test" ["t"]=> string(4) "TTTT" ["o"]=> string(6) "Orange" ["X"]=> string(1) "x" ["W"]=> string(2) "ww" ["T"]=> string(3) "ttt" ["O"]=> string(6) "oraNGe" ["Lemon"]=> string(5) "lemoN" ["B"]=> string(6) "BANANA" ["Apple"]=> string(5) "apple" } - Sort flag = SORT_REGULAR - bool(true) array(11) { ["x"]=> string(1) "X" ["te"]=> string(4) "Test" ["t"]=> string(4) "TTTT" ["o"]=> string(6) "Orange" ["X"]=> string(1) "x" ["W"]=> string(2) "ww" ["T"]=> string(3) "ttt" ["O"]=> string(6) "oraNGe" ["Lemon"]=> string(5) "lemoN" ["B"]=> string(6) "BANANA" ["Apple"]=> string(5) "apple" } - Sort flag = SORT_STRING - bool(true) array(11) { ["x"]=> string(1) "X" ["te"]=> string(4) "Test" ["t"]=> string(4) "TTTT" ["o"]=> string(6) "Orange" ["X"]=> string(1) "x" ["W"]=> string(2) "ww" ["T"]=> string(3) "ttt" ["O"]=> string(6) "oraNGe" ["Lemon"]=> string(5) "lemoN" ["B"]=> string(6) "BANANA" ["Apple"]=> string(5) "apple" } Done ================================================================================ 009+ ["e"]=> 010+ string(1) "e" 017- [""]=> 018- string(1) "" 037+ ["e"]=> 038+ string(1) "e" 045- [""]=> 046- string(1) "" 065+ ["e"]=> 066+ string(1) "e" 073- [""]=> 074- string(1) "" ================================================================================ ================================================================================ /home/contppw/php/php-5.6.34/ext/standard/tests/array/ksort_variation5.phpt ================================================================================ *** Testing ksort() : usage variations *** -- Testing ksort() by supplying various string arrays -- -- Iteration 1 -- - With defualt sort flag - bool(true) array(11) { [""]=> NULL [" "]=> string(1) " " [" "]=> string(1) " " [" "]=> string(1) " " [" "]=> string(1) " " [" "]=> string(1) " " ["\a"]=> string(2) "\a" ["\cx"]=> string(3) "\cx" ["\ddd"]=> string(4) "\ddd" ["\xhh"]=> string(4) "\xhh" ["e"]=> string(1) "e" } - Sort flag = SORT_REGULAR - bool(true) array(11) { [""]=> NULL [" "]=> string(1) " " [" "]=> string(1) " " [" "]=> string(1) " " [" "]=> string(1) " " [" "]=> string(1) " " ["\a"]=> string(2) "\a" ["\cx"]=> string(3) "\cx" ["\ddd"]=> string(4) "\ddd" ["\xhh"]=> string(4) "\xhh" ["e"]=> string(1) "e" } - Sort flag = SORT_STRING - bool(true) array(11) { [""]=> NULL [" "]=> string(1) " " [" "]=> string(1) " " [" "]=> string(1) " " [" "]=> string(1) " " [" "]=> string(1) " " ["\a"]=> string(2) "\a" ["\cx"]=> string(3) "\cx" ["\ddd"]=> string(4) "\ddd" ["\xhh"]=> string(4) "\xhh" ["e"]=> string(1) "e" } -- Iteration 2 -- - With defualt sort flag - bool(true) array(11) { ["Apple"]=> string(5) "apple" ["B"]=> string(6) "BANANA" ["Lemon"]=> string(5) "lemoN" ["O"]=> string(6) "oraNGe" ["T"]=> string(3) "ttt" ["W"]=> string(2) "ww" ["X"]=> string(1) "x" ["o"]=> string(6) "Orange" ["t"]=> string(4) "TTTT" ["te"]=> string(4) "Test" ["x"]=> string(1) "X" } - Sort flag = SORT_REGULAR - bool(true) array(11) { ["Apple"]=> string(5) "apple" ["B"]=> string(6) "BANANA" ["Lemon"]=> string(5) "lemoN" ["O"]=> string(6) "oraNGe" ["T"]=> string(3) "ttt" ["W"]=> string(2) "ww" ["X"]=> string(1) "x" ["o"]=> string(6) "Orange" ["t"]=> string(4) "TTTT" ["te"]=> string(4) "Test" ["x"]=> string(1) "X" } - Sort flag = SORT_STRING - bool(true) array(11) { ["Apple"]=> string(5) "apple" ["B"]=> string(6) "BANANA" ["Lemon"]=> string(5) "lemoN" ["O"]=> string(6) "oraNGe" ["T"]=> string(3) "ttt" ["W"]=> string(2) "ww" ["X"]=> string(1) "x" ["o"]=> string(6) "Orange" ["t"]=> string(4) "TTTT" ["te"]=> string(4) "Test" ["x"]=> string(1) "X" } Done ================================================================================ 023- [""]=> 024- string(1) "" 031+ ["e"]=> 032+ string(1) "e" 051- [""]=> 052- string(1) "" 059+ ["e"]=> 060+ string(1) "e" 079- [""]=> 080- string(1) "" 087+ ["e"]=> 088+ string(1) "e" ================================================================================ ================================================================================ /home/contppw/php/php-5.6.34/ext/standard/tests/array/natcasesort_variation4.phpt ================================================================================ *** Testing natcasesort() : usage variation *** bool(true) array(11) { [0]=> NULL [1]=> NULL [6]=> string(1) " " [10]=> string(1) " " [7]=> string(1) " " [5]=> string(1) " " [4]=> string(1) "e" [2]=> string(2) "\a" [3]=> string(3) "\cx" [9]=> string(4) "\ddd" [8]=> string(4) "\xhh" } bool(true) array(12) { [3]=> string(5) "apple" [11]=> string(6) "BANANA" [2]=> string(6) "banana" [0]=> string(5) "lemoN" [10]=> string(6) "oraNGe" [1]=> string(6) "Orange" [4]=> string(4) "Test" [6]=> string(3) "ttt" [5]=> string(4) "TTTT" [7]=> string(2) "ww" [8]=> string(1) "x" [9]=> string(1) "X" } Done ================================================================================ 018+ string(1) "e" 018- string(1) "" ================================================================================ ================================================================================ /home/contppw/php/php-5.6.34/ext/standard/tests/array/rsort_variation5.phpt ================================================================================ *** Testing rsort() : variation *** -- Iteration 1 -- - With Default sort flag - bool(true) array(11) { [0]=> string(1) "e" [1]=> string(4) "\xhh" [2]=> string(4) "\ddd" [3]=> string(3) "\cx" [4]=> string(2) "\a" [5]=> string(1) " " [6]=> string(1) " " [7]=> string(1) " " [8]=> string(1) " " [9]=> NULL [10]=> NULL } - Sort flag = SORT_REGULAR - bool(true) array(11) { [0]=> string(1) "e" [1]=> string(4) "\xhh" [2]=> string(4) "\ddd" [3]=> string(3) "\cx" [4]=> string(2) "\a" [5]=> string(1) " " [6]=> string(1) " " [7]=> string(1) " " [8]=> string(1) " " [9]=> NULL [10]=> NULL } - Sort flag = SORT_STRING - bool(true) array(11) { [0]=> string(1) "e" [1]=> string(4) "\xhh" [2]=> string(4) "\ddd" [3]=> string(3) "\cx" [4]=> string(2) "\a" [5]=> string(1) " " [6]=> string(1) " " [7]=> string(1) " " [8]=> string(1) " " [9]=> NULL [10]=> NULL } -- Iteration 2 -- - With Default sort flag - bool(true) array(12) { [0]=> string(1) "x" [1]=> string(2) "ww" [2]=> string(3) "ttt" [3]=> string(6) "oraNGe" [4]=> string(5) "lemoN" [5]=> string(6) "banana" [6]=> string(5) "apple" [7]=> string(1) "X" [8]=> string(4) "Test" [9]=> string(4) "TTTT" [10]=> string(6) "Orange" [11]=> string(6) "BANANA" } - Sort flag = SORT_REGULAR - bool(true) array(12) { [0]=> string(1) "x" [1]=> string(2) "ww" [2]=> string(3) "ttt" [3]=> string(6) "oraNGe" [4]=> string(5) "lemoN" [5]=> string(6) "banana" [6]=> string(5) "apple" [7]=> string(1) "X" [8]=> string(4) "Test" [9]=> string(4) "TTTT" [10]=> string(6) "Orange" [11]=> string(6) "BANANA" } - Sort flag = SORT_STRING - bool(true) array(12) { [0]=> string(1) "x" [1]=> string(2) "ww" [2]=> string(3) "ttt" [3]=> string(6) "oraNGe" [4]=> string(5) "lemoN" [5]=> string(6) "banana" [6]=> string(5) "apple" [7]=> string(1) "X" [8]=> string(4) "Test" [9]=> string(4) "TTTT" [10]=> string(6) "Orange" [11]=> string(6) "BANANA" } Done ================================================================================ 008+ string(1) "e" 008- string(4) "\xhh" 010+ string(4) "\xhh" 010- string(4) "\ddd" 012+ string(4) "\ddd" 012- string(3) "\cx" 014+ string(3) "\cx" 015+ [4]=> 015- [4]=> 016- string(1) "" 035+ string(1) "e" 035- string(4) "\xhh" 037+ string(4) "\xhh" 037- string(4) "\ddd" 039+ string(4) "\ddd" 039- string(3) "\cx" 041+ string(3) "\cx" 042+ [4]=> 042- [4]=> 043- string(1) "" 062+ string(1) "e" 062- string(4) "\xhh" 064+ string(4) "\xhh" 064- string(4) "\ddd" 066+ string(4) "\ddd" 066- string(3) "\cx" 068+ string(3) "\cx" 069+ [4]=> 069- [4]=> 070- string(1) "" ================================================================================ ================================================================================ /home/contppw/php/php-5.6.34/ext/standard/tests/array/sort_variation5.phpt ================================================================================ *** Testing sort() : usage variations *** -- Testing sort() by supplying various string arrays -- -- Iteration 1 -- - With Default sort flag - bool(true) array(12) { [0]=> NULL [1]=> NULL [2]=> string(1) " " [3]=> string(1) " " [4]=> string(1) " " [5]=> string(1) " " [6]=> string(1) " " [7]=> string(2) "\a" [8]=> string(3) "\cx" [9]=> string(4) "\ddd" [10]=> string(4) "\xhh" [11]=> string(1) "e" } - Sort flag = SORT_REGULAR - bool(true) array(12) { [0]=> NULL [1]=> NULL [2]=> string(1) " " [3]=> string(1) " " [4]=> string(1) " " [5]=> string(1) " " [6]=> string(1) " " [7]=> string(2) "\a" [8]=> string(3) "\cx" [9]=> string(4) "\ddd" [10]=> string(4) "\xhh" [11]=> string(1) "e" } - Sort flag = SORT_STRING - bool(true) array(12) { [0]=> NULL [1]=> NULL [2]=> string(1) " " [3]=> string(1) " " [4]=> string(1) " " [5]=> string(1) " " [6]=> string(1) " " [7]=> string(2) "\a" [8]=> string(3) "\cx" [9]=> string(4) "\ddd" [10]=> string(4) "\xhh" [11]=> string(1) "e" } -- Iteration 2 -- - With Default sort flag - bool(true) array(12) { [0]=> string(6) "BANANA" [1]=> string(6) "Orange" [2]=> string(4) "TTTT" [3]=> string(4) "Test" [4]=> string(1) "X" [5]=> string(5) "apple" [6]=> string(6) "banana" [7]=> string(5) "lemoN" [8]=> string(6) "oraNGe" [9]=> string(3) "ttt" [10]=> string(2) "ww" [11]=> string(1) "x" } - Sort flag = SORT_REGULAR - bool(true) array(12) { [0]=> string(6) "BANANA" [1]=> string(6) "Orange" [2]=> string(4) "TTTT" [3]=> string(4) "Test" [4]=> string(1) "X" [5]=> string(5) "apple" [6]=> string(6) "banana" [7]=> string(5) "lemoN" [8]=> string(6) "oraNGe" [9]=> string(3) "ttt" [10]=> string(2) "ww" [11]=> string(1) "x" } - Sort flag = SORT_STRING - bool(true) array(12) { [0]=> string(6) "BANANA" [1]=> string(6) "Orange" [2]=> string(4) "TTTT" [3]=> string(4) "Test" [4]=> string(1) "X" [5]=> string(5) "apple" [6]=> string(6) "banana" [7]=> string(5) "lemoN" [8]=> string(6) "oraNGe" [9]=> string(3) "ttt" [10]=> string(2) "ww" [11]=> string(1) "x" } Done ================================================================================ 025- string(1) "" 026- [8]=> 026+ [8]=> 028+ [9]=> 028- [9]=> 030+ [10]=> 031+ string(4) "\xhh" 030- [10]=> 033+ string(1) "e" 033- string(4) "\xhh" 054- string(1) "" 055- [8]=> 055+ [8]=> 057+ [9]=> 057- [9]=> 059+ [10]=> 060+ string(4) "\xhh" 059- [10]=> 062+ string(1) "e" 062- string(4) "\xhh" 083- string(1) "" 084- [8]=> 084+ [8]=> 086+ [9]=> 086- [9]=> 088+ [10]=> 089+ string(4) "\xhh" 088- [10]=> 091+ string(1) "e" 091- string(4) "\xhh" ================================================================================ ================================================================================ /home/contppw/php/php-5.6.34/ext/standard/tests/file/bug43008.phpt ================================================================================ Warning: file_get_contents(): iconv stream filter ("ISO-8859-15"=>"UTF-8"): unknown error in /home/contppw/php/php-5.6.34/ext/standard/tests/file/bug43008.php on line 9 string(0) "" ================================================================================ 001+ Warning: file_get_contents(): iconv stream filter ("ISO-8859-15"=>"UTF-8"): unknown error in /home/contppw/php/php-5.6.34/ext/standard/tests/file/bug43008.php on line 9 001- string(8) "foob%E2r" 002+ string(0) "" ================================================================================ ================================================================================ /home/contppw/php/php-5.6.34/ext/standard/tests/file/disk_free_space_basic.phpt ================================================================================ *** Testing with existing directory *** float(11968028672) float(11968028672) *** Testing with newly created directory *** Free Space before writing to a file float(11968028672) Free Space after writing to a file float(11968028672) Free Space Value Is Incorrect float(11968028672) float(11968028672) *** Testing with Binary Input *** float(11968028672) --- Done --- ================================================================================ 012+ Free Space Value Is Incorrect 013+ float(11968028672) 014+ float(11968028672) 012- Free Space Value Is Correct ================================================================================ ================================================================================ /home/contppw/php/php-5.6.34/ext/standard/tests/file/filetype_variation2.phpt ================================================================================ -- Checking for char -- link ===DONE=== ================================================================================ 002+ link 002- char ================================================================================ ================================================================================ /home/contppw/php/php-5.6.34/ext/standard/tests/file/flock.phpt ================================================================================ Warning: flock() expects at least 2 parameters, 0 given in /home/contppw/php/php-5.6.34/ext/standard/tests/file/flock.php on line 5 NULL Warning: flock() expects parameter 1 to be resource, string given in /home/contppw/php/php-5.6.34/ext/standard/tests/file/flock.php on line 6 NULL Warning: flock(): 5 is not a valid stream resource in /home/contppw/php/php-5.6.34/ext/standard/tests/file/flock.php on line 11 bool(false) bool(false) bool(true) bool(true) bool(true) bool(false) int(0) bool(true) int(0) bool(true) int(0) bool(true) int(0) bool(true) Warning: flock(): Illegal operation argument in /home/contppw/php/php-5.6.34/ext/standard/tests/file/flock.php on line 31 bool(false) Done ================================================================================ 009+ bool(false) 012- bool(true) 013- bool(true) 013+ bool(false) ================================================================================ ================================================================================ /home/contppw/php/php-5.6.34/ext/standard/tests/file/flock_basic.phpt ================================================================================ *** Testing flock() fun with file and dir *** bool(false) bool(true) bool(true) bool(true) bool(false) bool(false) bool(false) bool(false) *** Done *** ================================================================================ 002+ bool(false) 005- bool(true) ================================================================================ ================================================================================ /home/contppw/php/php-5.6.34/ext/standard/tests/file/flock_variation.phpt ================================================================================ *** Testing flock() fun with the various operation and wouldblock values *** --- Outer iteration 0 --- bool(false) -- Inner iteration 0 in 0 -- bool(false) -- Inner iteration 1 in 0 -- bool(false) -- Inner iteration 2 in 0 -- bool(false) -- Inner iteration 3 in 0 -- bool(false) -- Inner iteration 4 in 0 -- bool(false) -- Inner iteration 5 in 0 -- bool(false) -- Inner iteration 6 in 0 -- bool(false) -- Inner iteration 7 in 0 -- bool(false) -- Inner iteration 8 in 0 -- bool(false) -- Inner iteration 9 in 0 -- bool(false) -- Inner iteration 10 in 0 -- bool(false) -- Inner iteration 11 in 0 -- bool(false) -- Inner iteration 12 in 0 -- bool(false) -- Inner iteration 13 in 0 -- bool(false) --- Outer iteration 1 --- bool(true) -- Inner iteration 0 in 1 -- bool(true) -- Inner iteration 1 in 1 -- bool(true) -- Inner iteration 2 in 1 -- bool(true) -- Inner iteration 3 in 1 -- bool(true) -- Inner iteration 4 in 1 -- bool(true) -- Inner iteration 5 in 1 -- bool(true) -- Inner iteration 6 in 1 -- bool(true) -- Inner iteration 7 in 1 -- bool(true) -- Inner iteration 8 in 1 -- bool(true) -- Inner iteration 9 in 1 -- bool(true) -- Inner iteration 10 in 1 -- bool(true) -- Inner iteration 11 in 1 -- bool(true) -- Inner iteration 12 in 1 -- bool(true) -- Inner iteration 13 in 1 -- bool(true) --- Outer iteration 2 --- bool(false) -- Inner iteration 0 in 2 -- bool(false) -- Inner iteration 1 in 2 -- bool(false) -- Inner iteration 2 in 2 -- bool(false) -- Inner iteration 3 in 2 -- bool(false) -- Inner iteration 4 in 2 -- bool(false) -- Inner iteration 5 in 2 -- bool(false) -- Inner iteration 6 in 2 -- bool(false) -- Inner iteration 7 in 2 -- bool(false) -- Inner iteration 8 in 2 -- bool(false) -- Inner iteration 9 in 2 -- bool(false) -- Inner iteration 10 in 2 -- bool(false) -- Inner iteration 11 in 2 -- bool(false) -- Inner iteration 12 in 2 -- bool(false) -- Inner iteration 13 in 2 -- bool(false) --- Outer iteration 3 --- bool(true) -- Inner iteration 0 in 3 -- bool(true) -- Inner iteration 1 in 3 -- bool(true) -- Inner iteration 2 in 3 -- bool(true) -- Inner iteration 3 in 3 -- bool(true) -- Inner iteration 4 in 3 -- bool(true) -- Inner iteration 5 in 3 -- bool(true) -- Inner iteration 6 in 3 -- bool(true) -- Inner iteration 7 in 3 -- bool(true) -- Inner iteration 8 in 3 -- bool(true) -- Inner iteration 9 in 3 -- bool(true) -- Inner iteration 10 in 3 -- bool(true) -- Inner iteration 11 in 3 -- bool(true) -- Inner iteration 12 in 3 -- bool(true) -- Inner iteration 13 in 3 -- bool(true) --- Outer iteration 4 --- bool(true) -- Inner iteration 0 in 4 -- bool(true) -- Inner iteration 1 in 4 -- bool(true) -- Inner iteration 2 in 4 -- bool(true) -- Inner iteration 3 in 4 -- bool(true) -- Inner iteration 4 in 4 -- bool(true) -- Inner iteration 5 in 4 -- bool(true) -- Inner iteration 6 in 4 -- bool(true) -- Inner iteration 7 in 4 -- bool(true) -- Inner iteration 8 in 4 -- bool(true) -- Inner iteration 9 in 4 -- bool(true) -- Inner iteration 10 in 4 -- bool(true) -- Inner iteration 11 in 4 -- bool(true) -- Inner iteration 12 in 4 -- bool(true) -- Inner iteration 13 in 4 -- bool(true) --- Outer iteration 5 --- bool(true) -- Inner iteration 0 in 5 -- bool(true) -- Inner iteration 1 in 5 -- bool(true) -- Inner iteration 2 in 5 -- bool(true) -- Inner iteration 3 in 5 -- bool(true) -- Inner iteration 4 in 5 -- bool(true) -- Inner iteration 5 in 5 -- bool(true) -- Inner iteration 6 in 5 -- bool(true) -- Inner iteration 7 in 5 -- bool(true) -- Inner iteration 8 in 5 -- bool(true) -- Inner iteration 9 in 5 -- bool(true) -- Inner iteration 10 in 5 -- bool(true) -- Inner iteration 11 in 5 -- bool(true) -- Inner iteration 12 in 5 -- bool(true) -- Inner iteration 13 in 5 -- bool(true) --- Outer iteration 6 --- bool(false) -- Inner iteration 0 in 6 -- bool(false) -- Inner iteration 1 in 6 -- bool(false) -- Inner iteration 2 in 6 -- bool(false) -- Inner iteration 3 in 6 -- bool(false) -- Inner iteration 4 in 6 -- bool(false) -- Inner iteration 5 in 6 -- bool(false) -- Inner iteration 6 in 6 -- bool(false) -- Inner iteration 7 in 6 -- bool(false) -- Inner iteration 8 in 6 -- bool(false) -- Inner iteration 9 in 6 -- bool(false) -- Inner iteration 10 in 6 -- bool(false) -- Inner iteration 11 in 6 -- bool(false) -- Inner iteration 12 in 6 -- bool(false) -- Inner iteration 13 in 6 -- bool(false) --- Outer iteration 7 --- bool(true) -- Inner iteration 0 in 7 -- bool(true) -- Inner iteration 1 in 7 -- bool(true) -- Inner iteration 2 in 7 -- bool(true) -- Inner iteration 3 in 7 -- bool(true) -- Inner iteration 4 in 7 -- bool(true) -- Inner iteration 5 in 7 -- bool(true) -- Inner iteration 6 in 7 -- bool(true) -- Inner iteration 7 in 7 -- bool(true) -- Inner iteration 8 in 7 -- bool(true) -- Inner iteration 9 in 7 -- bool(true) -- Inner iteration 10 in 7 -- bool(true) -- Inner iteration 11 in 7 -- bool(true) -- Inner iteration 12 in 7 -- bool(true) -- Inner iteration 13 in 7 -- bool(true) --- Outer iteration 8 --- bool(true) -- Inner iteration 0 in 8 -- bool(true) -- Inner iteration 1 in 8 -- bool(true) -- Inner iteration 2 in 8 -- bool(true) -- Inner iteration 3 in 8 -- bool(true) -- Inner iteration 4 in 8 -- bool(true) -- Inner iteration 5 in 8 -- bool(true) -- Inner iteration 6 in 8 -- bool(true) -- Inner iteration 7 in 8 -- bool(true) -- Inner iteration 8 in 8 -- bool(true) -- Inner iteration 9 in 8 -- bool(true) -- Inner iteration 10 in 8 -- bool(true) -- Inner iteration 11 in 8 -- bool(true) -- Inner iteration 12 in 8 -- bool(true) -- Inner iteration 13 in 8 -- bool(true) --- Outer iteration 9 --- bool(false) -- Inner iteration 0 in 9 -- bool(false) -- Inner iteration 1 in 9 -- bool(false) -- Inner iteration 2 in 9 -- bool(false) -- Inner iteration 3 in 9 -- bool(false) -- Inner iteration 4 in 9 -- bool(false) -- Inner iteration 5 in 9 -- bool(false) -- Inner iteration 6 in 9 -- bool(false) -- Inner iteration 7 in 9 -- bool(false) -- Inner iteration 8 in 9 -- bool(false) -- Inner iteration 9 in 9 -- bool(false) -- Inner iteration 10 in 9 -- bool(false) -- Inner iteration 11 in 9 -- bool(false) -- Inner iteration 12 in 9 -- bool(false) -- Inner iteration 13 in 9 -- bool(false) *** Done *** ================================================================================ 004+ bool(false) 004- bool(true) 006+ bool(false) 006- bool(true) 008+ bool(false) 008- bool(true) 010+ bool(false) 010- bool(true) 012+ bool(false) 012- bool(true) 014+ bool(false) 014- bool(true) 016+ bool(false) 016- bool(true) 018+ bool(false) 018- bool(true) 020+ bool(false) 020- bool(true) 022+ bool(false) 022- bool(true) 024+ bool(false) 024- bool(true) 026+ bool(false) 026- bool(true) 028+ bool(false) 028- bool(true) 030+ bool(false) 030- bool(true) 032+ bool(false) 032- bool(true) 064+ bool(false) 064- bool(true) 066+ bool(false) 066- bool(true) 068+ bool(false) 068- bool(true) 070+ bool(false) 070- bool(true) 072+ bool(false) 072- bool(true) 074+ bool(false) 074- bool(true) 076+ bool(false) 076- bool(true) 078+ bool(false) 078- bool(true) 080+ bool(false) 080- bool(true) 082+ bool(false) 082- bool(true) 084+ bool(false) 084- bool(true) 086+ bool(false) 086- bool(true) 088+ bool(false) 088- bool(true) 090+ bool(false) 090- bool(true) 092+ bool(false) 092- bool(true) 184+ bool(false) 184- bool(true) 186+ bool(false) 186- bool(true) 188+ bool(false) 188- bool(true) 190+ bool(false) 190- bool(true) 192+ bool(false) 192- bool(true) 194+ bool(false) 194- bool(true) 196+ bool(false) 196- bool(true) 198+ bool(false) 198- bool(true) 200+ bool(false) 200- bool(true) 202+ bool(false) 202- bool(true) 204+ bool(false) 204- bool(true) 206+ bool(false) 206- bool(true) 208+ bool(false) 208- bool(true) 210+ bool(false) 210- bool(true) 212+ bool(false) 212- bool(true) 274+ bool(false) 274- bool(true) 276+ bool(false) 276- bool(true) 278+ bool(false) 278- bool(true) 280+ bool(false) 280- bool(true) 282+ bool(false) 282- bool(true) 284+ bool(false) 284- bool(true) 286+ bool(false) 286- bool(true) 288+ bool(false) 288- bool(true) 290+ bool(false) 290- bool(true) 292+ bool(false) 292- bool(true) 294+ bool(false) 294- bool(true) 296+ bool(false) 296- bool(true) 298+ bool(false) 298- bool(true) 300+ bool(false) 300- bool(true) 302+ bool(false) 302- bool(true) ================================================================================ ================================================================================ /home/contppw/php/php-5.6.34/ext/standard/tests/file/glob_basic.phpt ================================================================================ *** Testing glob() : basic functions *** array(3) { [0]=> string(73) "/home/contppw/php/php-5.6.34/ext/standard/tests/file/glob_basic/file.text" [1]=> string(74) "/home/contppw/php/php-5.6.34/ext/standard/tests/file/glob_basic/wonder.txt" [2]=> string(75) "/home/contppw/php/php-5.6.34/ext/standard/tests/file/glob_basic/wonder12345" } array(1) { [0]=> string(74) "/home/contppw/php/php-5.6.34/ext/standard/tests/file/glob_basic/wonder.txt" } array(1) { [0]=> string(74) "/home/contppw/php/php-5.6.34/ext/standard/tests/file/glob_basic/wonder.txt" } array(2) { [0]=> string(73) "/home/contppw/php/php-5.6.34/ext/standard/tests/file/glob_basic/file.text" [1]=> string(74) "/home/contppw/php/php-5.6.34/ext/standard/tests/file/glob_basic/wonder.txt" } array(1) { [0]=> string(66) "/home/contppw/php/php-5.6.34/ext/standard/tests/file/glob_basic/.." } array(4) { [0]=> string(65) "/home/contppw/php/php-5.6.34/ext/standard/tests/file/glob_basic/." [1]=> string(66) "/home/contppw/php/php-5.6.34/ext/standard/tests/file/glob_basic/.." [2]=> string(73) "/home/contppw/php/php-5.6.34/ext/standard/tests/file/glob_basic/file.text" [3]=> string(74) "/home/contppw/php/php-5.6.34/ext/standard/tests/file/glob_basic/wonder.txt" } Done ================================================================================ 024+ array(1) { 025+ [0]=> 026+ string(66) "/home/contppw/php/php-5.6.34/ext/standard/tests/file/glob_basic/.." 024- array(0) { 026- array(2) { 028+ array(4) { 029- [1]=> 030+ string(65) "/home/contppw/php/php-5.6.34/ext/standard/tests/file/glob_basic/." 031+ [1]=> 032+ string(66) "/home/contppw/php/php-5.6.34/ext/standard/tests/file/glob_basic/.." 033+ [2]=> 035+ [3]=> ================================================================================ ================================================================================ /home/contppw/php/php-5.6.34/ext/standard/tests/file/is_executable_variation1.phpt ================================================================================ *** Testing is_executable(): usage variations *** -- Iteration 1 -- bool(true) -- Iteration 2 -- bool(false) -- Iteration 3 -- bool(true) -- Iteration 4 -- bool(false) -- Iteration 5 -- bool(false) -- Iteration 6 -- Warning: is_executable() expects parameter 1 to be a valid path, string given in /home/contppw/php/php-5.6.34/ext/standard/tests/file/is_executable_variation1.php on line 45 NULL -- Iteration 7 -- Warning: is_executable() expects parameter 1 to be a valid path, string given in /home/contppw/php/php-5.6.34/ext/standard/tests/file/is_executable_variation1.php on line 45 NULL -- Iteration 8 -- bool(false) -- Iteration 9 -- bool(true) -- Iteration 10 -- bool(true) Done ================================================================================ 003+ bool(true) 003- bool(false) 007+ bool(true) 007- bool(false) ================================================================================ ================================================================================ /home/contppw/php/php-5.6.34/ext/standard/tests/file/lstat_stat_variation18.phpt ================================================================================ *** Testing stat() with filename & directory name stored inside an object *** -- Testing stat() on filename stored inside an object -- array(26) { [0]=> int(80019464) [1]=> int(25176) [2]=> int(33188) [3]=> int(1) [4]=> int(0) [5]=> int(0) [6]=> int(-1) [7]=> int(0) [8]=> int(1524190062) [9]=> int(1524190062) [10]=> int(1524190062) [11]=> int(131072) [12]=> int(1) ["dev"]=> int(80019464) ["ino"]=> int(25176) ["mode"]=> int(33188) ["nlink"]=> int(1) ["uid"]=> int(0) ["gid"]=> int(0) ["rdev"]=> int(-1) ["size"]=> int(0) ["atime"]=> int(1524190062) ["mtime"]=> int(1524190062) ["ctime"]=> int(1524190062) ["blksize"]=> int(131072) ["blocks"]=> int(1) } -- Testing stat() on directory name stored inside an object -- array(26) { [0]=> int(80019464) [1]=> int(25175) [2]=> int(16877) [3]=> int(2) [4]=> int(0) [5]=> int(0) [6]=> int(-1) [7]=> int(2) [8]=> int(1524190062) [9]=> int(1524190062) [10]=> int(1524190062) [11]=> int(131072) [12]=> int(1) ["dev"]=> int(80019464) ["ino"]=> int(25175) ["mode"]=> int(16877) ["nlink"]=> int(2) ["uid"]=> int(0) ["gid"]=> int(0) ["rdev"]=> int(-1) ["size"]=> int(2) ["atime"]=> int(1524190062) ["mtime"]=> int(1524190062) ["ctime"]=> int(1524190062) ["blksize"]=> int(131072) ["blocks"]=> int(1) } --- Done --- ================================================================================ 018+ int(-1) 018- int(%d) 044+ int(-1) 044- int(%d) 074+ int(-1) 074- int(%d) 100+ int(-1) 100- int(%d) ================================================================================ ================================================================================ /home/contppw/php/php-5.6.34/ext/standard/tests/file/lstat_stat_variation19.phpt ================================================================================ *** Testing stat() with filename & directory name stored inside an array *** -- Testing stat() on filename stored inside an array -- array(26) { [0]=> int(80019464) [1]=> int(25186) [2]=> int(33188) [3]=> int(1) [4]=> int(0) [5]=> int(0) [6]=> int(-1) [7]=> int(0) [8]=> int(1524190062) [9]=> int(1524190062) [10]=> int(1524190062) [11]=> int(131072) [12]=> int(1) ["dev"]=> int(80019464) ["ino"]=> int(25186) ["mode"]=> int(33188) ["nlink"]=> int(1) ["uid"]=> int(0) ["gid"]=> int(0) ["rdev"]=> int(-1) ["size"]=> int(0) ["atime"]=> int(1524190062) ["mtime"]=> int(1524190062) ["ctime"]=> int(1524190062) ["blksize"]=> int(131072) ["blocks"]=> int(1) } array(26) { [0]=> int(80019464) [1]=> int(25186) [2]=> int(33188) [3]=> int(1) [4]=> int(0) [5]=> int(0) [6]=> int(-1) [7]=> int(0) [8]=> int(1524190062) [9]=> int(1524190062) [10]=> int(1524190062) [11]=> int(131072) [12]=> int(1) ["dev"]=> int(80019464) ["ino"]=> int(25186) ["mode"]=> int(33188) ["nlink"]=> int(1) ["uid"]=> int(0) ["gid"]=> int(0) ["rdev"]=> int(-1) ["size"]=> int(0) ["atime"]=> int(1524190062) ["mtime"]=> int(1524190062) ["ctime"]=> int(1524190062) ["blksize"]=> int(131072) ["blocks"]=> int(1) } -- Testing stat() on dir name stored inside an array -- array(26) { [0]=> int(80019464) [1]=> int(25185) [2]=> int(16877) [3]=> int(2) [4]=> int(0) [5]=> int(0) [6]=> int(-1) [7]=> int(2) [8]=> int(1524190062) [9]=> int(1524190062) [10]=> int(1524190062) [11]=> int(131072) [12]=> int(1) ["dev"]=> int(80019464) ["ino"]=> int(25185) ["mode"]=> int(16877) ["nlink"]=> int(2) ["uid"]=> int(0) ["gid"]=> int(0) ["rdev"]=> int(-1) ["size"]=> int(2) ["atime"]=> int(1524190062) ["mtime"]=> int(1524190062) ["ctime"]=> int(1524190062) ["blksize"]=> int(131072) ["blocks"]=> int(1) } array(26) { [0]=> int(80019464) [1]=> int(25185) [2]=> int(16877) [3]=> int(2) [4]=> int(0) [5]=> int(0) [6]=> int(-1) [7]=> int(2) [8]=> int(1524190062) [9]=> int(1524190062) [10]=> int(1524190062) [11]=> int(131072) [12]=> int(1) ["dev"]=> int(80019464) ["ino"]=> int(25185) ["mode"]=> int(16877) ["nlink"]=> int(2) ["uid"]=> int(0) ["gid"]=> int(0) ["rdev"]=> int(-1) ["size"]=> int(2) ["atime"]=> int(1524190062) ["mtime"]=> int(1524190062) ["ctime"]=> int(1524190062) ["blksize"]=> int(131072) ["blocks"]=> int(1) } --- Done --- ================================================================================ 018+ int(-1) 018- int(%d) 044+ int(-1) 044- int(%d) 072+ int(-1) 072- int(%d) 098+ int(-1) 098- int(%d) 128+ int(-1) 128- int(%d) 154+ int(-1) 154- int(%d) 182+ int(-1) 182- int(%d) 208+ int(-1) 208- int(%d) ================================================================================ ================================================================================ /home/contppw/php/php-5.6.34/ext/standard/tests/file/lstat_stat_variation20.phpt ================================================================================ *** Testing lstat() with linkname stored inside an object/array *** -- Testing lstat() on link name stored inside an object -- array(26) { [0]=> int(80019464) [1]=> int(25200) [2]=> int(41471) [3]=> int(1) [4]=> int(0) [5]=> int(0) [6]=> int(-1) [7]=> int(79) [8]=> int(1524190062) [9]=> int(1524190062) [10]=> int(1524190062) [11]=> int(131072) [12]=> int(1) ["dev"]=> int(80019464) ["ino"]=> int(25200) ["mode"]=> int(41471) ["nlink"]=> int(1) ["uid"]=> int(0) ["gid"]=> int(0) ["rdev"]=> int(-1) ["size"]=> int(79) ["atime"]=> int(1524190062) ["mtime"]=> int(1524190062) ["ctime"]=> int(1524190062) ["blksize"]=> int(131072) ["blocks"]=> int(1) } -- Testing stat() on link name stored inside an array -- array(26) { [0]=> int(80019464) [1]=> int(25199) [2]=> int(33188) [3]=> int(1) [4]=> int(0) [5]=> int(0) [6]=> int(-1) [7]=> int(0) [8]=> int(1524190062) [9]=> int(1524190062) [10]=> int(1524190062) [11]=> int(131072) [12]=> int(1) ["dev"]=> int(80019464) ["ino"]=> int(25199) ["mode"]=> int(33188) ["nlink"]=> int(1) ["uid"]=> int(0) ["gid"]=> int(0) ["rdev"]=> int(-1) ["size"]=> int(0) ["atime"]=> int(1524190062) ["mtime"]=> int(1524190062) ["ctime"]=> int(1524190062) ["blksize"]=> int(131072) ["blocks"]=> int(1) } array(26) { [0]=> int(80019464) [1]=> int(25199) [2]=> int(33188) [3]=> int(1) [4]=> int(0) [5]=> int(0) [6]=> int(-1) [7]=> int(0) [8]=> int(1524190062) [9]=> int(1524190062) [10]=> int(1524190062) [11]=> int(131072) [12]=> int(1) ["dev"]=> int(80019464) ["ino"]=> int(25199) ["mode"]=> int(33188) ["nlink"]=> int(1) ["uid"]=> int(0) ["gid"]=> int(0) ["rdev"]=> int(-1) ["size"]=> int(0) ["atime"]=> int(1524190062) ["mtime"]=> int(1524190062) ["ctime"]=> int(1524190062) ["blksize"]=> int(131072) ["blocks"]=> int(1) } array(26) { [0]=> int(80019464) [1]=> int(25199) [2]=> int(33188) [3]=> int(1) [4]=> int(0) [5]=> int(0) [6]=> int(-1) [7]=> int(0) [8]=> int(1524190062) [9]=> int(1524190062) [10]=> int(1524190062) [11]=> int(131072) [12]=> int(1) ["dev"]=> int(80019464) ["ino"]=> int(25199) ["mode"]=> int(33188) ["nlink"]=> int(1) ["uid"]=> int(0) ["gid"]=> int(0) ["rdev"]=> int(-1) ["size"]=> int(0) ["atime"]=> int(1524190062) ["mtime"]=> int(1524190062) ["ctime"]=> int(1524190062) ["blksize"]=> int(131072) ["blocks"]=> int(1) } --- Done --- ================================================================================ 018+ int(-1) 018- int(%d) 044+ int(-1) 044- int(%d) 074+ int(-1) 074- int(%d) 100+ int(-1) 100- int(%d) 128+ int(-1) 128- int(%d) 154+ int(-1) 154- int(%d) 182+ int(-1) 182- int(%d) 208+ int(-1) 208- int(%d) ================================================================================ ================================================================================ /home/contppw/php/php-5.6.34/ext/standard/tests/file/lstat_stat_variation7.phpt ================================================================================ *** Testing stat() on file after data is written in it *** bool(true) bool(true) Error: stat1 is not lesser than stat2 at key value: 12 Error: stat1 is not lesser than stat2 at key value: blocks Dumping stat array 1... array(26) { [0]=> int(80019464) [1]=> int(25229) [2]=> int(33188) [3]=> int(1) [4]=> int(0) [5]=> int(0) [6]=> int(-1) [7]=> int(0) [8]=> int(1524190069) [9]=> int(1524190069) [10]=> int(1524190069) [11]=> int(131072) [12]=> int(1) ["dev"]=> int(80019464) ["ino"]=> int(25229) ["mode"]=> int(33188) ["nlink"]=> int(1) ["uid"]=> int(0) ["gid"]=> int(0) ["rdev"]=> int(-1) ["size"]=> int(0) ["atime"]=> int(1524190069) ["mtime"]=> int(1524190069) ["ctime"]=> int(1524190069) ["blksize"]=> int(131072) ["blocks"]=> int(1) } Dumping stat array 2... array(26) { [0]=> int(80019464) [1]=> int(25229) [2]=> int(33188) [3]=> int(1) [4]=> int(0) [5]=> int(0) [6]=> int(-1) [7]=> int(1441792) [8]=> int(1524190069) [9]=> int(1524190069) [10]=> int(1524190069) [11]=> int(131072) [12]=> int(1) ["dev"]=> int(80019464) ["ino"]=> int(25229) ["mode"]=> int(33188) ["nlink"]=> int(1) ["uid"]=> int(0) ["gid"]=> int(0) ["rdev"]=> int(-1) ["size"]=> int(1441792) ["atime"]=> int(1524190069) ["mtime"]=> int(1524190069) ["ctime"]=> int(1524190069) ["blksize"]=> int(131072) ["blocks"]=> int(1) } bool(false) --- Done --- ================================================================================ 004+ Error: stat1 is not lesser than stat2 at key value: 12 005+ Error: stat1 is not lesser than stat2 at key value: blocks 004- bool(true) 006- --- Done --- 007+ Dumping stat array 1... 008+ array(26) { 009+ [0]=> 010+ int(80019464) 011+ [1]=> 012+ int(25229) 013+ [2]=> 014+ int(33188) 015+ [3]=> 016+ int(1) 017+ [4]=> 018+ int(0) 019+ [5]=> 020+ int(0) 021+ [6]=> 022+ int(-1) 023+ [7]=> 024+ int(0) 025+ [8]=> 026+ int(1524190069) 027+ [9]=> 028+ int(1524190069) 029+ [10]=> 030+ int(1524190069) 031+ [11]=> 032+ int(131072) 033+ [12]=> 034+ int(1) 035+ ["dev"]=> 036+ int(80019464) 037+ ["ino"]=> 038+ int(25229) 039+ ["mode"]=> 040+ int(33188) 041+ ["nlink"]=> 042+ int(1) 043+ ["uid"]=> 044+ int(0) 045+ ["gid"]=> 046+ int(0) 047+ ["rdev"]=> 048+ int(-1) 049+ ["size"]=> 050+ int(0) 051+ ["atime"]=> 052+ int(1524190069) 053+ ["mtime"]=> 054+ int(1524190069) 055+ ["ctime"]=> 056+ int(1524190069) 057+ ["blksize"]=> 058+ int(131072) 059+ ["blocks"]=> 060+ int(1) 061+ } 062+ 063+ Dumping stat array 2... 064+ array(26) { 065+ [0]=> 066+ int(80019464) 067+ [1]=> 068+ int(25229) 069+ [2]=> 070+ int(33188) 071+ [3]=> 072+ int(1) 073+ [4]=> 074+ int(0) 075+ [5]=> 076+ int(0) 077+ [6]=> 078+ int(-1) 079+ [7]=> 080+ int(1441792) 081+ [8]=> 082+ int(1524190069) 083+ [9]=> 084+ int(1524190069) 085+ [10]=> 086+ int(1524190069) 087+ [11]=> 088+ int(131072) 089+ [12]=> 090+ int(1) 091+ ["dev"]=> 092+ int(80019464) 093+ ["ino"]=> 094+ int(25229) 095+ ["mode"]=> 096+ int(33188) 097+ ["nlink"]=> 098+ int(1) 099+ ["uid"]=> 100+ int(0) 101+ ["gid"]=> 102+ int(0) 103+ ["rdev"]=> 104+ int(-1) 105+ ["size"]=> 106+ int(1441792) 107+ ["atime"]=> 108+ int(1524190069) 109+ ["mtime"]=> 110+ int(1524190069) 111+ ["ctime"]=> 112+ int(1524190069) 113+ ["blksize"]=> 114+ int(131072) 115+ ["blocks"]=> 116+ int(1) 117+ } 118+ bool(false) 119+ 120+ --- Done --- ================================================================================ ================================================================================ /home/contppw/php/php-5.6.34/ext/standard/tests/file/popen_pclose_error-sunos.phpt ================================================================================ *** Testing for error conditions *** Warning: popen() expects exactly 2 parameters, 0 given in /home/contppw/php/php-5.6.34/ext/standard/tests/file/popen_pclose_error-sunos.php on line 11 NULL Warning: popen() expects exactly 2 parameters, 1 given in /home/contppw/php/php-5.6.34/ext/standard/tests/file/popen_pclose_error-sunos.php on line 12 NULL resource(4) of type (stream) sh: abc.txt: not found Warning: pclose() expects exactly 1 parameter, 0 given in /home/contppw/php/php-5.6.34/ext/standard/tests/file/popen_pclose_error-sunos.php on line 14 bool(false) Warning: pclose() expects exactly 1 parameter, 2 given in /home/contppw/php/php-5.6.34/ext/standard/tests/file/popen_pclose_error-sunos.php on line 16 bool(false) Warning: pclose() expects parameter 1 to be resource, integer given in /home/contppw/php/php-5.6.34/ext/standard/tests/file/popen_pclose_error-sunos.php on line 18 bool(false) --- Done --- ================================================================================ 003+ Warning: popen() expects exactly 2 parameters, 0 given in /home/contppw/php/php-5.6.34/ext/standard/tests/file/popen_pclose_error-sunos.php on line 11 003- Warning: Wrong parameter count for popen() in %s on line %d 006+ Warning: popen() expects exactly 2 parameters, 1 given in /home/contppw/php/php-5.6.34/ext/standard/tests/file/popen_pclose_error-sunos.php on line 12 006- Warning: Wrong parameter count for popen() in %s on line %d 008- sh: abc.txt: not found 009+ sh: abc.txt: not found 011+ Warning: pclose() expects exactly 1 parameter, 0 given in /home/contppw/php/php-5.6.34/ext/standard/tests/file/popen_pclose_error-sunos.php on line 14 012+ bool(false) 013+ 014+ Warning: pclose() expects exactly 1 parameter, 2 given in /home/contppw/php/php-5.6.34/ext/standard/tests/file/popen_pclose_error-sunos.php on line 16 015+ bool(false) 016+ 017+ Warning: pclose() expects parameter 1 to be resource, integer given in /home/contppw/php/php-5.6.34/ext/standard/tests/file/popen_pclose_error-sunos.php on line 18 018+ bool(false) 011- Warning: Wrong parameter count for pclose() in %s on line %d 012- NULL 014- Warning: Wrong parameter count for pclose() in %s on line %d 015- NULL 016- 017- Warning: pclose(): supplied argument is not a valid stream resource in %s on line %d 018- bool(false) 019- ================================================================================ ================================================================================ /home/contppw/php/php-5.6.34/ext/standard/tests/file/touch_basic.phpt ================================================================================ *** Testing touch() : basic functionality *** --- testing touch creates a file --- bool(true) --- testing touch doesn't alter file contents --- Here is a test line --- testing touch alters the correct file metadata --- stat data differs at atime stat data differs at mtime stat data differs at ctime stat data differs at blocks --- testing touch using all parameters --- bool(true) ctime=1524190078 mtime=10000 atime=20470 Done ================================================================================ 013+ stat data differs at blocks ================================================================================ ================================================================================ /home/contppw/php/php-5.6.34/ext/standard/tests/general_functions/getservbyname_basic.phpt ================================================================================ bool(false) int(21) int(22) int(23) int(143) int(25) int(43) bool(false) int(79) int(110) bool(false) ================================================================================ 001+ bool(false) 008+ bool(false) 009- int(%d) 011+ bool(false) 010- int(%d) 011- int(%d) ================================================================================ ================================================================================ /home/contppw/php/php-5.6.34/ext/standard/tests/general_functions/getservbyport_basic.phpt ================================================================================ ================================================================================ 001+ 001- PASS ================================================================================ ================================================================================ /home/contppw/php/php-5.6.34/ext/standard/tests/general_functions/getservbyport_variation1.phpt ================================================================================ bool(false) bool(false) bool(false) Warning: getservbyport() expects parameter 1 to be long, array given in /home/contppw/php/php-5.6.34/ext/standard/tests/general_functions/getservbyport_variation1.php on line 5 NULL Warning: getservbyport() expects parameter 1 to be long, array given in /home/contppw/php/php-5.6.34/ext/standard/tests/general_functions/getservbyport_variation1.php on line 6 NULL Warning: getservbyport() expects parameter 1 to be long, array given in /home/contppw/php/php-5.6.34/ext/standard/tests/general_functions/getservbyport_variation1.php on line 7 NULL bool(false) bool(false) Warning: getservbyport() expects parameter 1 to be long, object given in /home/contppw/php/php-5.6.34/ext/standard/tests/general_functions/getservbyport_variation1.php on line 10 NULL ================================================================================ 014+ bool(false) 014- string(%d) "%s" ================================================================================ ================================================================================ /home/contppw/php/php-5.6.34/ext/standard/tests/network/ip2long_variation2.phpt ================================================================================ int(16845579) int(2130706433) int(16860999) int(0) int(16863569) int(-1062731776) bool(false) bool(false) ===DONE=== ================================================================================ 001+ int(16845579) 001- bool(false) 003+ int(16860999) 003- bool(false) 005+ int(16863569) 005- bool(false) ================================================================================ ================================================================================ /home/contppw/php/php-5.6.34/ext/standard/tests/serialize/bug64146.phpt ================================================================================ Test 1 1 Done ================================================================================ 003+ 1 003- 2 ================================================================================ ================================================================================ /home/contppw/php/php-5.6.34/ext/standard/tests/streams/glob-wrapper.phpt ================================================================================ ** Opening /home/contppw/php/php-5.6.34/ext/standard/tests/streams Warning: opendir(): open_basedir restriction in effect. File(/home/contppw/php/php-5.6.34/ext/standard/tests/streams) is not within the allowed path(s): (/does_not_exist) in /home/contppw/php/php-5.6.34/ext/standard/tests/streams/glob-wrapper.php on line 5 Warning: opendir(/home/contppw/php/php-5.6.34/ext/standard/tests/streams): failed to open dir: Not owner in /home/contppw/php/php-5.6.34/ext/standard/tests/streams/glob-wrapper.php on line 5 Failed to open /home/contppw/php/php-5.6.34/ext/standard/tests/streams ** Opening glob:///home/contppw/php/php-5.6.34/ext/standard/tests/streams Warning: opendir(): open_basedir restriction in effect. File(/home/contppw/php/php-5.6.34/ext/standard/tests/streams) is not within the allowed path(s): (/does_not_exist) in /home/contppw/php/php-5.6.34/ext/standard/tests/streams/glob-wrapper.php on line 5 Warning: opendir(glob:///home/contppw/php/php-5.6.34/ext/standard/tests/streams): failed to open dir: operation failed in /home/contppw/php/php-5.6.34/ext/standard/tests/streams/glob-wrapper.php on line 5 Failed to open glob:///home/contppw/php/php-5.6.34/ext/standard/tests/streams ================================================================================ 005+ Warning: opendir(/home/contppw/php/php-5.6.34/ext/standard/tests/streams): failed to open dir: Not owner in /home/contppw/php/php-5.6.34/ext/standard/tests/streams/glob-wrapper.php on line 5 005- Warning: opendir(%s): failed to open dir: Operation not permitted in %s%eglob-wrapper.php on line 5 ================================================================================ ================================================================================ /home/contppw/php/php-5.6.34/ext/standard/tests/strings/setlocale_basic1.phpt ================================================================================ *** Testing setlocale() : basic functionality - set to a specific locale *** Setting system locale(LC_ALL) to Checking currency settings in the new locale, expected: EUR, Found: Test FAILED. Done ================================================================================ 003+ Test FAILED. 003- string(%d) %s 004- Checking currency settings in the new locale, expected: %s, Found: %s 005- Test PASSED. ================================================================================ ================================================================================ /home/contppw/php/php-5.6.34/ext/standard/tests/strings/setlocale_basic2.phpt ================================================================================ *** Testing setlocale() with an array containing list of locales *** -- Testing setlocale() : 'category' argument as LC_ALL & 'locale' argument as an array -- Test FAILED. Done ================================================================================ 003+ Test FAILED. 003- string(%d) "%s" 004- Checking currency settings in the new locale, expected: %s, Found: %s 005- Test PASSED. ================================================================================ ================================================================================ /home/contppw/php/php-5.6.34/ext/standard/tests/strings/setlocale_basic3.phpt ================================================================================ *** Testing setlocale() by passing multiple locales as argument *** Done ================================================================================ 002- -- Testing setlocale() by giving 'category' as LC_ALL & multiple locales(en_US.utf8, Ko_KR.utf8, zh_CN.utf8) -- 003- string(%d) "%s" 004- Checking currency settings in the new locale, expected: %s, Found: %s 005- Test PASSED. ================================================================================ ================================================================================ /home/contppw/php/php-5.6.34/ext/standard/tests/strings/setlocale_variation1.phpt ================================================================================ *** Testing setlocale() by passing multiple valid/invalid locales as argument *** Done ================================================================================ 002- -- Testing setlocale() by giving 'category' as LC_ALL & multiple locales(en_US.invalid, en_US.utf8, Ko_KR.utf8, KO_KR.invalid, zh_CN.utf8) -- 003- string(%d) "%s" 004- Checking currency settings in the new locale, expected: %s, Found: %s 005- Test PASSED. ================================================================================ ================================================================================ /home/contppw/php/php-5.6.34/ext/standard/tests/strings/setlocale_variation3.phpt ================================================================================ *** Testing setlocale() : usage variations - setting system locale = 0 *** Locale info, before setting the locale array(18) { ["decimal_point"]=> string(1) "." ["thousands_sep"]=> string(1) "," ["int_curr_symbol"]=> string(4) "USD " ["currency_symbol"]=> string(1) "$" ["mon_decimal_point"]=> string(1) "." ["mon_thousands_sep"]=> string(1) "," ["positive_sign"]=> string(0) "" ["negative_sign"]=> string(1) "-" ["int_frac_digits"]=> int(2) ["frac_digits"]=> int(2) ["p_cs_precedes"]=> int(1) ["p_sep_by_space"]=> int(0) ["n_cs_precedes"]=> int(1) ["n_sep_by_space"]=> int(0) ["p_sign_posn"]=> int(1) ["n_sign_posn"]=> int(1) ["grouping"]=> array(1) { [0]=> int(3) } ["mon_grouping"]=> array(1) { [0]=> int(3) } } Setting system locale, category = LC_ALL and locale = 0 Locale info, after setting the locale array(18) { ["decimal_point"]=> string(1) "." ["thousands_sep"]=> string(1) "," ["int_curr_symbol"]=> string(4) "USD " ["currency_symbol"]=> string(1) "$" ["mon_decimal_point"]=> string(1) "." ["mon_thousands_sep"]=> string(1) "," ["positive_sign"]=> string(0) "" ["negative_sign"]=> string(1) "-" ["int_frac_digits"]=> int(2) ["frac_digits"]=> int(2) ["p_cs_precedes"]=> int(1) ["p_sep_by_space"]=> int(0) ["n_cs_precedes"]=> int(1) ["n_sep_by_space"]=> int(0) ["p_sign_posn"]=> int(1) ["n_sign_posn"]=> int(1) ["grouping"]=> array(1) { [0]=> int(3) } ["mon_grouping"]=> array(1) { [0]=> int(3) } } Checking locale in the system, Expected : no change in the existing locale Test PASSED. Done ================================================================================ 037+ array(1) { 037- array(2) { 040+ } 041+ ["mon_grouping"]=> 042+ array(1) { 043+ [0]=> 040- [1]=> 043- ["mon_grouping"]=> 044- array(2) { 045- [0]=> 046- int(3) 047- [1]=> 048- int(3) 049- } 050- } 051- Setting system locale, category = LC_ALL and locale = 0 052- Locale info, after setting the locale 053- array(18) { 054- ["decimal_point"]=> 055- string(1) "." 056- ["thousands_sep"]=> 046+ } 047+ Setting system locale, category = LC_ALL and locale = 0 048+ Locale info, after setting the locale 049+ array(18) { 050+ ["decimal_point"]=> 051+ string(1) "." 052+ ["thousands_sep"]=> 053+ string(1) "," 054+ ["int_curr_symbol"]=> 055+ string(4) "USD " 056+ ["currency_symbol"]=> 057+ string(1) "$" 058+ ["mon_decimal_point"]=> 059+ string(1) "." 060+ ["mon_thousands_sep"]=> 058- ["int_curr_symbol"]=> 059- string(4) "USD " 060- ["currency_symbol"]=> 061- string(1) "$" 062- ["mon_decimal_point"]=> 063- string(1) "." 064- ["mon_thousands_sep"]=> 065- string(1) "," 066- ["positive_sign"]=> 067- string(0) "" 068- ["negative_sign"]=> 069- string(1) "-" 070- ["int_frac_digits"]=> 062+ ["positive_sign"]=> 063+ string(0) "" 064+ ["negative_sign"]=> 065+ string(1) "-" 066+ ["int_frac_digits"]=> 067+ int(2) 068+ ["frac_digits"]=> 072- ["frac_digits"]=> 073- int(2) 083+ array(1) { 086+ } 087+ ["mon_grouping"]=> 088+ array(1) { 089+ [0]=> 087- array(2) { 090- [1]=> 092+ } 093+ Checking locale in the system, Expected : no change in the existing locale 094+ Test PASSED. 095+ Done 093- ["mon_grouping"]=> 094- array(2) { 095- [0]=> 096- int(3) 097- [1]=> 098- int(3) 099- } 100- } 101- Checking locale in the system, Expected : no change in the existing locale 102- Test PASSED. 103- Done ================================================================================ ================================================================================ /home/contppw/php/php-5.6.34/ext/standard/tests/strings/strrchr_variation5.phpt ================================================================================ *** Testing strrchr() function: with heredoc strings *** string(32) " st ch using escape \seque ce" string(9) "\seque ce" string(24) " using escape \seque ce" string(9) "\seque ce" string(32) " st ch using escape \seque ce" *** Done *** ================================================================================ 003+ escape \seque 003- scape \seque 008+ escape \seque 008- scape \seque 013+ escape \seque 013- scape \seque ================================================================================ ================================================================================ /home/contppw/php/php-5.6.34/ext/standard/tests/strings/strspn_variation6.phpt ================================================================================ *** Testing strspn() : with different mask strings *** -- Iteration 1 -- int(0) int(0) int(0) int(0) int(0) int(0) int(0) int(0) int(0) int(0) -- Iteration 2 -- int(0) int(0) int(2) int(0) int(0) int(0) int(0) int(0) int(0) int(0) -- Iteration 3 -- int(0) int(0) int(8) int(11) int(0) int(0) int(0) int(1) int(0) int(2) -- Iteration 4 -- int(0) int(0) int(4) int(4) int(0) int(0) int(0) int(4) int(0) int(4) -- Iteration 5 -- int(0) int(0) int(4) int(4) int(0) int(0) int(0) int(4) int(0) int(4) -- Iteration 6 -- int(0) int(0) int(4) int(4) int(0) int(0) int(0) int(4) int(0) int(4) -- Iteration 7 -- int(0) int(0) int(4) int(4) int(0) int(0) int(0) int(4) int(0) int(4) Done ================================================================================ 047+ int(4) 047- int(1) 059+ int(4) 059- int(1) 071+ int(4) 071- int(1) 083+ int(4) 083- int(1) ================================================================================ ================================================================================ /home/contppw/php/php-5.6.34/ext/standard/tests/time/strptime_basic.phpt ================================================================================ *** Testing strptime() : basic functionality *** array(9) { ["tm_sec"]=> int(0) ["tm_min"]=> int(0) ["tm_hour"]=> int(10) ["tm_mday"]=> int(2) ["tm_mon"]=> int(6) ["tm_year"]=> int(63) ["tm_wday"]=> int(0) ["tm_yday"]=> int(0) ["unparsed"]=> string(5) " AEST" } array(9) { ["tm_sec"]=> int(0) ["tm_min"]=> int(0) ["tm_hour"]=> int(10) ["tm_mday"]=> int(2) ["tm_mon"]=> int(6) ["tm_year"]=> int(163) ["tm_wday"]=> int(0) ["tm_yday"]=> int(0) ["unparsed"]=> string(0) "" } array(9) { ["tm_sec"]=> int(0) ["tm_min"]=> int(0) ["tm_hour"]=> int(10) ["tm_mday"]=> int(2) ["tm_mon"]=> int(6) ["tm_year"]=> int(0) ["tm_wday"]=> int(2) ["tm_yday"]=> int(0) ["unparsed"]=> string(0) "" } ===DONE=== ================================================================================ 016+ int(0) 016- int(2) 018+ int(0) 018- int(182) 020+ string(5) " AEST" 020- string(4) " GMT" 036+ int(0) 036- int(1) 038+ int(0) 038- int(182) 058+ int(0) 058- int(182) ================================================================================ ================================================================================ /home/contppw/php/php-5.6.34/ext/xmlreader/tests/bug64230.phpt ================================================================================ Test Internal errors TRUE Internal: Specification mandates value for attribute att Internal errors FALSE Warning: XMLReader::read(): /home/contppw/php/php-5.6.34/:1: parser error : Specification mandates value for attribute att in /home/contppw/php/php-5.6.34/ext/xmlreader/tests/bug64230.php on line 25 Warning: XMLReader::read(): <root att/> in /home/contppw/php/php-5.6.34/ext/xmlreader/tests/bug64230.php on line 25 Warning: XMLReader::read(): ^ in /home/contppw/php/php-5.6.34/ext/xmlreader/tests/bug64230.php on line 25 Done ================================================================================ 003+ Internal: Specification mandates value for attribute att 003- Internal: Specification mandate value for attribute att 007+ Warning: XMLReader::read(): /home/contppw/php/php-5.6.34/:1: parser error : Specification mandates value for attribute att in /home/contppw/php/php-5.6.34/ext/xmlreader/tests/bug64230.php on line 25 007- Warning: XMLReader::read(): %s: parser error : Specification mandate value for attribute att in %s on line %d ================================================================================ ================================================================================ /home/contppw/php/php-5.6.34/sapi/cli/tests/cli_process_title_unix.phpt ================================================================================ *** Testing setting the process title *** Successfully set title usage: tail [+/-[n][lbc][f]] [file] tail [+/-[n][l][r|f]] [file] ps failed ps: unknown output format: -o command usage: ps [ -aAdefHlcjLPyZ ] [ -o format ] [ -t termlist ] [ -u userlist ] [ -U userlist ] [ -G grouplist ] [ -p proclist ] [ -g pgrplist ] [ -s sidlist ] [ -z zonelist ] [-h lgrplist] 'format' is one or more of: user ruser group rgroup uid ruid gid rgid pid ppid pgid sid taskid ctid pri opri pcpu pmem vsz rss rssprivate rssshared osz nice class time etime stime zone zoneid env f s c lwp nlwp psr tty addr wchan fname comm args projid project pset lgrp ================================================================================ 003+ usage: tail [+/-[n][lbc][f]] [file] 004+ tail [+/-[n][l][r|f]] [file] 003- Successfully verified title using ps 004- Successfully verified title using get 005+ ps failed 006+ ps: unknown output format: -o command 007+ usage: ps [ -aAdefHlcjLPyZ ] [ -o format ] [ -t termlist ] 008+ [ -u userlist ] [ -U userlist ] [ -G grouplist ] 009+ [ -p proclist ] [ -g pgrplist ] [ -s sidlist ] [ -z zonelist ] [-h lgrplist] 010+ 'format' is one or more of: 011+ user ruser group rgroup uid ruid gid rgid pid ppid pgid sid taskid ctid 012+ pri opri pcpu pmem vsz rss rssprivate rssshared osz nice class time etime stime zone zoneid env 013+ f s c lwp nlwp psr tty addr wchan fname comm args projid project pset lgrp ================================================================================ ================================================================================ BUILD ENVIRONMENT ================================================================================ OS: SunOS - SunOS lasunPPW 5.11 11.3 sun4v Autoconf: Bundled Libtool: ltmain.sh (GNU libtool) 1.5.26 (1.1220.2.492 2008/01/30 06:40:56) Copyright (C) 2008 Free Software Foundation, Inc. This is free software; see the source for copying conditions. There is NO warranty; not even for MERCHANTABILITY or FITNESS FOR A PARTICULAR PURPOSE. System Libtool: N/A Compiler: cc: Studio 12.6 Sun C 5.15 SunOS_sparc 2017/05/30 Bison: Libraries: libresolv.so.2 => /usr/lib/libresolv.so.2 libpq.so.5 => /app/postgres/9.3-pgdg/lib/libpq.so.5 librt.so.1 => /usr/lib/librt.so.1 libz.so.1 => /usr/lib/libz.so.1 libm.so.2 => /usr/lib/libm.so.2 libnsl.so.1 => /usr/lib/libnsl.so.1 libsocket.so.1 => /usr/lib/libsocket.so.1 libxml2.so.2 => /usr/lib/libxml2.so.2 libc.so.1 => /usr/lib/libc.so.1 libucrypto.so.1 => /usr/lib/libucrypto.so.1 libssl.so.1.0.0 => /usr/lib/libssl.so.1.0.0 libcrypto.so.1.0.0 => /usr/lib/libcrypto.so.1.0.0 libgss.so.1 => /usr/lib/libgss.so.1 libpthread.so.1 => /usr/lib/libpthread.so.1 libmp.so.2 => /usr/lib/libmp.so.2 libelf.so.1 => /usr/lib/libelf.so.1 libcryptoutil.so.1 => /usr/lib/libcryptoutil.so.1 libgssapi_krb5.so.2.2 => /usr/lib/libgssapi_krb5.so.2.2 libkrb5.so.3 => /usr/lib/libkrb5.so.3 libk5crypto.so.3 => /usr/lib/libk5crypto.so.3 libcom_err.so.3 => /usr/lib/libcom_err.so.3 libkwarn.so.1 => /usr/lib/libkwarn.so.1 libkrb5support.so.0 => /usr/lib/libkrb5support.so.0 libgsscred.so.1 => /usr/lib/libgsscred.so.1 ================================================================================ PHPINFO ================================================================================ phpinfo() PHP Version => 5.6.34 System => SunOS lasunPPW 5.11 11.3 sun4v Build Date => Apr 20 2018 10:35:31 Configure Command => './configure' '--with-config-file-path=/etc/php/5.6' '--with-zlib' '--with-apxs2=/usr/apache2/2.4/bin/apxs' '-enable-bcmath=shared' '--with-bz2=shared' '--enable-calendar=shared' '--with-curl=shared' '--with-gd=shared' '--with-ldap=shared' '-with-pcre-dir=/usr' '--sysconfdir=/etc/php/5.6' '--localstatedir=/var/php/5.6' '--with-pear=/var/php/5.6/pear' '--with-pgsql=/app/postgres/9.3-pgdg/bin' Server API => Command Line Interface Virtual Directory Support => enabled Configuration File (php.ini) Path => /etc/php/5.6 Loaded Configuration File => (none) Scan this dir for additional .ini files => (none) Additional .ini files parsed => (none) PHP API => 20131106 PHP Extension => 20131226 Zend Extension => 220131226 Zend Extension Build => API220131226,TS PHP Extension Build => API20131226,TS Debug Build => no Thread Safety => enabled Zend Signal Handling => disabled Zend Memory Manager => enabled Zend Multibyte Support => disabled IPv6 Support => enabled DTrace Support => disabled Registered PHP Streams => compress.zlib, php, file, glob, data, http, ftp, phar Registered Stream Socket Transports => tcp, udp, unix, udg Registered Stream Filters => zlib.*, convert.iconv.*, string.rot13, string.toupper, string.tolower, string.strip_tags, convert.*, consumed, dechunk This program makes use of the Zend Scripting Language Engine: Zend Engine v2.6.0, Copyright (c) 1998-2016 Zend Technologies _______________________________________________________________________ Configuration Core PHP Version => 5.6.34 Directive => Local Value => Master Value allow_url_fopen => On => On allow_url_include => Off => Off always_populate_raw_post_data => 0 => 0 arg_separator.input => & => & arg_separator.output => & => & asp_tags => Off => Off auto_append_file => no value => no value auto_globals_jit => On => On auto_prepend_file => no value => no value browscap => no value => no value default_charset => UTF-8 => UTF-8 default_mimetype => text/html => text/html disable_classes => no value => no value disable_functions => no value => no value display_errors => STDERR => STDERR display_startup_errors => Off => Off doc_root => no value => no value docref_ext => no value => no value docref_root => no value => no value enable_dl => On => On enable_post_data_reading => On => On error_append_string => no value => no value error_log => no value => no value error_prepend_string => no value => no value error_reporting => no value => no value exit_on_timeout => Off => Off expose_php => On => On extension_dir => /usr/local/lib/php/extensions/no-debug-zts-20131226 => /usr/local/lib/php/extensions/no-debug-zts-20131226 file_uploads => On => On highlight.comment => <font style="color: #FF8000">#FF8000</font> => <font style="color: #FF8000">#FF8000</font> highlight.default => <font style="color: #0000BB">#0000BB</font> => <font style="color: #0000BB">#0000BB</font> highlight.html => <font style="color: #000000">#000000</font> => <font style="color: #000000">#000000</font> highlight.keyword => <font style="color: #007700">#007700</font> => <font style="color: #007700">#007700</font> highlight.string => <font style="color: #DD0000">#DD0000</font> => <font style="color: #DD0000">#DD0000</font> html_errors => Off => Off ignore_repeated_errors => Off => Off ignore_repeated_source => Off => Off ignore_user_abort => Off => Off implicit_flush => On => On include_path => .:/var/php/5.6/pear => .:/var/php/5.6/pear input_encoding => no value => no value internal_encoding => no value => no value log_errors => Off => Off log_errors_max_len => 1024 => 1024 mail.add_x_header => Off => Off mail.force_extra_parameters => no value => no value mail.log => no value => no value max_execution_time => 0 => 0 max_file_uploads => 20 => 20 max_input_nesting_level => 64 => 64 max_input_time => -1 => -1 max_input_vars => 1000 => 1000 memory_limit => 128M => 128M open_basedir => no value => no value output_buffering => 0 => 0 output_encoding => no value => no value output_handler => no value => no value post_max_size => 8M => 8M precision => 14 => 14 realpath_cache_size => 16K => 16K realpath_cache_ttl => 120 => 120 register_argc_argv => On => On report_memleaks => On => On report_zend_debug => Off => Off request_order => no value => no value sendmail_from => no value => no value sendmail_path => /usr/sbin/sendmail -t -i => /usr/sbin/sendmail -t -i serialize_precision => 17 => 17 short_open_tag => On => On SMTP => localhost => localhost smtp_port => 25 => 25 sql.safe_mode => Off => Off sys_temp_dir => no value => no value track_errors => Off => Off unserialize_callback_func => no value => no value upload_max_filesize => 2M => 2M upload_tmp_dir => no value => no value user_dir => no value => no value user_ini.cache_ttl => 300 => 300 user_ini.filename => .user.ini => .user.ini variables_order => EGPCS => EGPCS xmlrpc_error_number => 0 => 0 xmlrpc_errors => Off => Off zend.detect_unicode => On => On zend.enable_gc => On => On zend.multibyte => Off => Off zend.script_encoding => no value => no value ctype ctype functions => enabled date date/time support => enabled "Olson" Timezone Database Version => 2016.10 Timezone Database => internal Default timezone => UTC Directive => Local Value => Master Value date.default_latitude => 31.7667 => 31.7667 date.default_longitude => 35.2333 => 35.2333 date.sunrise_zenith => 90.583333 => 90.583333 date.sunset_zenith => 90.583333 => 90.583333 date.timezone => no value => no value dom DOM/XML => enabled DOM/XML API Version => 20031129 libxml Version => 2.9.5 HTML Support => enabled XPath Support => enabled XPointer Support => enabled Schema Support => enabled RelaxNG Support => enabled ereg Regex Library => Bundled library enabled fileinfo fileinfo support => enabled version => 1.0.5 libmagic => 517 filter Input Validation and Filtering => enabled Revision => $Id: 5b79667bd9a68977a9b4f7505223a8e216e04908 $ Directive => Local Value => Master Value filter.default => unsafe_raw => unsafe_raw filter.default_flags => no value => no value hash hash support => enabled Hashing Engines => md2 md4 md5 sha1 sha224 sha256 sha384 sha512 ripemd128 ripemd160 ripemd256 ripemd320 whirlpool tiger128,3 tiger160,3 tiger192,3 tiger128,4 tiger160,4 tiger192,4 snefru snefru256 gost gost-crypto adler32 crc32 crc32b fnv132 fnv1a32 fnv164 fnv1a64 joaat haval128,3 haval160,3 haval192,3 haval224,3 haval256,3 haval128,4 haval160,4 haval192,4 haval224,4 haval256,4 haval128,5 haval160,5 haval192,5 haval224,5 haval256,5 iconv iconv support => enabled iconv implementation => unknown iconv library version => unknown Directive => Local Value => Master Value iconv.input_encoding => no value => no value iconv.internal_encoding => no value => no value iconv.output_encoding => no value => no value json json support => enabled json version => 1.2.1 libxml libXML support => active libXML Compiled Version => 2.9.5 libXML Loaded Version => 20905 libXML streams => enabled pcre PCRE (Perl Compatible Regular Expressions) Support => enabled PCRE Library Version => 8.38 2015-11-23 Directive => Local Value => Master Value pcre.backtrack_limit => 1000000 => 1000000 pcre.recursion_limit => 100000 => 100000 PDO PDO support => enabled PDO drivers => sqlite pdo_sqlite PDO Driver for SQLite 3.x => enabled SQLite Library => 3.8.10.2 pgsql PostgreSQL Support => enabled PostgreSQL(libpq) Version => 9.3.5 PostgreSQL(libpq) => PostgreSQL 9.3.5 on sparc-sun-solaris2.11, compiled by cc: Sun C 5.8 Patch 121015-04 2007/01/10, 32-bit Multibyte character support => enabled SSL support => enabled Active Persistent Links => 0 Active Links => 0 Directive => Local Value => Master Value pgsql.allow_persistent => On => On pgsql.auto_reset_persistent => Off => Off pgsql.ignore_notice => Off => Off pgsql.log_notice => Off => Off pgsql.max_links => Unlimited => Unlimited pgsql.max_persistent => Unlimited => Unlimited Phar Phar: PHP Archive support => enabled Phar EXT version => 2.0.2 Phar API version => 1.1.1 SVN revision => $Id: 780be432570e80dd34c1a9c217ef87ade22bf136 $ Phar-based phar archives => enabled Tar-based phar archives => enabled ZIP-based phar archives => enabled gzip compression => enabled bzip2 compression => disabled (install pecl/bz2) OpenSSL support => disabled (install ext/openssl) Phar based on pear/PHP_Archive, original concept by Davey Shafik. Phar fully realized by Gregory Beaver and Marcus Boerger. Portions of tar implementation Copyright (c) 2003-2009 Tim Kientzle. Directive => Local Value => Master Value phar.cache_list => no value => no value phar.readonly => On => On phar.require_hash => On => On posix Revision => $Id: 5f4acc20904b1406142f2a0ede068db048c77e77 $ Reflection Reflection => enabled Version => $Id: 5f15287237d5f78d75b19c26915aa7bd83dee8b8 $ session Session Support => enabled Registered save handlers => files user Registered serializer handlers => php_serialize php php_binary Directive => Local Value => Master Value session.auto_start => Off => Off session.cache_expire => 180 => 180 session.cache_limiter => nocache => nocache session.cookie_domain => no value => no value session.cookie_httponly => Off => Off session.cookie_lifetime => 0 => 0 session.cookie_path => / => / session.cookie_secure => Off => Off session.entropy_file => /dev/urandom => /dev/urandom session.entropy_length => 32 => 32 session.gc_divisor => 100 => 100 session.gc_maxlifetime => 1440 => 1440 session.gc_probability => 1 => 1 session.hash_bits_per_character => 4 => 4 session.hash_function => 0 => 0 session.name => PHPSESSID => PHPSESSID session.referer_check => no value => no value session.save_handler => files => files session.save_path => no value => no value session.serialize_handler => php => php session.upload_progress.cleanup => On => On session.upload_progress.enabled => On => On session.upload_progress.freq => 1% => 1% session.upload_progress.min_freq => 1 => 1 session.upload_progress.name => PHP_SESSION_UPLOAD_PROGRESS => PHP_SESSION_UPLOAD_PROGRESS session.upload_progress.prefix => upload_progress_ => upload_progress_ session.use_cookies => On => On session.use_only_cookies => On => On session.use_strict_mode => Off => Off session.use_trans_sid => 0 => 0 SimpleXML Simplexml support => enabled Revision => $Id: d7077fc935154236afb4fe70814ba358efdbdca4 $ Schema support => enabled SPL SPL support => enabled Interfaces => Countable, OuterIterator, RecursiveIterator, SeekableIterator, SplObserver, SplSubject Classes => AppendIterator, ArrayIterator, ArrayObject, BadFunctionCallException, BadMethodCallException, CachingIterator, CallbackFilterIterator, DirectoryIterator, DomainException, EmptyIterator, FilesystemIterator, FilterIterator, GlobIterator, InfiniteIterator, InvalidArgumentException, IteratorIterator, LengthException, LimitIterator, LogicException, MultipleIterator, NoRewindIterator, OutOfBoundsException, OutOfRangeException, OverflowException, ParentIterator, RangeException, RecursiveArrayIterator, RecursiveCachingIterator, RecursiveCallbackFilterIterator, RecursiveDirectoryIterator, RecursiveFilterIterator, RecursiveIteratorIterator, RecursiveRegexIterator, RecursiveTreeIterator, RegexIterator, RuntimeException, SplDoublyLinkedList, SplFileInfo, SplFileObject, SplFixedArray, SplHeap, SplMinHeap, SplMaxHeap, SplObjectStorage, SplPriorityQueue, SplQueue, SplStack, SplTempFileObject, UnderflowException, UnexpectedValueException sqlite3 SQLite3 support => enabled SQLite3 module version => 0.7-dev SQLite Library => 3.8.10.2 Directive => Local Value => Master Value sqlite3.extension_dir => no value => no value standard Dynamic Library Support => enabled Path to sendmail => /usr/sbin/sendmail -t -i Directive => Local Value => Master Value assert.active => 1 => 1 assert.bail => 0 => 0 assert.callback => no value => no value assert.quiet_eval => 0 => 0 assert.warning => 1 => 1 auto_detect_line_endings => 0 => 0 default_socket_timeout => 60 => 60 from => no value => no value url_rewriter.tags => a=href,area=href,frame=src,form=,fieldset= => a=href,area=href,frame=src,form=,fieldset= user_agent => no value => no value tokenizer Tokenizer Support => enabled xml XML Support => active XML Namespace Support => active libxml2 Version => 2.9.5 xmlreader XMLReader => enabled xmlwriter XMLWriter => enabled zlib ZLib Support => enabled Stream Wrapper => compress.zlib:// Stream Filter => zlib.inflate, zlib.deflate Compiled Version => 1.2.11 Linked Version => 1.2.11 Directive => Local Value => Master Value zlib.output_compression => Off => Off zlib.output_compression_level => -1 => -1 zlib.output_handler => no value => no value Additional Modules Module Name Environment Variable => Value _ => /home/contppw/php/php-5.6.34/sapi/cli/php LANG => en_US.UTF-8 HZ => LC_MONETARY => PAGER => /usr/bin/less -ins LC_TIME => SSH_TTY => deleted PATH => /usr/bin:/usr/sbin:/opt/developerstudio12.6/bin:/app/postgres/9.3-pgdg/bin/64:/usr/sbin:/usr/bin OLDPWD => /home/contppw/php/php-5.6.34 LC_ALL => SSH_AUTH_SOCK => deleted _AST_FEATURES => UNIVERSE - att LOGNAME => root MAKEFLAGS => MAIL => /var/mail/root PS2 => > SHLVL => 2 LC_MESSAGES => LC_CTYPE => CC => cc MAKELEVEL => 1 TEST_PHP_EXECUTABLE => /home/contppw/php/php-5.6.34/sapi/cli/php SHELL => /usr/bin/bash VIRTUAL_ROOT => / HOME => /root LC_COLLATE => SGS_SUPPORT => libmakestate.so.1 LC_NUMERIC => TEST_PHP_SRCDIR => /home/contppw/php/php-5.6.34 SSH_CLIENT => deleted SSH_CONNECTION => deleted TERM => xterm-256color PWD => /home/contppw/php/php-5.6.34 TZ => localtime A__z => "*SHLVL PHP Variables Variable => Value _SERVER["_"] => /home/contppw/php/php-5.6.34/sapi/cli/php _SERVER["LANG"] => en_US.UTF-8 _SERVER["HZ"] => _SERVER["LC_MONETARY"] => _SERVER["PAGER"] => /usr/bin/less -ins _SERVER["LC_TIME"] => _SERVER["SSH_TTY"] => deleted _SERVER["PATH"] => /usr/bin:/usr/sbin:/opt/developerstudio12.6/bin:/app/postgres/9.3-pgdg/bin/64:/usr/sbin:/usr/bin _SERVER["OLDPWD"] => /home/contppw/php/php-5.6.34 _SERVER["LC_ALL"] => _SERVER["SSH_AUTH_SOCK"] => deleted _SERVER["_AST_FEATURES"] => UNIVERSE - att _SERVER["LOGNAME"] => root _SERVER["MAKEFLAGS"] => _SERVER["MAIL"] => /var/mail/root _SERVER["PS2"] => > _SERVER["SHLVL"] => 2 _SERVER["LC_MESSAGES"] => _SERVER["LC_CTYPE"] => _SERVER["CC"] => cc _SERVER["MAKELEVEL"] => 1 _SERVER["TEST_PHP_EXECUTABLE"] => /home/contppw/php/php-5.6.34/sapi/cli/php _SERVER["SHELL"] => /usr/bin/bash _SERVER["VIRTUAL_ROOT"] => / _SERVER["HOME"] => /root _SERVER["LC_COLLATE"] => _SERVER["SGS_SUPPORT"] => libmakestate.so.1 _SERVER["LC_NUMERIC"] => _SERVER["TEST_PHP_SRCDIR"] => /home/contppw/php/php-5.6.34 _SERVER["SSH_CLIENT"] => deleted _SERVER["SSH_CONNECTION"] => deleted _SERVER["TERM"] => xterm-256color _SERVER["PWD"] => /home/contppw/php/php-5.6.34 _SERVER["TZ"] => localtime _SERVER["A__z"] => "*SHLVL _SERVER["PHP_SELF"] => _SERVER["SCRIPT_NAME"] => _SERVER["SCRIPT_FILENAME"] => _SERVER["PATH_TRANSLATED"] => _SERVER["DOCUMENT_ROOT"] => _SERVER["REQUEST_TIME_FLOAT"] => 1524197728.8235 _SERVER["REQUEST_TIME"] => 1524197728 _SERVER["argv"] => Array ( ) _SERVER["argc"] => 0 _ENV["_"] => /home/contppw/php/php-5.6.34/sapi/cli/php _ENV["LANG"] => en_US.UTF-8 _ENV["HZ"] => _ENV["LC_MONETARY"] => _ENV["PAGER"] => /usr/bin/less -ins _ENV["LC_TIME"] => _ENV["SSH_TTY"] => deleted _ENV["PATH"] => /usr/bin:/usr/sbin:/opt/developerstudio12.6/bin:/app/postgres/9.3-pgdg/bin/64:/usr/sbin:/usr/bin _ENV["OLDPWD"] => /home/contppw/php/php-5.6.34 _ENV["LC_ALL"] => _ENV["SSH_AUTH_SOCK"] => deleted _ENV["_AST_FEATURES"] => UNIVERSE - att _ENV["LOGNAME"] => root _ENV["MAKEFLAGS"] => _ENV["MAIL"] => /var/mail/root _ENV["PS2"] => > _ENV["SHLVL"] => 2 _ENV["LC_MESSAGES"] => _ENV["LC_CTYPE"] => _ENV["CC"] => cc _ENV["MAKELEVEL"] => 1 _ENV["TEST_PHP_EXECUTABLE"] => /home/contppw/php/php-5.6.34/sapi/cli/php _ENV["SHELL"] => /usr/bin/bash _ENV["VIRTUAL_ROOT"] => / _ENV["HOME"] => /root _ENV["LC_COLLATE"] => _ENV["SGS_SUPPORT"] => libmakestate.so.1 _ENV["LC_NUMERIC"] => _ENV["TEST_PHP_SRCDIR"] => /home/contppw/php/php-5.6.34 _ENV["SSH_CLIENT"] => deleted _ENV["SSH_CONNECTION"] => deleted _ENV["TERM"] => xterm-256color _ENV["PWD"] => /home/contppw/php/php-5.6.34 _ENV["TZ"] => localtime _ENV["A__z"] => "*SHLVL PHP License This program is free software; you can redistribute it and/or modify it under the terms of the PHP License as published by the PHP Group and included in the distribution in the file: LICENSE This program is distributed in the hope that it will be useful, but WITHOUT ANY WARRANTY; without even the implied warranty of MERCHANTABILITY or FITNESS FOR A PARTICULAR PURPOSE. If you did not receive a copy of the PHP license, or have any questions about PHP licensing, please contact license@php.net.
« previous php.qa.reports (#33988) next »