Error report

From: Date: Mon, 14 May 2018 20:28:30 +0000
Subject: Error report
Groups: php.qa.reports 
Request: Send a blank email to php-qa-reports+get-33991@lists.php.net to get a copy of this message
Les Gondor APPLICATIONS ANALYST P : 905-470-3093 F : 905-946-1900 lgondor@e-sonic.com<mailto:lgondor@e-sonic.com> [cid:image002.png@01D21E4C.71B23D60] www.e-sonic.com<http://www.e-sonic.com/>

===================================================================== EXPECTED FAILED TEST SUMMARY --------------------------------------------------------------------- Test open_basedir configuration [tests/security/open_basedir_linkinfo.phpt] XFAIL REASON: BUG: open_basedir cannot delete symlink to prohibited file. See also bugs 48111 and 52176. Inconsistencies when accessing protected members [Zend/tests/access_modifiers_008.phpt] XFAIL REASON: Discussion: http://marc.info/?l=php-internals&m=120221184420957&w=2 Inconsistencies when accessing protected members - 2 [Zend/tests/access_modifiers_009.phpt] XFAIL REASON: Discussion: http://marc.info/?l=php-internals&m=120221184420957&w=2 Bug #48770 (call_user_func_array() fails to call parent from inheriting class) [Zend/tests/bug48770.phpt] XFAIL REASON: See Bug #48770 Bug #48770 (call_user_func_array() fails to call parent from inheriting class) [Zend/tests/bug48770_2.phpt] XFAIL REASON: See Bug #48770 Bug #48770 (call_user_func_array() fails to call parent from inheriting class) [Zend/tests/bug48770_3.phpt] XFAIL REASON: See Bug #48770 Initial value of static var in method depends on the include time of the class definition [Zend/tests/method_static_var.phpt] XFAIL REASON: Maybe not a bug DateTime::add() -- fall type2 type3 [ext/date/tests/DateTime_add-fall-type2-type3.phpt] XFAIL REASON: Various bugs exist DateTime::add() -- fall type3 type2 [ext/date/tests/DateTime_add-fall-type3-type2.phpt] XFAIL REASON: Various bugs exist DateTime::add() -- fall type3 type3 [ext/date/tests/DateTime_add-fall-type3-type3.phpt] XFAIL REASON: Various bugs exist DateTime::add() -- spring type2 type3 [ext/date/tests/DateTime_add-spring-type2-type3.phpt] XFAIL REASON: Various bugs exist DateTime::add() -- spring type3 type2 [ext/date/tests/DateTime_add-spring-type3-type2.phpt] XFAIL REASON: Various bugs exist DateTime::add() -- spring type3 type3 [ext/date/tests/DateTime_add-spring-type3-type3.phpt] XFAIL REASON: Various bugs exist DateTime::diff() -- fall type2 type3 [ext/date/tests/DateTime_diff-fall-type2-type3.phpt] XFAIL REASON: Various bugs exist DateTime::diff() -- fall type3 type2 [ext/date/tests/DateTime_diff-fall-type3-type2.phpt] XFAIL REASON: Various bugs exist DateTime::diff() -- fall type3 type3 [ext/date/tests/DateTime_diff-fall-type3-type3.phpt] XFAIL REASON: Various bugs exist DateTime::diff() -- spring type2 type3 [ext/date/tests/DateTime_diff-spring-type2-type3.phpt] XFAIL REASON: Various bugs exist DateTime::diff() -- spring type3 type2 [ext/date/tests/DateTime_diff-spring-type3-type2.phpt] XFAIL REASON: Various bugs exist DateTime::diff() -- spring type3 type3 [ext/date/tests/DateTime_diff-spring-type3-type3.phpt] XFAIL REASON: Various bugs exist DateTime::sub() -- fall type2 type3 [ext/date/tests/DateTime_sub-fall-type2-type3.phpt] XFAIL REASON: Various bugs exist DateTime::sub() -- fall type3 type2 [ext/date/tests/DateTime_sub-fall-type3-type2.phpt] XFAIL REASON: Various bugs exist DateTime::sub() -- fall type3 type3 [ext/date/tests/DateTime_sub-fall-type3-type3.phpt] XFAIL REASON: Various bugs exist DateTime::sub() -- spring type2 type3 [ext/date/tests/DateTime_sub-spring-type2-type3.phpt] XFAIL REASON: Various bugs exist DateTime::sub() -- spring type3 type2 [ext/date/tests/DateTime_sub-spring-type3-type2.phpt] XFAIL REASON: Various bugs exist DateTime::sub() -- spring type3 type3 [ext/date/tests/DateTime_sub-spring-type3-type3.phpt] XFAIL REASON: Various bugs exist Bug #52480 (Incorrect difference using DateInterval) [ext/date/tests/bug52480.phpt] XFAIL REASON: See https://bugs.php.net/bug.php?id=52480 RFC: DateTime and Daylight Saving Time Transitions (zone type 3, bd2) [ext/date/tests/rfc-datetime_and_daylight_saving_time-type3-bd2.phpt] XFAIL REASON: Still not quite right RFC: DateTime and Daylight Saving Time Transitions (zone type 3, fs) [ext/date/tests/rfc-datetime_and_daylight_saving_time-type3-fs.phpt] XFAIL REASON: Still not quite right Bug #42718 (unsafe_raw filter not applied when configured as default filter) [ext/filter/tests/bug42718.phpt] XFAIL REASON: FILTER_UNSAFE_RAW not applied when configured as default filter, even with flags Bug #67296 (filter_input doesn't validate variables) [ext/filter/tests/bug49184.phpt] XFAIL REASON: See Bug #49184 Bug #67167: filter_var(null,FILTER_VALIDATE_BOOLEAN,FILTER_NULL_ON_FAILURE) returns null [ext/filter/tests/bug67167.02.phpt] XFAIL REASON: Requires php_zval_filter to not use convert_to_string for all filters. Phar: bug #69958: Segfault in Phar::convertToData on invalid file [ext/phar/tests/bug69958.phpt] XFAIL REASON: Still has memory leaks, see https://bugs.php.net/bug.php?id=70005 updateTimestamp never called when session data is empty [ext/session/tests/bug71162.phpt] XFAIL REASON: Current session module is designed to write empty session always. In addition, current session module only supports SessionHandlerInterface only from PHP 7.0. Bug #73529 session_decode() silently fails on wrong input [ext/session/tests/bug73529.phpt] XFAIL REASON: session_decode() does not return proper status. Bug #70219 Use after free vulnerability in session deserializer [ext/standard/tests/serialize/bug70219.phpt] XFAIL REASON: Unfinished merge, needs fix. ===================================================================== ===================================================================== FAILED TEST SUMMARY --------------------------------------------------------------------- ISSUE #115 (path issue when using phar) [ext/opcache/tests/issue0115.phpt] ISSUE #149 (Phar mount points not working this OPcache enabled) [ext/opcache/tests/issue0149.phpt] Bug #65538: SSL context "cafile" disallows URL stream wrappers [ext/openssl/tests/bug65538_002.phpt] Bug #73037 SoapServer reports Bad Request when gzipped, var 0 [ext/soap/tests/bug73037.phpt] Multicast support: IPv6 receive options [ext/sockets/tests/mcast_ipv6_recv.phpt] ===================================================================== ===================================================================== TEST RESULT SUMMARY --------------------------------------------------------------------- Exts skipped : 26 Exts tested : 49 --------------------------------------------------------------------- Number of tests : 15787 12657 Tests skipped : 3130 ( 19.8%) -------- Tests warned : 0 ( 0.0%) ( 0.0%) Tests failed : 5 ( 0.0%) ( 0.0%) Expected fail : 35 ( 0.2%) ( 0.3%) Tests passed : 12617 ( 79.9%) ( 99.7%) --------------------------------------------------------------------- Time taken : 452 seconds ===================================================================== ===================================================================== EXPECTED FAILED TEST SUMMARY --------------------------------------------------------------------- Test open_basedir configuration [tests/security/open_basedir_linkinfo.phpt] XFAIL REASON: BUG: open_basedir cannot delete symlink to prohibited file. See also bugs 48111 and 52176. Inconsistencies when accessing protected members [Zend/tests/access_modifiers_008.phpt] XFAIL REASON: Discussion: http://marc.info/?l=php-internals&m=120221184420957&w=2 Inconsistencies when accessing protected members - 2 [Zend/tests/access_modifiers_009.phpt] XFAIL REASON: Discussion: http://marc.info/?l=php-internals&m=120221184420957&w=2 Bug #48770 (call_user_func_array() fails to call parent from inheriting class) [Zend/tests/bug48770.phpt] XFAIL REASON: See Bug #48770 Bug #48770 (call_user_func_array() fails to call parent from inheriting class) [Zend/tests/bug48770_2.phpt] XFAIL REASON: See Bug #48770 Bug #48770 (call_user_func_array() fails to call parent from inheriting class) [Zend/tests/bug48770_3.phpt] XFAIL REASON: See Bug #48770 Initial value of static var in method depends on the include time of the class definition [Zend/tests/method_static_var.phpt] XFAIL REASON: Maybe not a bug DateTime::add() -- fall type2 type3 [ext/date/tests/DateTime_add-fall-type2-type3.phpt] XFAIL REASON: Various bugs exist DateTime::add() -- fall type3 type2 [ext/date/tests/DateTime_add-fall-type3-type2.phpt] XFAIL REASON: Various bugs exist DateTime::add() -- fall type3 type3 [ext/date/tests/DateTime_add-fall-type3-type3.phpt] XFAIL REASON: Various bugs exist DateTime::add() -- spring type2 type3 [ext/date/tests/DateTime_add-spring-type2-type3.phpt] XFAIL REASON: Various bugs exist DateTime::add() -- spring type3 type2 [ext/date/tests/DateTime_add-spring-type3-type2.phpt] XFAIL REASON: Various bugs exist DateTime::add() -- spring type3 type3 [ext/date/tests/DateTime_add-spring-type3-type3.phpt] XFAIL REASON: Various bugs exist DateTime::diff() -- fall type2 type3 [ext/date/tests/DateTime_diff-fall-type2-type3.phpt] XFAIL REASON: Various bugs exist DateTime::diff() -- fall type3 type2 [ext/date/tests/DateTime_diff-fall-type3-type2.phpt] XFAIL REASON: Various bugs exist DateTime::diff() -- fall type3 type3 [ext/date/tests/DateTime_diff-fall-type3-type3.phpt] XFAIL REASON: Various bugs exist DateTime::diff() -- spring type2 type3 [ext/date/tests/DateTime_diff-spring-type2-type3.phpt] XFAIL REASON: Various bugs exist DateTime::diff() -- spring type3 type2 [ext/date/tests/DateTime_diff-spring-type3-type2.phpt] XFAIL REASON: Various bugs exist DateTime::diff() -- spring type3 type3 [ext/date/tests/DateTime_diff-spring-type3-type3.phpt] XFAIL REASON: Various bugs exist DateTime::sub() -- fall type2 type3 [ext/date/tests/DateTime_sub-fall-type2-type3.phpt] XFAIL REASON: Various bugs exist DateTime::sub() -- fall type3 type2 [ext/date/tests/DateTime_sub-fall-type3-type2.phpt] XFAIL REASON: Various bugs exist DateTime::sub() -- fall type3 type3 [ext/date/tests/DateTime_sub-fall-type3-type3.phpt] XFAIL REASON: Various bugs exist DateTime::sub() -- spring type2 type3 [ext/date/tests/DateTime_sub-spring-type2-type3.phpt] XFAIL REASON: Various bugs exist DateTime::sub() -- spring type3 type2 [ext/date/tests/DateTime_sub-spring-type3-type2.phpt] XFAIL REASON: Various bugs exist DateTime::sub() -- spring type3 type3 [ext/date/tests/DateTime_sub-spring-type3-type3.phpt] XFAIL REASON: Various bugs exist Bug #52480 (Incorrect difference using DateInterval) [ext/date/tests/bug52480.phpt] XFAIL REASON: See https://bugs.php.net/bug.php?id=52480 RFC: DateTime and Daylight Saving Time Transitions (zone type 3, bd2) [ext/date/tests/rfc-datetime_and_daylight_saving_time-type3-bd2.phpt] XFAIL REASON: Still not quite right RFC: DateTime and Daylight Saving Time Transitions (zone type 3, fs) [ext/date/tests/rfc-datetime_and_daylight_saving_time-type3-fs.phpt] XFAIL REASON: Still not quite right Bug #42718 (unsafe_raw filter not applied when configured as default filter) [ext/filter/tests/bug42718.phpt] XFAIL REASON: FILTER_UNSAFE_RAW not applied when configured as default filter, even with flags Bug #67296 (filter_input doesn't validate variables) [ext/filter/tests/bug49184.phpt] XFAIL REASON: See Bug #49184 Bug #67167: filter_var(null,FILTER_VALIDATE_BOOLEAN,FILTER_NULL_ON_FAILURE) returns null [ext/filter/tests/bug67167.02.phpt] XFAIL REASON: Requires php_zval_filter to not use convert_to_string for all filters. Phar: bug #69958: Segfault in Phar::convertToData on invalid file [ext/phar/tests/bug69958.phpt] XFAIL REASON: Still has memory leaks, see https://bugs.php.net/bug.php?id=70005 updateTimestamp never called when session data is empty [ext/session/tests/bug71162.phpt] XFAIL REASON: Current session module is designed to write empty session always. In addition, current session module only supports SessionHandlerInterface only from PHP 7.0. Bug #73529 session_decode() silently fails on wrong input [ext/session/tests/bug73529.phpt] XFAIL REASON: session_decode() does not return proper status. Bug #70219 Use after free vulnerability in session deserializer [ext/standard/tests/serialize/bug70219.phpt] XFAIL REASON: Unfinished merge, needs fix. ===================================================================== ===================================================================== FAILED TEST SUMMARY --------------------------------------------------------------------- ISSUE #115 (path issue when using phar) [ext/opcache/tests/issue0115.phpt] ISSUE #149 (Phar mount points not working this OPcache enabled) [ext/opcache/tests/issue0149.phpt] Bug #65538: SSL context "cafile" disallows URL stream wrappers [ext/openssl/tests/bug65538_002.phpt] Bug #73037 SoapServer reports Bad Request when gzipped, var 0 [ext/soap/tests/bug73037.phpt] Multicast support: IPv6 receive options [ext/sockets/tests/mcast_ipv6_recv.phpt] ===================================================================== ================================================================================ /home/admin/src/php-7.2.5/ext/opcache/tests/issue0115.phpt ================================================================================ <br /> <b>Fatal error</b>: Uncaught Error: Class 'Phar' not found in /home/admin/src/php-7.2.5/ext/opcache/tests/issue0115_1.phar.php:2 Stack trace: #0 {main} thrown in <b>/home/admin/src/php-7.2.5/ext/opcache/tests/issue0115_1.phar.php</b> on line <b>2</b><br /> <br /> <b>Fatal error</b>: Uncaught Error: Class 'Phar' not found in /home/admin/src/php-7.2.5/ext/opcache/tests/issue0115_2.phar.php:2 Stack trace: #0 {main} thrown in <b>/home/admin/src/php-7.2.5/ext/opcache/tests/issue0115_2.phar.php</b> on line <b>2</b><br /> ================================================================================ 001+ <br /> 002+ <b>Fatal error</b>: Uncaught Error: Class 'Phar' not found in /home/admin/src/php-7.2.5/ext/opcache/tests/issue0115_1.phar.php:2 003+ Stack trace: 004+ #0 {main} 001- Hello from Index 1. 002- Hello World 1! 003- Hello from Index 2. 004- Hello World 2! 005+ thrown in <b>/home/admin/src/php-7.2.5/ext/opcache/tests/issue0115_1.phar.php</b> on line <b>2</b><br /> 006+ <br /> 007+ <b>Fatal error</b>: Uncaught Error: Class 'Phar' not found in /home/admin/src/php-7.2.5/ext/opcache/tests/issue0115_2.phar.php:2 008+ Stack trace: 009+ #0 {main} 010+ thrown in <b>/home/admin/src/php-7.2.5/ext/opcache/tests/issue0115_2.phar.php</b> on line <b>2</b><br /> ================================================================================ ================================================================================ /home/admin/src/php-7.2.5/ext/opcache/tests/issue0149.phpt ================================================================================ <br /> <b>Fatal error</b>: Uncaught Error: Class 'Phar' not found in /home/admin/src/php-7.2.5/ext/opcache/tests/issue0149.phar.php:2 Stack trace: #0 {main} thrown in <b>/home/admin/src/php-7.2.5/ext/opcache/tests/issue0149.phar.php</b> on line <b>2</b><br /> <br /> <b>Fatal error</b>: Uncaught Error: Class 'Phar' not found in /home/admin/src/php-7.2.5/ext/opcache/tests/issue0149.phar.php:2 Stack trace: #0 {main} thrown in <b>/home/admin/src/php-7.2.5/ext/opcache/tests/issue0149.phar.php</b> on line <b>2</b><br /> <br /> <b>Fatal error</b>: Uncaught Error: Class 'Phar' not found in /home/admin/src/php-7.2.5/ext/opcache/tests/issue0149.phar.php:2 Stack trace: #0 {main} thrown in <b>/home/admin/src/php-7.2.5/ext/opcache/tests/issue0149.phar.php</b> on line <b>2</b><br /> ================================================================================ 001+ <br /> 002+ <b>Fatal error</b>: Uncaught Error: Class 'Phar' not found in /home/admin/src/php-7.2.5/ext/opcache/tests/issue0149.phar.php:2 003+ Stack trace: 001- OK 002- OK 003- OK 004+ #0 {main} 005+ thrown in <b>/home/admin/src/php-7.2.5/ext/opcache/tests/issue0149.phar.php</b> on line <b>2</b><br /> 006+ <br /> 007+ <b>Fatal error</b>: Uncaught Error: Class 'Phar' not found in /home/admin/src/php-7.2.5/ext/opcache/tests/issue0149.phar.php:2 008+ Stack trace: 009+ #0 {main} 010+ thrown in <b>/home/admin/src/php-7.2.5/ext/opcache/tests/issue0149.phar.php</b> on line <b>2</b><br /> 011+ <br /> 012+ <b>Fatal error</b>: Uncaught Error: Class 'Phar' not found in /home/admin/src/php-7.2.5/ext/opcache/tests/issue0149.phar.php:2 013+ Stack trace: 014+ #0 {main} 015+ thrown in <b>/home/admin/src/php-7.2.5/ext/opcache/tests/issue0149.phar.php</b> on line <b>2</b><br /> ================================================================================ ================================================================================ /home/admin/src/php-7.2.5/ext/openssl/tests/bug65538_002.phpt ================================================================================ Warning: file_get_contents(): HTTP request failed! HTTP/1.1 502 Connection refused in /home/admin/src/php-7.2.5/ext/openssl/tests/bug65538_002.php on line 10 Warning: failed loading cafile stream: `http://www.php.net' in /home/admin/src/php-7.2.5/ext/openssl/tests/bug65538_002.php on line 10 Warning: file_get_contents(): Failed to enable crypto in /home/admin/src/php-7.2.5/ext/openssl/tests/bug65538_002.php on line 10 Warning: file_get_contents(https://github.com): failed to open stream: operation failed in /home/admin/src/php-7.2.5/ext/openssl/tests/bug65538_002.php on line 10 ================================================================================ 001+ Warning: file_get_contents(): HTTP request failed! HTTP/1.1 502 Connection refused 002+ in /home/admin/src/php-7.2.5/ext/openssl/tests/bug65538_002.php on line 10 003+ 004+ Warning: failed loading cafile stream: `http://www.php.net' in /home/admin/src/php-7.2.5/ext/openssl/tests/bug65538_002.php on line 10 001- Warning: remote cafile streams are disabled for security purposes in %s on line %d ================================================================================ ================================================================================ /home/admin/src/php-7.2.5/ext/soap/tests/bug73037.phpt ================================================================================ Iteration 0 HTTP/1.1 200 OK Date: Mon, 14 May 2018 20:12:39 +0000 Connection: close X-Powered-By: PHP/7.2.5 Content-type: text/html; charset=UTF-8 <br /> <b>Fatal error</b>: Uncaught Error: Class 'SoapServer' not found in /home/admin/src/php-7.2.5/sapi/cli/tests/bug73037_server.php:1 Stack trace: #0 {main} thrown in <b>/home/admin/src/php-7.2.5/sapi/cli/tests/bug73037_server.php</b> on line <b>1</b><br /> HTTP/1.1 200 OK Date: Mon, 14 May 2018 20:12:39 +0000 Connection: close X-Powered-By: PHP/7.2.5 Content-type: text/html; charset=UTF-8 <br /> <b>Fatal error</b>: Uncaught Error: Class 'SoapServer' not found in /home/admin/src/php-7.2.5/sapi/cli/tests/bug73037_server.php:1 Stack trace: #0 {main} thrown in <b>/home/admin/src/php-7.2.5/sapi/cli/tests/bug73037_server.php</b> on line <b>1</b><br /> Iteration 1 HTTP/1.1 200 OK Date: Mon, 14 May 2018 20:12:39 +0000 Connection: close X-Powered-By: PHP/7.2.5 Content-type: text/html; charset=UTF-8 <br /> <b>Fatal error</b>: Uncaught Error: Class 'SoapServer' not found in /home/admin/src/php-7.2.5/sapi/cli/tests/bug73037_server.php:1 Stack trace: #0 {main} thrown in <b>/home/admin/src/php-7.2.5/sapi/cli/tests/bug73037_server.php</b> on line <b>1</b><br /> HTTP/1.1 200 OK Date: Mon, 14 May 2018 20:12:39 +0000 Connection: close X-Powered-By: PHP/7.2.5 Content-type: text/html; charset=UTF-8 <br /> <b>Fatal error</b>: Uncaught Error: Class 'SoapServer' not found in /home/admin/src/php-7.2.5/sapi/cli/tests/bug73037_server.php:1 Stack trace: #0 {main} thrown in <b>/home/admin/src/php-7.2.5/sapi/cli/tests/bug73037_server.php</b> on line <b>1</b><br /> Iteration 2 HTTP/1.1 200 OK Date: Mon, 14 May 2018 20:12:39 +0000 Connection: close X-Powered-By: PHP/7.2.5 Content-type: text/html; charset=UTF-8 <br /> <b>Fatal error</b>: Uncaught Error: Class 'SoapServer' not found in /home/admin/src/php-7.2.5/sapi/cli/tests/bug73037_server.php:1 Stack trace: #0 {main} thrown in <b>/home/admin/src/php-7.2.5/sapi/cli/tests/bug73037_server.php</b> on line <b>1</b><br /> HTTP/1.1 200 OK Date: Mon, 14 May 2018 20:12:39 +0000 Connection: close X-Powered-By: PHP/7.2.5 Content-type: text/html; charset=UTF-8 <br /> <b>Fatal error</b>: Uncaught Error: Class 'SoapServer' not found in /home/admin/src/php-7.2.5/sapi/cli/tests/bug73037_server.php:1 Stack trace: #0 {main} thrown in <b>/home/admin/src/php-7.2.5/sapi/cli/tests/bug73037_server.php</b> on line <b>1</b><br /> Iteration 3 HTTP/1.1 200 OK Date: Mon, 14 May 2018 20:12:39 +0000 Connection: close X-Powered-By: PHP/7.2.5 Content-type: text/html; charset=UTF-8 <br /> <b>Fatal error</b>: Uncaught Error: Class 'SoapServer' not found in /home/admin/src/php-7.2.5/sapi/cli/tests/bug73037_server.php:1 Stack trace: #0 {main} thrown in <b>/home/admin/src/php-7.2.5/sapi/cli/tests/bug73037_server.php</b> on line <b>1</b><br /> HTTP/1.1 200 OK Date: Mon, 14 May 2018 20:12:39 +0000 Connection: close X-Powered-By: PHP/7.2.5 Content-type: text/html; charset=UTF-8 <br /> <b>Fatal error</b>: Uncaught Error: Class 'SoapServer' not found in /home/admin/src/php-7.2.5/sapi/cli/tests/bug73037_server.php:1 Stack trace: #0 {main} thrown in <b>/home/admin/src/php-7.2.5/sapi/cli/tests/bug73037_server.php</b> on line <b>1</b><br /> Iteration 4 HTTP/1.1 200 OK Date: Mon, 14 May 2018 20:12:39 +0000 Connection: close X-Powered-By: PHP/7.2.5 Content-type: text/html; charset=UTF-8 <br /> <b>Fatal error</b>: Uncaught Error: Class 'SoapServer' not found in /home/admin/src/php-7.2.5/sapi/cli/tests/bug73037_server.php:1 Stack trace: #0 {main} thrown in <b>/home/admin/src/php-7.2.5/sapi/cli/tests/bug73037_server.php</b> on line <b>1</b><br /> HTTP/1.1 200 OK Date: Mon, 14 May 2018 20:12:39 +0000 Connection: close X-Powered-By: PHP/7.2.5 Content-type: text/html; charset=UTF-8 <br /> <b>Fatal error</b>: Uncaught Error: Class 'SoapServer' not found in /home/admin/src/php-7.2.5/sapi/cli/tests/bug73037_server.php:1 Stack trace: #0 {main} thrown in <b>/home/admin/src/php-7.2.5/sapi/cli/tests/bug73037_server.php</b> on line <b>1</b><br /> Iteration 5 HTTP/1.1 200 OK Date: Mon, 14 May 2018 20:12:39 +0000 Connection: close X-Powered-By: PHP/7.2.5 Content-type: text/html; charset=UTF-8 <br /> <b>Fatal error</b>: Uncaught Error: Class 'SoapServer' not found in /home/admin/src/php-7.2.5/sapi/cli/tests/bug73037_server.php:1 Stack trace: #0 {main} thrown in <b>/home/admin/src/php-7.2.5/sapi/cli/tests/bug73037_server.php</b> on line <b>1</b><br /> HTTP/1.1 200 OK Date: Mon, 14 May 2018 20:12:39 +0000 Connection: close X-Powered-By: PHP/7.2.5 Content-type: text/html; charset=UTF-8 <br /> <b>Fatal error</b>: Uncaught Error: Class 'SoapServer' not found in /home/admin/src/php-7.2.5/sapi/cli/tests/bug73037_server.php:1 Stack trace: #0 {main} thrown in <b>/home/admin/src/php-7.2.5/sapi/cli/tests/bug73037_server.php</b> on line <b>1</b><br /> Iteration 6 HTTP/1.1 200 OK Date: Mon, 14 May 2018 20:12:39 +0000 Connection: close X-Powered-By: PHP/7.2.5 Content-type: text/html; charset=UTF-8 <br /> <b>Fatal error</b>: Uncaught Error: Class 'SoapServer' not found in /home/admin/src/php-7.2.5/sapi/cli/tests/bug73037_server.php:1 Stack trace: #0 {main} thrown in <b>/home/admin/src/php-7.2.5/sapi/cli/tests/bug73037_server.php</b> on line <b>1</b><br /> HTTP/1.1 200 OK Date: Mon, 14 May 2018 20:12:39 +0000 Connection: close X-Powered-By: PHP/7.2.5 Content-type: text/html; charset=UTF-8 <br /> <b>Fatal error</b>: Uncaught Error: Class 'SoapServer' not found in /home/admin/src/php-7.2.5/sapi/cli/tests/bug73037_server.php:1 Stack trace: #0 {main} thrown in <b>/home/admin/src/php-7.2.5/sapi/cli/tests/bug73037_server.php</b> on line <b>1</b><br /> ==DONE== ================================================================================ 003+ HTTP/1.1 200 OK 004+ Date: Mon, 14 May 2018 20:12:39 +0000 005+ Connection: close 006+ X-Powered-By: PHP/7.2.5 007+ Content-type: text/html; charset=UTF-8 003- Function 'CATALOG' doesn't exist 005- Function 'CATALOG' doesn't exist 007- Iteration 1 009+ <br /> 010+ <b>Fatal error</b>: Uncaught Error: Class 'SoapServer' not found in /home/admin/src/php-7.2.5/sapi/cli/tests/bug73037_server.php:1 011+ Stack trace: 012+ #0 {main} 013+ thrown in <b>/home/admin/src/php-7.2.5/sapi/cli/tests/bug73037_server.php</b> on line <b>1</b><br /> 009- Function 'CATALOG' doesn't exist 011- Function 'CATALOG' doesn't exist 013- Iteration 2 015- Function 'CATALOG' doesn't exist 016+ HTTP/1.1 200 OK 017+ Date: Mon, 14 May 2018 20:12:39 +0000 018+ Connection: close 019+ X-Powered-By: PHP/7.2.5 020+ Content-type: text/html; charset=UTF-8 017- Function 'CATALOG' doesn't exist 019- Iteration 3 021- Function 'CATALOG' doesn't exist 022+ <br /> 023+ <b>Fatal error</b>: Uncaught Error: Class 'SoapServer' not found in /home/admin/src/php-7.2.5/sapi/cli/tests/bug73037_server.php:1 024+ Stack trace: 025+ #0 {main} 026+ thrown in <b>/home/admin/src/php-7.2.5/sapi/cli/tests/bug73037_server.php</b> on line <b>1</b><br /> 023- Function 'CATALOG' doesn't exist 025- Iteration 4 027- Function 'CATALOG' doesn't exist 029+ Iteration 1 029- Function 'CATALOG' doesn't exist 031+ HTTP/1.1 200 OK 032+ Date: Mon, 14 May 2018 20:12:39 +0000 033+ Connection: close 034+ X-Powered-By: PHP/7.2.5 035+ Content-type: text/html; charset=UTF-8 031- Iteration 5 033- Function 'CATALOG' doesn't exist 035- Function 'CATALOG' doesn't exist 037+ <br /> 038+ <b>Fatal error</b>: Uncaught Error: Class 'SoapServer' not found in /home/admin/src/php-7.2.5/sapi/cli/tests/bug73037_server.php:1 039+ Stack trace: 040+ #0 {main} 041+ thrown in <b>/home/admin/src/php-7.2.5/sapi/cli/tests/bug73037_server.php</b> on line <b>1</b><br /> 037- Iteration 6 039- Function 'CATALOG' doesn't exist 041- Function 'CATALOG' doesn't exist 044+ HTTP/1.1 200 OK 045+ Date: Mon, 14 May 2018 20:12:39 +0000 046+ Connection: close 047+ X-Powered-By: PHP/7.2.5 048+ Content-type: text/html; charset=UTF-8 050+ <br /> 051+ <b>Fatal error</b>: Uncaught Error: Class 'SoapServer' not found in /home/admin/src/php-7.2.5/sapi/cli/tests/bug73037_server.php:1 052+ Stack trace: 053+ #0 {main} 054+ thrown in <b>/home/admin/src/php-7.2.5/sapi/cli/tests/bug73037_server.php</b> on line <b>1</b><br /> 057+ Iteration 2 059+ HTTP/1.1 200 OK 060+ Date: Mon, 14 May 2018 20:12:39 +0000 061+ Connection: close 062+ X-Powered-By: PHP/7.2.5 063+ Content-type: text/html; charset=UTF-8 065+ <br /> 066+ <b>Fatal error</b>: Uncaught Error: Class 'SoapServer' not found in /home/admin/src/php-7.2.5/sapi/cli/tests/bug73037_server.php:1 067+ Stack trace: 068+ #0 {main} 069+ thrown in <b>/home/admin/src/php-7.2.5/sapi/cli/tests/bug73037_server.php</b> on line <b>1</b><br /> 072+ HTTP/1.1 200 OK 073+ Date: Mon, 14 May 2018 20:12:39 +0000 074+ Connection: close 075+ X-Powered-By: PHP/7.2.5 076+ Content-type: text/html; charset=UTF-8 078+ <br /> 079+ <b>Fatal error</b>: Uncaught Error: Class 'SoapServer' not found in /home/admin/src/php-7.2.5/sapi/cli/tests/bug73037_server.php:1 080+ Stack trace: 081+ #0 {main} 082+ thrown in <b>/home/admin/src/php-7.2.5/sapi/cli/tests/bug73037_server.php</b> on line <b>1</b><br /> 084+ 085+ Iteration 3 086+ 087+ HTTP/1.1 200 OK 088+ Date: Mon, 14 May 2018 20:12:39 +0000 089+ Connection: close 090+ X-Powered-By: PHP/7.2.5 091+ Content-type: text/html; charset=UTF-8 092+ 093+ <br /> 094+ <b>Fatal error</b>: Uncaught Error: Class 'SoapServer' not found in /home/admin/src/php-7.2.5/sapi/cli/tests/bug73037_server.php:1 095+ Stack trace: 096+ #0 {main} 097+ thrown in <b>/home/admin/src/php-7.2.5/sapi/cli/tests/bug73037_server.php</b> on line <b>1</b><br /> 098+ 099+ 100+ HTTP/1.1 200 OK 101+ Date: Mon, 14 May 2018 20:12:39 +0000 102+ Connection: close 103+ X-Powered-By: PHP/7.2.5 104+ Content-type: text/html; charset=UTF-8 105+ 106+ <br /> 107+ <b>Fatal error</b>: Uncaught Error: Class 'SoapServer' not found in /home/admin/src/php-7.2.5/sapi/cli/tests/bug73037_server.php:1 108+ Stack trace: 109+ #0 {main} 110+ thrown in <b>/home/admin/src/php-7.2.5/sapi/cli/tests/bug73037_server.php</b> on line <b>1</b><br /> 111+ 112+ 113+ Iteration 4 114+ 115+ HTTP/1.1 200 OK 116+ Date: Mon, 14 May 2018 20:12:39 +0000 117+ Connection: close 118+ X-Powered-By: PHP/7.2.5 119+ Content-type: text/html; charset=UTF-8 120+ 121+ <br /> 122+ <b>Fatal error</b>: Uncaught Error: Class 'SoapServer' not found in /home/admin/src/php-7.2.5/sapi/cli/tests/bug73037_server.php:1 123+ Stack trace: 124+ #0 {main} 125+ thrown in <b>/home/admin/src/php-7.2.5/sapi/cli/tests/bug73037_server.php</b> on line <b>1</b><br /> 126+ 127+ 128+ HTTP/1.1 200 OK 129+ Date: Mon, 14 May 2018 20:12:39 +0000 130+ Connection: close 131+ X-Powered-By: PHP/7.2.5 132+ Content-type: text/html; charset=UTF-8 133+ 134+ <br /> 135+ <b>Fatal error</b>: Uncaught Error: Class 'SoapServer' not found in /home/admin/src/php-7.2.5/sapi/cli/tests/bug73037_server.php:1 136+ Stack trace: 137+ #0 {main} 138+ thrown in <b>/home/admin/src/php-7.2.5/sapi/cli/tests/bug73037_server.php</b> on line <b>1</b><br /> 139+ 140+ 141+ Iteration 5 142+ 143+ HTTP/1.1 200 OK 144+ Date: Mon, 14 May 2018 20:12:39 +0000 145+ Connection: close 146+ X-Powered-By: PHP/7.2.5 147+ Content-type: text/html; charset=UTF-8 148+ 149+ <br /> 150+ <b>Fatal error</b>: Uncaught Error: Class 'SoapServer' not found in /home/admin/src/php-7.2.5/sapi/cli/tests/bug73037_server.php:1 151+ Stack trace: 152+ #0 {main} 153+ thrown in <b>/home/admin/src/php-7.2.5/sapi/cli/tests/bug73037_server.php</b> on line <b>1</b><br /> 154+ 155+ 156+ HTTP/1.1 200 OK 157+ Date: Mon, 14 May 2018 20:12:39 +0000 158+ Connection: close 159+ X-Powered-By: PHP/7.2.5 160+ Content-type: text/html; charset=UTF-8 161+ 162+ <br /> 163+ <b>Fatal error</b>: Uncaught Error: Class 'SoapServer' not found in /home/admin/src/php-7.2.5/sapi/cli/tests/bug73037_server.php:1 164+ Stack trace: 165+ #0 {main} 166+ thrown in <b>/home/admin/src/php-7.2.5/sapi/cli/tests/bug73037_server.php</b> on line <b>1</b><br /> 167+ 168+ 169+ Iteration 6 170+ 171+ HTTP/1.1 200 OK 172+ Date: Mon, 14 May 2018 20:12:39 +0000 173+ Connection: close 174+ X-Powered-By: PHP/7.2.5 175+ Content-type: text/html; charset=UTF-8 176+ 177+ <br /> 178+ <b>Fatal error</b>: Uncaught Error: Class 'SoapServer' not found in /home/admin/src/php-7.2.5/sapi/cli/tests/bug73037_server.php:1 179+ Stack trace: 180+ #0 {main} 181+ thrown in <b>/home/admin/src/php-7.2.5/sapi/cli/tests/bug73037_server.php</b> on line <b>1</b><br /> 182+ 183+ 184+ HTTP/1.1 200 OK 185+ Date: Mon, 14 May 2018 20:12:39 +0000 186+ Connection: close 187+ X-Powered-By: PHP/7.2.5 188+ Content-type: text/html; charset=UTF-8 190+ <br /> 191+ <b>Fatal error</b>: Uncaught Error: Class 'SoapServer' not found in /home/admin/src/php-7.2.5/sapi/cli/tests/bug73037_server.php:1 192+ Stack trace: 193+ #0 {main} 194+ thrown in <b>/home/admin/src/php-7.2.5/sapi/cli/tests/bug73037_server.php</b> on line <b>1</b><br /> 195+ 196+ ================================================================================ ================================================================================ /home/admin/src/php-7.2.5/ext/sockets/tests/mcast_ipv6_recv.phpt ================================================================================ creating send socket resource(5) of type (Socket) creating receive socket resource(6) of type (Socket) bool(true) bool(true) int(14) Socket read timeout hit. Can be a bug, a test bug, or a firewall issue. ================================================================================ 008+ Socket read timeout hit. Can be a bug, a test bug, or a firewall issue. 008- int(14) 009- string(14) "testing packet" 010- string(%d) "%s" 011- int(14) 012- 1> initial packet 013- leaving group 014- bool(true) 015- int(20) 016- int(14) 017- 2> unicast packet 018- re-joining group 019- bool(true) 020- int(12) 021- 3> mcast packet 022- blocking source 023- bool(true) 024- int(31) 025- int(14) 026- 4> unicast packet 027- unblocking source 028- bool(true) 029- int(12) 030- 5> mcast packet 031- leaving group 032- bool(true) 033- int(20) 034- int(14) 035- 6> unicast packet 036- joining source group 037- bool(true) 038- int(32) 039- 7> mcast packet from desired source 040- leaving source group 041- bool(true) 042- int(20) 043- int(14) 044- 8> unicast packet ================================================================================ ================================================================================ BUILD ENVIRONMENT ================================================================================ OS: Linux - Linux meow-las1-windx.meowintl.com 3.10.0-862.2.3.el7.x86_64 #1 SMP Mon Apr 30 12:37:51 EDT 2018 x86_64 Autoconf: autoconf (GNU Autoconf) 2.69 Copyright (C) 2012 Free Software Foundation, Inc. License GPLv3+/Autoconf: GNU GPL version 3 or later <http://gnu.org/licenses/gpl.html>, <http://gnu.org/licenses/exceptions.html> This is free software: you are free to change and redistribute it. There is NO WARRANTY, to the extent permitted by law. Written by David J. MacKenzie and Akim Demaille. Bundled Libtool: ltmain.sh (GNU libtool) 1.5.26 (1.1220.2.492 2008/01/30 06:40:56) Copyright (C) 2008 Free Software Foundation, Inc. This is free software; see the source for copying conditions. There is NO warranty; not even for MERCHANTABILITY or FITNESS FOR A PARTICULAR PURPOSE. System Libtool: libtool (GNU libtool) 2.4.2 Written by Gordon Matzigkeit <gord@gnu.ai.mit.edu>, 1996 Copyright (C) 2011 Free Software Foundation, Inc. This is free software; see the source for copying conditions. There is NO warranty; not even for MERCHANTABILITY or FITNESS FOR A PARTICULAR PURPOSE. Compiler: Using built-in specs. COLLECT_GCC=cc COLLECT_LTO_WRAPPER=/usr/libexec/gcc/x86_64-redhat-linux/4.8.5/lto-wrapper Target: x86_64-redhat-linux Configured with: ../configure --prefix=/usr --mandir=/usr/share/man --infodir=/usr/share/info --with-bugurl=http://bugzilla.redhat.com/bugzilla --enable-bootstrap --enable-shared --enable-threads=posix --enable-checking=release --with-system-zlib --enable-__cxa_atexit --disable-libunwind-exceptions --enable-gnu-unique-object --enable-linker-build-id --with-linker-hash-style=gnu --enable-languages=c,c++,objc,obj-c++,java,fortran,ada,go,lto --enable-plugin --enable-initfini-array --disable-libgcj --with-isl=/builddir/build/BUILD/gcc-4.8.5-20150702/obj-x86_64-redhat-linux/isl-install --with-cloog=/builddir/build/BUILD/gcc-4.8.5-20150702/obj-x86_64-redhat-linux/cloog-install --enable-gnu-indirect-function --with-tune=generic --with-arch_32=x86-64 --build=x86_64-redhat-linux Thread model: posix gcc version 4.8.5 20150623 (Red Hat 4.8.5-28) (GCC) Bison: bison (GNU Bison) 3.0.4 Written by Robert Corbett and Richard Stallman. Copyright (C) 2015 Free Software Foundation, Inc. This is free software; see the source for copying conditions. There is NO warranty; not even for MERCHANTABILITY or FITNESS FOR A PARTICULAR PURPOSE. Libraries: linux-vdso.so.1 => (0x00007ffe2dd5a000) libcrypt.so.1 => /lib64/libcrypt.so.1 (0x00007f334c40d000) libresolv.so.2 => /lib64/libresolv.so.2 (0x00007f334c1f4000) librt.so.1 => /lib64/librt.so.1 (0x00007f334bfec000) libz.so.1 => /lib64/libz.so.1 (0x00007f334bdd6000) libm.so.6 => /lib64/libm.so.6 (0x00007f334bad4000) libdl.so.2 => /lib64/libdl.so.2 (0x00007f334b8d0000) libnsl.so.1 => /lib64/libnsl.so.1 (0x00007f334b6b6000) libxml2.so.2 => /lib64/libxml2.so.2 (0x00007f334b34c000) libgssapi_krb5.so.2 => /lib64/libgssapi_krb5.so.2 (0x00007f334b0ff000) libkrb5.so.3 => /lib64/libkrb5.so.3 (0x00007f334ae17000) libk5crypto.so.3 => /lib64/libk5crypto.so.3 (0x00007f334abe4000) libcom_err.so.2 => /lib64/libcom_err.so.2 (0x00007f334a9e0000) libssl.so.10 => /lib64/libssl.so.10 (0x00007f334a76f000) libcrypto.so.10 => /lib64/libcrypto.so.10 (0x00007f334a30e000) libodbc.so.2 => /lib64/libodbc.so.2 (0x00007f334a0a6000) libc.so.6 => /lib64/libc.so.6 (0x00007f3349cd9000) libfreebl3.so => /lib64/libfreebl3.so (0x00007f3349ad6000) libpthread.so.0 => /lib64/libpthread.so.0 (0x00007f33498ba000) /lib64/ld-linux-x86-64.so.2 (0x00007f334c644000) liblzma.so.5 => /lib64/liblzma.so.5 (0x00007f3349694000) libkrb5support.so.0 => /lib64/libkrb5support.so.0 (0x00007f3349486000) libkeyutils.so.1 => /lib64/libkeyutils.so.1 (0x00007f3349282000) libltdl.so.7 => /lib64/libltdl.so.7 (0x00007f3349078000) libselinux.so.1 => /lib64/libselinux.so.1 (0x00007f3348e51000) libpcre.so.1 => /lib64/libpcre.so.1 (0x00007f3348bef000) ================================================================================ PHPINFO ================================================================================ phpinfo() PHP Version => 7.2.5 System => Linux meow-las1-windx.meowintl.com 3.10.0-862.2.3.el7.x86_64 #1 SMP Mon Apr 30 12:37:51 EDT 2018 x86_64 Build Date => May 14 2018 13:02:16 Configure Command => './configure' '--disable-debug' '--with-pic' '--disable-rpath' '--with-pear' '--with-freetype-dir=/usr' '--with-png-dir=/usr' '--with-xpm-dir=/usr' '--without-gdbm' '--with-gettext' '--with-iconv' '--with-jpeg-dir=/usr' '--with-openssl' '--with-pcre-dir=/usr' '--with-zlib' '--with-layout=GNU' '--enable-exif' '--enable-ftp' '--enable-sockets' '--enable-sysvsem' '--enable-sysvshm' '--enable-sysvmsg' '--with-kerberos' '--enable-shmop' '--enable-calendar' '--with-libxml-dir=/usr' '--enable-xml' '--enable-pcntl' '--enable-mbstring' '--enable-mbregex' '--with-gd=shared' '--enable-bcmath=shared' '--enable-dba=shared' '--with-xmlrpc=shared' '--enable-dom=shared' '--enable-wddx=shared' '--enable-soap=shared' '--enable-xmlreader=shared' '--enable-xmlwriter=shared' '--enable-pdo' '--with-unixODBC=/usr' '--with-pdo-mysql' '--enable-json=shared' '--enable-zip=shared' '--without-readline' '--enable-phar=shared' '--enable-sysvmsg=shared' '--enable-sysvshm=shared' '--enable-sysvsem=shared' '--enable-posix=shared' '--enable-fileinfo=shared' Server API => Command Line Interface Virtual Directory Support => disabled Configuration File (php.ini) Path => /usr/local/etc Loaded Configuration File => (none) Scan this dir for additional .ini files => (none) Additional .ini files parsed => (none) PHP API => 20170718 PHP Extension => 20170718 Zend Extension => 320170718 Zend Extension Build => API320170718,NTS PHP Extension Build => API20170718,NTS Debug Build => no Thread Safety => disabled Zend Signal Handling => enabled Zend Memory Manager => enabled Zend Multibyte Support => provided by mbstring IPv6 Support => enabled DTrace Support => disabled Registered PHP Streams => https, ftps, compress.zlib, php, file, glob, data, http, ftp Registered Stream Socket Transports => tcp, udp, unix, udg, ssl, sslv3, tls, tlsv1.0, tlsv1.1, tlsv1.2 Registered Stream Filters => zlib.*, convert.iconv.*, string.rot13, string.toupper, string.tolower, string.strip_tags, convert.*, consumed, dechunk This program makes use of the Zend Scripting Language Engine: Zend Engine v3.2.0, Copyright (c) 1998-2018 Zend Technologies _______________________________________________________________________ Configuration calendar Calendar support => enabled Core PHP Version => 7.2.5 Directive => Local Value => Master Value allow_url_fopen => On => On allow_url_include => Off => Off arg_separator.input => & => & arg_separator.output => & => & auto_append_file => no value => no value auto_globals_jit => On => On auto_prepend_file => no value => no value browscap => no value => no value default_charset => UTF-8 => UTF-8 default_mimetype => text/html => text/html disable_classes => no value => no value disable_functions => no value => no value display_errors => STDERR => STDERR display_startup_errors => Off => Off doc_root => no value => no value docref_ext => no value => no value docref_root => no value => no value enable_dl => On => On enable_post_data_reading => On => On error_append_string => no value => no value error_log => no value => no value error_prepend_string => no value => no value error_reporting => no value => no value expose_php => On => On extension_dir => /usr/local/lib/php/20170718 => /usr/local/lib/php/20170718 file_uploads => On => On hard_timeout => 2 => 2 highlight.comment => <font style="color: #FF8000">#FF8000</font> => <font style="color: #FF8000">#FF8000</font> highlight.default => <font style="color: #0000BB">#0000BB</font> => <font style="color: #0000BB">#0000BB</font> highlight.html => <font style="color: #000000">#000000</font> => <font style="color: #000000">#000000</font> highlight.keyword => <font style="color: #007700">#007700</font> => <font style="color: #007700">#007700</font> highlight.string => <font style="color: #DD0000">#DD0000</font> => <font style="color: #DD0000">#DD0000</font> html_errors => Off => Off ignore_repeated_errors => Off => Off ignore_repeated_source => Off => Off ignore_user_abort => Off => Off implicit_flush => On => On include_path => .:/usr/local/share/pear => .:/usr/local/share/pear input_encoding => no value => no value internal_encoding => no value => no value log_errors => Off => Off log_errors_max_len => 1024 => 1024 mail.add_x_header => Off => Off mail.force_extra_parameters => no value => no value mail.log => no value => no value max_execution_time => 0 => 0 max_file_uploads => 20 => 20 max_input_nesting_level => 64 => 64 max_input_time => -1 => -1 max_input_vars => 1000 => 1000 memory_limit => 128M => 128M open_basedir => no value => no value output_buffering => 0 => 0 output_encoding => no value => no value output_handler => no value => no value post_max_size => 8M => 8M precision => 14 => 14 realpath_cache_size => 4096K => 4096K realpath_cache_ttl => 120 => 120 register_argc_argv => On => On report_memleaks => On => On report_zend_debug => Off => Off request_order => no value => no value sendmail_from => no value => no value sendmail_path => /usr/sbin/sendmail -t -i => /usr/sbin/sendmail -t -i serialize_precision => -1 => -1 short_open_tag => On => On SMTP => localhost => localhost smtp_port => 25 => 25 sys_temp_dir => no value => no value track_errors => Off => Off unserialize_callback_func => no value => no value upload_max_filesize => 2M => 2M upload_tmp_dir => no value => no value user_dir => no value => no value user_ini.cache_ttl => 300 => 300 user_ini.filename => .user.ini => .user.ini variables_order => EGPCS => EGPCS xmlrpc_error_number => 0 => 0 xmlrpc_errors => Off => Off zend.assertions => 1 => 1 zend.detect_unicode => On => On zend.enable_gc => On => On zend.multibyte => Off => Off zend.script_encoding => no value => no value zend.signal_check => Off => Off ctype ctype functions => enabled date date/time support => enabled timelib version => 2017.06 "Olson" Timezone Database Version => 2018.4 Timezone Database => internal Default timezone => UTC Directive => Local Value => Master Value date.default_latitude => 31.7667 => 31.7667 date.default_longitude => 35.2333 => 35.2333 date.sunrise_zenith => 90.583333 => 90.583333 date.sunset_zenith => 90.583333 => 90.583333 date.timezone => no value => no value exif EXIF Support => enabled EXIF Version => 7.2.5 Supported EXIF Version => 0220 Supported filetypes => JPEG, TIFF Multibyte decoding support using mbstring => enabled Extended EXIF tag formats => Canon, Casio, Fujifilm, Nikon, Olympus, Samsung, Panasonic, DJI, Sony, Pentax, Minolta, Sigma, Foveon, Kyocera, Ricoh, AGFA, Epson Directive => Local Value => Master Value exif.decode_jis_intel => JIS => JIS exif.decode_jis_motorola => JIS => JIS exif.decode_unicode_intel => UCS-2LE => UCS-2LE exif.decode_unicode_motorola => UCS-2BE => UCS-2BE exif.encode_jis => no value => no value exif.encode_unicode => ISO-8859-15 => ISO-8859-15 filter Input Validation and Filtering => enabled Revision => $Id: a4ca1e0a99c260cb8a4cf5d7369d130f7b934185 $ Directive => Local Value => Master Value filter.default => unsafe_raw => unsafe_raw filter.default_flags => no value => no value ftp FTP support => enabled FTPS support => enabled gettext GetText Support => enabled hash hash support => enabled Hashing Engines => md2 md4 md5 sha1 sha224 sha256 sha384 sha512/224 sha512/256 sha512 sha3-224 sha3-256 sha3-384 sha3-512 ripemd128 ripemd160 ripemd256 ripemd320 whirlpool tiger128,3 tiger160,3 tiger192,3 tiger128,4 tiger160,4 tiger192,4 snefru snefru256 gost gost-crypto adler32 crc32 crc32b fnv132 fnv1a32 fnv164 fnv1a64 joaat haval128,3 haval160,3 haval192,3 haval224,3 haval256,3 haval128,4 haval160,4 haval192,4 haval224,4 haval256,4 haval128,5 haval160,5 haval192,5 haval224,5 haval256,5 iconv iconv support => enabled iconv implementation => glibc iconv library version => 2.17 Directive => Local Value => Master Value iconv.input_encoding => no value => no value iconv.internal_encoding => no value => no value iconv.output_encoding => no value => no value libxml libXML support => active libXML Compiled Version => 2.9.1 libXML Loaded Version => 20901 libXML streams => enabled mbstring Multibyte Support => enabled Multibyte string engine => libmbfl HTTP input encoding translation => disabled libmbfl version => 1.3.2 oniguruma version => 6.3.0 mbstring extension makes use of "streamable kanji code filter and converter", which is distributed under the GNU Lesser General Public License version 2.1. Multibyte (japanese) regex support => enabled Multibyte regex (oniguruma) backtrack check => On Multibyte regex (oniguruma) version => 6.3.0 Directive => Local Value => Master Value mbstring.detect_order => no value => no value mbstring.encoding_translation => Off => Off mbstring.func_overload => 0 => 0 mbstring.http_input => no value => no value mbstring.http_output => no value => no value mbstring.http_output_conv_mimetypes => ^(text/|application/xhtml\+xml) => ^(text/|application/xhtml\+xml) mbstring.internal_encoding => no value => no value mbstring.language => neutral => neutral mbstring.strict_detection => Off => Off mbstring.substitute_character => no value => no value mysqlnd mysqlnd => enabled Version => mysqlnd 5.0.12-dev - 20150407 - $Id: 38fea24f2847fa7519001be390c98ae0acafe387 $ Compression => supported core SSL => supported extended SSL => supported Command buffer size => 4096 Read buffer size => 32768 Read timeout => 86400 Collecting statistics => Yes Collecting memory statistics => No Tracing => n/a Loaded plugins => mysqlnd,debug_trace,auth_plugin_mysql_native_password,auth_plugin_mysql_clear_password,auth_plugin_sha256_password API Extensions => pdo_mysql mysqlnd statistics => bytes_sent => 0 bytes_received => 0 packets_sent => 0 packets_received => 0 protocol_overhead_in => 0 protocol_overhead_out => 0 bytes_received_ok_packet => 0 bytes_received_eof_packet => 0 bytes_received_rset_header_packet => 0 bytes_received_rset_field_meta_packet => 0 bytes_received_rset_row_packet => 0 bytes_received_prepare_response_packet => 0 bytes_received_change_user_packet => 0 packets_sent_command => 0 packets_received_ok => 0 packets_received_eof => 0 packets_received_rset_header => 0 packets_received_rset_field_meta => 0 packets_received_rset_row => 0 packets_received_prepare_response => 0 packets_received_change_user => 0 result_set_queries => 0 non_result_set_queries => 0 no_index_used => 0 bad_index_used => 0 slow_queries => 0 buffered_sets => 0 unbuffered_sets => 0 ps_buffered_sets => 0 ps_unbuffered_sets => 0 flushed_normal_sets => 0 flushed_ps_sets => 0 ps_prepared_never_executed => 0 ps_prepared_once_executed => 0 rows_fetched_from_server_normal => 0 rows_fetched_from_server_ps => 0 rows_buffered_from_client_normal => 0 rows_buffered_from_client_ps => 0 rows_fetched_from_client_normal_buffered => 0 rows_fetched_from_client_normal_unbuffered => 0 rows_fetched_from_client_ps_buffered => 0 rows_fetched_from_client_ps_unbuffered => 0 rows_fetched_from_client_ps_cursor => 0 rows_affected_normal => 0 rows_affected_ps => 0 rows_skipped_normal => 0 rows_skipped_ps => 0 copy_on_write_saved => 0 copy_on_write_performed => 0 command_buffer_too_small => 0 connect_success => 0 connect_failure => 0 connection_reused => 0 reconnect => 0 pconnect_success => 0 active_connections => 0 active_persistent_connections => 0 explicit_close => 0 implicit_close => 0 disconnect_close => 0 in_middle_of_command_close => 0 explicit_free_result => 0 implicit_free_result => 0 explicit_stmt_close => 0 implicit_stmt_close => 0 mem_emalloc_count => 0 mem_emalloc_amount => 0 mem_ecalloc_count => 0 mem_ecalloc_amount => 0 mem_erealloc_count => 0 mem_erealloc_amount => 0 mem_efree_count => 0 mem_efree_amount => 0 mem_malloc_count => 0 mem_malloc_amount => 0 mem_calloc_count => 0 mem_calloc_amount => 0 mem_realloc_count => 0 mem_realloc_amount => 0 mem_free_count => 0 mem_free_amount => 0 mem_estrndup_count => 0 mem_strndup_count => 0 mem_estrdup_count => 0 mem_strdup_count => 0 mem_edupl_count => 0 mem_dupl_count => 0 proto_text_fetched_null => 0 proto_text_fetched_bit => 0 proto_text_fetched_tinyint => 0 proto_text_fetched_short => 0 proto_text_fetched_int24 => 0 proto_text_fetched_int => 0 proto_text_fetched_bigint => 0 proto_text_fetched_decimal => 0 proto_text_fetched_float => 0 proto_text_fetched_double => 0 proto_text_fetched_date => 0 proto_text_fetched_year => 0 proto_text_fetched_time => 0 proto_text_fetched_datetime => 0 proto_text_fetched_timestamp => 0 proto_text_fetched_string => 0 proto_text_fetched_blob => 0 proto_text_fetched_enum => 0 proto_text_fetched_set => 0 proto_text_fetched_geometry => 0 proto_text_fetched_other => 0 proto_binary_fetched_null => 0 proto_binary_fetched_bit => 0 proto_binary_fetched_tinyint => 0 proto_binary_fetched_short => 0 proto_binary_fetched_int24 => 0 proto_binary_fetched_int => 0 proto_binary_fetched_bigint => 0 proto_binary_fetched_decimal => 0 proto_binary_fetched_float => 0 proto_binary_fetched_double => 0 proto_binary_fetched_date => 0 proto_binary_fetched_year => 0 proto_binary_fetched_time => 0 proto_binary_fetched_datetime => 0 proto_binary_fetched_timestamp => 0 proto_binary_fetched_string => 0 proto_binary_fetched_json => 0 proto_binary_fetched_blob => 0 proto_binary_fetched_enum => 0 proto_binary_fetched_set => 0 proto_binary_fetched_geometry => 0 proto_binary_fetched_other => 0 init_command_executed_count => 0 init_command_failed_count => 0 com_quit => 0 com_init_db => 0 com_query => 0 com_field_list => 0 com_create_db => 0 com_drop_db => 0 com_refresh => 0 com_shutdown => 0 com_statistics => 0 com_process_info => 0 com_connect => 0 com_process_kill => 0 com_debug => 0 com_ping => 0 com_time => 0 com_delayed_insert => 0 com_change_user => 0 com_binlog_dump => 0 com_table_dump => 0 com_connect_out => 0 com_register_slave => 0 com_stmt_prepare => 0 com_stmt_execute => 0 com_stmt_send_long_data => 0 com_stmt_close => 0 com_stmt_reset => 0 com_stmt_set_option => 0 com_stmt_fetch => 0 com_deamon => 0 bytes_received_real_data_normal => 0 bytes_received_real_data_ps => 0 odbc ODBC Support => enabled Active Persistent Links => 0 Active Links => 0 ODBC library => unixODBC ODBCVER => 0x0380 ODBC_INCLUDE => -I/usr/include ODBC_LFLAGS => -L/usr/lib ODBC_LIBS => -lodbc Directive => Local Value => Master Value odbc.allow_persistent => On => On odbc.check_persistent => On => On odbc.default_cursortype => Static cursor => Static cursor odbc.default_db => no value => no value odbc.default_pw => no value => no value odbc.default_user => no value => no value odbc.defaultbinmode => return as is => return as is odbc.defaultlrl => return up to 4096 bytes => return up to 4096 bytes odbc.max_links => Unlimited => Unlimited odbc.max_persistent => Unlimited => Unlimited openssl OpenSSL support => enabled OpenSSL Library Version => OpenSSL 1.0.2k-fips 26 Jan 2017 OpenSSL Header Version => OpenSSL 1.0.2k-fips 26 Jan 2017 Openssl default config => /etc/pki/tls/openssl.cnf Directive => Local Value => Master Value openssl.cafile => no value => no value openssl.capath => no value => no value pcntl pcntl support => enabled pcre PCRE (Perl Compatible Regular Expressions) Support => enabled PCRE Library Version => 8.41 2017-07-05 PCRE JIT Support => enabled Directive => Local Value => Master Value pcre.backtrack_limit => 1000000 => 1000000 pcre.jit => 1 => 1 pcre.recursion_limit => 100000 => 100000 PDO PDO support => enabled PDO drivers => sqlite, mysql pdo_mysql PDO Driver for MySQL => enabled Client API version => mysqlnd 5.0.12-dev - 20150407 - $Id: 38fea24f2847fa7519001be390c98ae0acafe387 $ Directive => Local Value => Master Value pdo_mysql.default_socket => /tmp/mysql.sock => /tmp/mysql.sock pdo_sqlite PDO Driver for SQLite 3.x => enabled SQLite Library => 3.20.1 Reflection Reflection => enabled Version => $Id: 991f0da341ffa07e5bf7e30e3718b33cf8b586a0 $ session Session Support => enabled Registered save handlers => files user Registered serializer handlers => php_serialize php php_binary Directive => Local Value => Master Value session.auto_start => Off => Off session.cache_expire => 180 => 180 session.cache_limiter => nocache => nocache session.cookie_domain => no value => no value session.cookie_httponly => 0 => 0 session.cookie_lifetime => 0 => 0 session.cookie_path => / => / session.cookie_secure => 0 => 0 session.gc_divisor => 100 => 100 session.gc_maxlifetime => 1440 => 1440 session.gc_probability => 1 => 1 session.lazy_write => On => On session.name => PHPSESSID => PHPSESSID session.referer_check => no value => no value session.save_handler => files => files session.save_path => no value => no value session.serialize_handler => php => php session.sid_bits_per_character => 4 => 4 session.sid_length => 32 => 32 session.upload_progress.cleanup => On => On session.upload_progress.enabled => On => On session.upload_progress.freq => 1% => 1% session.upload_progress.min_freq => 1 => 1 session.upload_progress.name => PHP_SESSION_UPLOAD_PROGRESS => PHP_SESSION_UPLOAD_PROGRESS session.upload_progress.prefix => upload_progress_ => upload_progress_ session.use_cookies => 1 => 1 session.use_only_cookies => 1 => 1 session.use_strict_mode => 0 => 0 session.use_trans_sid => 0 => 0 shmop shmop support => enabled SimpleXML Simplexml support => enabled Revision => $Id: 341daed0ee94ea8f728bfd0ba4626e6ed365c0d1 $ Schema support => enabled sockets Sockets Support => enabled SPL SPL support => enabled Interfaces => OuterIterator, RecursiveIterator, SeekableIterator, SplObserver, SplSubject Classes => AppendIterator, ArrayIterator, ArrayObject, BadFunctionCallException, BadMethodCallException, CachingIterator, CallbackFilterIterator, DirectoryIterator, DomainException, EmptyIterator, FilesystemIterator, FilterIterator, GlobIterator, InfiniteIterator, InvalidArgumentException, IteratorIterator, LengthException, LimitIterator, LogicException, MultipleIterator, NoRewindIterator, OutOfBoundsException, OutOfRangeException, OverflowException, ParentIterator, RangeException, RecursiveArrayIterator, RecursiveCachingIterator, RecursiveCallbackFilterIterator, RecursiveDirectoryIterator, RecursiveFilterIterator, RecursiveIteratorIterator, RecursiveRegexIterator, RecursiveTreeIterator, RegexIterator, RuntimeException, SplDoublyLinkedList, SplFileInfo, SplFileObject, SplFixedArray, SplHeap, SplMinHeap, SplMaxHeap, SplObjectStorage, SplPriorityQueue, SplQueue, SplStack, SplTempFileObject, UnderflowException, UnexpectedValueException sqlite3 SQLite3 support => enabled SQLite3 module version => 7.2.5 SQLite Library => 3.20.1 Directive => Local Value => Master Value sqlite3.extension_dir => no value => no value standard Dynamic Library Support => enabled Path to sendmail => /usr/sbin/sendmail -t -i Directive => Local Value => Master Value assert.active => 1 => 1 assert.bail => 0 => 0 assert.callback => no value => no value assert.exception => 0 => 0 assert.quiet_eval => 0 => 0 assert.warning => 1 => 1 auto_detect_line_endings => 0 => 0 default_socket_timeout => 60 => 60 from => no value => no value session.trans_sid_hosts => no value => no value session.trans_sid_tags => a=href,area=href,frame=src,form= => a=href,area=href,frame=src,form= url_rewriter.hosts => no value => no value url_rewriter.tags => form= => form= user_agent => no value => no value tokenizer Tokenizer Support => enabled xml XML Support => active XML Namespace Support => active libxml2 Version => 2.9.1 zlib ZLib Support => enabled Stream Wrapper => compress.zlib:// Stream Filter => zlib.inflate, zlib.deflate Compiled Version => 1.2.7 Linked Version => 1.2.7 Directive => Local Value => Master Value zlib.output_compression => Off => Off zlib.output_compression_level => -1 => -1 zlib.output_handler => no value => no value Additional Modules Module Name Environment Variable => Value XDG_SESSION_ID => 117 HOSTNAME => meow-las1-windx.meowintl.com TEST_PHP_SRCDIR => /home/admin/src/php-7.2.5 SELINUX_ROLE_REQUESTED => SHELL => /bin/bash TERM => xterm-color MAKEFLAGS => HISTSIZE => 1000 SSH_CLIENT => deleted TEST_PHPDBG_EXECUTABLE => /home/admin/src/php-7.2.5/sapi/phpdbg/phpdbg SELINUX_USE_CURRENT_RANGE => SSH_TTY => deleted USER => admin LS_COLORS => rs=0:di=01;34:ln=01;36:mh=00:pi=40;33:so=01;35:do=01;35:bd=40;33;01:cd=40;33;01:or=40;31;01:mi=01;05;37;41:su=37;41:sg=30;43:ca=30;41:tw=30;42:ow=34;42:st=37;44:ex=01;32:*.tar=01;31:*.tgz=01;31:*.arc=01;31:*.arj=01;31:*.taz=01;31:*.lha=01;31:*.lz4=01;31:*.lzh=01;31:*.lzma=01;31:*.tlz=01;31:*.txz=01;31:*.tzo=01;31:*.t7z=01;31:*.zip=01;31:*.z=01;31:*.Z=01;31:*.dz=01;31:*.gz=01;31:*.lrz=01;31:*.lz=01;31:*.lzo=01;31:*.xz=01;31:*.bz2=01;31:*.bz=01;31:*.tbz=01;31:*.tbz2=01;31:*.tz=01;31:*.deb=01;31:*.rpm=01;31:*.jar=01;31:*.war=01;31:*.ear=01;31:*.sar=01;31:*.rar=01;31:*.alz=01;31:*.ace=01;31:*.zoo=01;31:*.cpio=01;31:*.7z=01;31:*.rz=01;31:*.cab=01;31:*.jpg=01;35:*.jpeg=01;35:*.gif=01;35:*.bmp=01;35:*.pbm=01;35:*.pgm=01;35:*.ppm=01;35:*.tga=01;35:*.xbm=01;35:*.xpm=01;35:*.tif=01;35:*.tiff=01;35:*.png=01;35:*.svg=01;35:*.svgz=01;35:*.mng=01;35:*.pcx=01;35:*.mov=01;35:*.mpg=01;35:*.mpeg=01;35:*.m2v=01;35:*.mkv=01;35:*.webm=01;35:*.ogm=01;35:*.mp4=01;35:*.m4v=01;35:*.mp4v=01;35:*.vob=01;35:*.qt=01;35:*.nuv=01;35:*.wmv=01;35:*.asf=01;35:*.rm=01;35:*.rmvb=01;35:*.flc=01;35:*.avi=01;35:*.fli=01;35:*.flv=01;35:*.gl=01;35:*.dl=01;35:*.xcf=01;35:*.xwd=01;35:*.yuv=01;35:*.cgm=01;35:*.emf=01;35:*.axv=01;35:*.anx=01;35:*.ogv=01;35:*.ogx=01;35:*.aac=01;36:*.au=01;36:*.flac=01;36:*.mid=01;36:*.midi=01;36:*.mka=01;36:*.mp3=01;36:*.mpc=01;36:*.ogg=01;36:*.ra=01;36:*.wav=01;36:*.axa=01;36:*.oga=01;36:*.spx=01;36:*.xspf=01;36: SSH_AUTH_SOCK => deleted MAKELEVEL => 1 MFLAGS => PATH => /usr/local/bin:/usr/bin:/usr/local/sbin:/usr/sbin:/home/admin/.local/bin:/home/admin/bin MAIL => /var/spool/mail/admin _ => /home/admin/src/php-7.2.5/sapi/cli/php PWD => /home/admin/src/php-7.2.5 LANG => en_US.UTF-8 TEST_PHP_EXECUTABLE => /home/admin/src/php-7.2.5/sapi/cli/php SELINUX_LEVEL_REQUESTED => HISTCONTROL => ignoredups HOME => /home/admin SHLVL => 3 LOGNAME => admin SSH_CONNECTION => deleted LESSOPEN => ||/usr/bin/lesspipe.sh %s XDG_RUNTIME_DIR => /run/user/1000 CC => cc PHP Variables Variable => Value $_SERVER['XDG_SESSION_ID'] => 117 $_SERVER['HOSTNAME'] => meow-las1-windx.meowintl.com $_SERVER['TEST_PHP_SRCDIR'] => /home/admin/src/php-7.2.5 $_SERVER['SELINUX_ROLE_REQUESTED'] => $_SERVER['SHELL'] => /bin/bash $_SERVER['TERM'] => xterm-color $_SERVER['MAKEFLAGS'] => $_SERVER['HISTSIZE'] => 1000 $_SERVER['SSH_CLIENT'] => deleted $_SERVER['TEST_PHPDBG_EXECUTABLE'] => /home/admin/src/php-7.2.5/sapi/phpdbg/phpdbg $_SERVER['SELINUX_USE_CURRENT_RANGE'] => $_SERVER['SSH_TTY'] => deleted $_SERVER['USER'] => admin $_SERVER['LS_COLORS'] => rs=0:di=01;34:ln=01;36:mh=00:pi=40;33:so=01;35:do=01;35:bd=40;33;01:cd=40;33;01:or=40;31;01:mi=01;05;37;41:su=37;41:sg=30;43:ca=30;41:tw=30;42:ow=34;42:st=37;44:ex=01;32:*.tar=01;31:*.tgz=01;31:*.arc=01;31:*.arj=01;31:*.taz=01;31:*.lha=01;31:*.lz4=01;31:*.lzh=01;31:*.lzma=01;31:*.tlz=01;31:*.txz=01;31:*.tzo=01;31:*.t7z=01;31:*.zip=01;31:*.z=01;31:*.Z=01;31:*.dz=01;31:*.gz=01;31:*.lrz=01;31:*.lz=01;31:*.lzo=01;31:*.xz=01;31:*.bz2=01;31:*.bz=01;31:*.tbz=01;31:*.tbz2=01;31:*.tz=01;31:*.deb=01;31:*.rpm=01;31:*.jar=01;31:*.war=01;31:*.ear=01;31:*.sar=01;31:*.rar=01;31:*.alz=01;31:*.ace=01;31:*.zoo=01;31:*.cpio=01;31:*.7z=01;31:*.rz=01;31:*.cab=01;31:*.jpg=01;35:*.jpeg=01;35:*.gif=01;35:*.bmp=01;35:*.pbm=01;35:*.pgm=01;35:*.ppm=01;35:*.tga=01;35:*.xbm=01;35:*.xpm=01;35:*.tif=01;35:*.tiff=01;35:*.png=01;35:*.svg=01;35:*.svgz=01;35:*.mng=01;35:*.pcx=01;35:*.mov=01;35:*.mpg=01;35:*.mpeg=01;35:*.m2v=01;35:*.mkv=01;35:*.webm=01;35:*.ogm=01;35:*.mp4=01;35:*.m4v=01;35:*.mp4v=01;35:*.vob=01;35:*.qt=01;35:*.nuv=01;35:*.wmv=01;35:*.asf=01;35:*.rm=01;35:*.rmvb=01;35:*.flc=01;35:*.avi=01;35:*.fli=01;35:*.flv=01;35:*.gl=01;35:*.dl=01;35:*.xcf=01;35:*.xwd=01;35:*.yuv=01;35:*.cgm=01;35:*.emf=01;35:*.axv=01;35:*.anx=01;35:*.ogv=01;35:*.ogx=01;35:*.aac=01;36:*.au=01;36:*.flac=01;36:*.mid=01;36:*.midi=01;36:*.mka=01;36:*.mp3=01;36:*.mpc=01;36:*.ogg=01;36:*.ra=01;36:*.wav=01;36:*.axa=01;36:*.oga=01;36:*.spx=01;36:*.xspf=01;36: $_SERVER['SSH_AUTH_SOCK'] => deleted $_SERVER['MAKELEVEL'] => 1 $_SERVER['MFLAGS'] => $_SERVER['PATH'] => /usr/local/bin:/usr/bin:/usr/local/sbin:/usr/sbin:/home/admin/.local/bin:/home/admin/bin $_SERVER['MAIL'] => /var/spool/mail/admin $_SERVER['_'] => /home/admin/src/php-7.2.5/sapi/cli/php $_SERVER['PWD'] => /home/admin/src/php-7.2.5 $_SERVER['LANG'] => en_US.UTF-8 $_SERVER['TEST_PHP_EXECUTABLE'] => /home/admin/src/php-7.2.5/sapi/cli/php $_SERVER['SELINUX_LEVEL_REQUESTED'] => $_SERVER['HISTCONTROL'] => ignoredups $_SERVER['HOME'] => /home/admin $_SERVER['SHLVL'] => 3 $_SERVER['LOGNAME'] => admin $_SERVER['SSH_CONNECTION'] => deleted $_SERVER['LESSOPEN'] => ||/usr/bin/lesspipe.sh %s $_SERVER['XDG_RUNTIME_DIR'] => /run/user/1000 $_SERVER['CC'] => cc $_SERVER['PHP_SELF'] => $_SERVER['SCRIPT_NAME'] => $_SERVER['SCRIPT_FILENAME'] => $_SERVER['PATH_TRANSLATED'] => $_SERVER['DOCUMENT_ROOT'] => $_SERVER['REQUEST_TIME_FLOAT'] => 1526329417.1476 $_SERVER['REQUEST_TIME'] => 1526329417 $_SERVER['argv'] => Array ( ) $_SERVER['argc'] => 0 $_ENV['XDG_SESSION_ID'] => 117 $_ENV['HOSTNAME'] => meow-las1-windx.meowintl.com $_ENV['TEST_PHP_SRCDIR'] => /home/admin/src/php-7.2.5 $_ENV['SELINUX_ROLE_REQUESTED'] => $_ENV['SHELL'] => /bin/bash $_ENV['TERM'] => xterm-color $_ENV['MAKEFLAGS'] => $_ENV['HISTSIZE'] => 1000 $_ENV['SSH_CLIENT'] => deleted $_ENV['TEST_PHPDBG_EXECUTABLE'] => /home/admin/src/php-7.2.5/sapi/phpdbg/phpdbg $_ENV['SELINUX_USE_CURRENT_RANGE'] => $_ENV['SSH_TTY'] => deleted $_ENV['USER'] => admin $_ENV['LS_COLORS'] => rs=0:di=01;34:ln=01;36:mh=00:pi=40;33:so=01;35:do=01;35:bd=40;33;01:cd=40;33;01:or=40;31;01:mi=01;05;37;41:su=37;41:sg=30;43:ca=30;41:tw=30;42:ow=34;42:st=37;44:ex=01;32:*.tar=01;31:*.tgz=01;31:*.arc=01;31:*.arj=01;31:*.taz=01;31:*.lha=01;31:*.lz4=01;31:*.lzh=01;31:*.lzma=01;31:*.tlz=01;31:*.txz=01;31:*.tzo=01;31:*.t7z=01;31:*.zip=01;31:*.z=01;31:*.Z=01;31:*.dz=01;31:*.gz=01;31:*.lrz=01;31:*.lz=01;31:*.lzo=01;31:*.xz=01;31:*.bz2=01;31:*.bz=01;31:*.tbz=01;31:*.tbz2=01;31:*.tz=01;31:*.deb=01;31:*.rpm=01;31:*.jar=01;31:*.war=01;31:*.ear=01;31:*.sar=01;31:*.rar=01;31:*.alz=01;31:*.ace=01;31:*.zoo=01;31:*.cpio=01;31:*.7z=01;31:*.rz=01;31:*.cab=01;31:*.jpg=01;35:*.jpeg=01;35:*.gif=01;35:*.bmp=01;35:*.pbm=01;35:*.pgm=01;35:*.ppm=01;35:*.tga=01;35:*.xbm=01;35:*.xpm=01;35:*.tif=01;35:*.tiff=01;35:*.png=01;35:*.svg=01;35:*.svgz=01;35:*.mng=01;35:*.pcx=01;35:*.mov=01;35:*.mpg=01;35:*.mpeg=01;35:*.m2v=01;35:*.mkv=01;35:*.webm=01;35:*.ogm=01;35:*.mp4=01;35:*.m4v=01;35:*.mp4v=01;35:*.vob=01;35:*.qt=01;35:*.nuv=01;35:*.wmv=01;35:*.asf=01;35:*.rm=01;35:*.rmvb=01;35:*.flc=01;35:*.avi=01;35:*.fli=01;35:*.flv=01;35:*.gl=01;35:*.dl=01;35:*.xcf=01;35:*.xwd=01;35:*.yuv=01;35:*.cgm=01;35:*.emf=01;35:*.axv=01;35:*.anx=01;35:*.ogv=01;35:*.ogx=01;35:*.aac=01;36:*.au=01;36:*.flac=01;36:*.mid=01;36:*.midi=01;36:*.mka=01;36:*.mp3=01;36:*.mpc=01;36:*.ogg=01;36:*.ra=01;36:*.wav=01;36:*.axa=01;36:*.oga=01;36:*.spx=01;36:*.xspf=01;36: $_ENV['SSH_AUTH_SOCK'] => deleted $_ENV['MAKELEVEL'] => 1 $_ENV['MFLAGS'] => $_ENV['PATH'] => /usr/local/bin:/usr/bin:/usr/local/sbin:/usr/sbin:/home/admin/.local/bin:/home/admin/bin $_ENV['MAIL'] => /var/spool/mail/admin $_ENV['_'] => /home/admin/src/php-7.2.5/sapi/cli/php $_ENV['PWD'] => /home/admin/src/php-7.2.5 $_ENV['LANG'] => en_US.UTF-8 $_ENV['TEST_PHP_EXECUTABLE'] => /home/admin/src/php-7.2.5/sapi/cli/php $_ENV['SELINUX_LEVEL_REQUESTED'] => $_ENV['HISTCONTROL'] => ignoredups $_ENV['HOME'] => /home/admin $_ENV['SHLVL'] => 3 $_ENV['LOGNAME'] => admin $_ENV['SSH_CONNECTION'] => deleted $_ENV['LESSOPEN'] => ||/usr/bin/lesspipe.sh %s $_ENV['XDG_RUNTIME_DIR'] => /run/user/1000 $_ENV['CC'] => cc PHP License This program is free software; you can redistribute it and/or modify it under the terms of the PHP License as published by the PHP Group and included in the distribution in the file: LICENSE This program is distributed in the hope that it will be useful, but WITHOUT ANY WARRANTY; without even the implied warranty of MERCHANTABILITY or FITNESS FOR A PARTICULAR PURPOSE. If you did not receive a copy of the PHP license, or have any questions about PHP licensing, please contact license@php.net.
« previous php.qa.reports (#33991) next »