Test report php-7.3.0alpha4

From: Date: Fri, 20 Jul 2018 09:10:40 +0000
Subject: Test report php-7.3.0alpha4
Groups: php.qa.reports 
Request: Send a blank email to php-qa-reports+get-33995@lists.php.net to get a copy of this message
Hi, I'm sending you the test results manually because at the end of the "make test" I received the following error: sh: line 1: 64512 Abort trap: 6 bison --version 2> /dev/null sh: line 1: 64514 Segmentation fault: 11 /Users/dragonbe/tmp/php-7.3.0alpha4/sapi/cli/php -ddisplay_errors=stderr -dhtml_errors=0 -i 2> /dev/null Test report php-7.3.0alpha4 Thank you for your hard work making PHP an awesome technology!!! Michelangelo Michelangelo van Dam Sr. Web Application Architect, Test Automator & Microsoft Azure MVP Mobile/WhatsApp: +32479922951 - Telegram/Twitter: @DragonBe - Skype: michelangelovandam GPG Fingerprint: 5732  D8FE  EDE8  D59F  E59F 1597  70DF  8F88  2024  203C

===================================================================== EXPECTED FAILED TEST SUMMARY --------------------------------------------------------------------- Test open_basedir configuration [tests/security/open_basedir_linkinfo.phpt] XFAIL REASON: BUG: open_basedir cannot delete symlink to prohibited file. See also bugs 48111 and 52176. Inconsistencies when accessing protected members [Zend/tests/access_modifiers_008.phpt] XFAIL REASON: Discussion: http://marc.info/?l=php-internals&m=120221184420957&w=2 Inconsistencies when accessing protected members - 2 [Zend/tests/access_modifiers_009.phpt] XFAIL REASON: Discussion: http://marc.info/?l=php-internals&m=120221184420957&w=2 Bug #48770 (call_user_func_array() fails to call parent from inheriting class) [Zend/tests/bug48770.phpt] XFAIL REASON: See Bug #48770 Bug #48770 (call_user_func_array() fails to call parent from inheriting class) [Zend/tests/bug48770_2.phpt] XFAIL REASON: See Bug #48770 Bug #48770 (call_user_func_array() fails to call parent from inheriting class) [Zend/tests/bug48770_3.phpt] XFAIL REASON: See Bug #48770 Initial value of static var in method depends on the include time of the class definition [Zend/tests/method_static_var.phpt] XFAIL REASON: Maybe not a bug DateTime::add() -- fall type2 type3 [ext/date/tests/DateTime_add-fall-type2-type3.phpt] XFAIL REASON: Various bugs exist DateTime::add() -- fall type3 type2 [ext/date/tests/DateTime_add-fall-type3-type2.phpt] XFAIL REASON: Various bugs exist DateTime::add() -- fall type3 type3 [ext/date/tests/DateTime_add-fall-type3-type3.phpt] XFAIL REASON: Various bugs exist DateTime::add() -- spring type2 type3 [ext/date/tests/DateTime_add-spring-type2-type3.phpt] XFAIL REASON: Various bugs exist DateTime::add() -- spring type3 type2 [ext/date/tests/DateTime_add-spring-type3-type2.phpt] XFAIL REASON: Various bugs exist DateTime::add() -- spring type3 type3 [ext/date/tests/DateTime_add-spring-type3-type3.phpt] XFAIL REASON: Various bugs exist DateTime::diff() -- fall type2 type3 [ext/date/tests/DateTime_diff-fall-type2-type3.phpt] XFAIL REASON: Various bugs exist DateTime::diff() -- fall type3 type2 [ext/date/tests/DateTime_diff-fall-type3-type2.phpt] XFAIL REASON: Various bugs exist DateTime::diff() -- fall type3 type3 [ext/date/tests/DateTime_diff-fall-type3-type3.phpt] XFAIL REASON: Various bugs exist DateTime::diff() -- spring type2 type3 [ext/date/tests/DateTime_diff-spring-type2-type3.phpt] XFAIL REASON: Various bugs exist DateTime::diff() -- spring type3 type2 [ext/date/tests/DateTime_diff-spring-type3-type2.phpt] XFAIL REASON: Various bugs exist DateTime::diff() -- spring type3 type3 [ext/date/tests/DateTime_diff-spring-type3-type3.phpt] XFAIL REASON: Various bugs exist DateTime::sub() -- fall type2 type3 [ext/date/tests/DateTime_sub-fall-type2-type3.phpt] XFAIL REASON: Various bugs exist DateTime::sub() -- fall type3 type2 [ext/date/tests/DateTime_sub-fall-type3-type2.phpt] XFAIL REASON: Various bugs exist DateTime::sub() -- fall type3 type3 [ext/date/tests/DateTime_sub-fall-type3-type3.phpt] XFAIL REASON: Various bugs exist DateTime::sub() -- spring type2 type3 [ext/date/tests/DateTime_sub-spring-type2-type3.phpt] XFAIL REASON: Various bugs exist DateTime::sub() -- spring type3 type2 [ext/date/tests/DateTime_sub-spring-type3-type2.phpt] XFAIL REASON: Various bugs exist DateTime::sub() -- spring type3 type3 [ext/date/tests/DateTime_sub-spring-type3-type3.phpt] XFAIL REASON: Various bugs exist Bug #52480 (Incorrect difference using DateInterval) [ext/date/tests/bug52480.phpt] XFAIL REASON: See https://bugs.php.net/bug.php?id=52480 RFC: DateTime and Daylight Saving Time Transitions (zone type 3, bd2) [ext/date/tests/rfc-datetime_and_daylight_saving_time-type3-bd2.phpt] XFAIL REASON: Still not quite right RFC: DateTime and Daylight Saving Time Transitions (zone type 3, fs) [ext/date/tests/rfc-datetime_and_daylight_saving_time-type3-fs.phpt] XFAIL REASON: Still not quite right Bug #42718 (unsafe_raw filter not applied when configured as default filter) [ext/filter/tests/bug42718.phpt] XFAIL REASON: FILTER_UNSAFE_RAW not applied when configured as default filter, even with flags Bug #67296 (filter_input doesn't validate variables) [ext/filter/tests/bug49184.phpt] XFAIL REASON: See Bug #49184 Bug #67167: filter_var(null,FILTER_VALIDATE_BOOLEAN,FILTER_NULL_ON_FAILURE) returns null [ext/filter/tests/bug67167.02.phpt] XFAIL REASON: Requires php_zval_filter to not use convert_to_string for all filters. via [ext/pdo_sqlite/tests/common.phpt] SQLite PDO Common: PDOStatement::getColumnMeta [ext/pdo_sqlite/tests/pdo_022.phpt] XFAIL REASON: This feature is not yet finalized, no test makes sense Phar: bug #69958: Segfault in Phar::convertToData on invalid file [ext/phar/tests/bug69958.phpt] XFAIL REASON: Still has memory leaks, see https://bugs.php.net/bug.php?id=70005 updateTimestamp never called when session data is empty [ext/session/tests/bug71162.phpt] XFAIL REASON: Current session module is designed to write empty session always. In addition, current session module only supports SessionHandlerInterface only from PHP 7.0. Bug #73529 session_decode() silently fails on wrong input [ext/session/tests/bug73529.phpt] XFAIL REASON: session_decode() does not return proper status. Bug #70219 Use after free vulnerability in session deserializer [ext/standard/tests/serialize/bug70219.phpt] XFAIL REASON: Unfinished merge, needs fix. ===================================================================== ===================================================================== FAILED TEST SUMMARY --------------------------------------------------------------------- Blacklist (with glob, quote and comments) [ext/opcache/tests/blacklist.phpt] Bug #66338 (Optimization binding of class constants is not safely opcacheable) [ext/opcache/tests/bug66338.phpt] ISSUE #115 (path issue when using phar) [ext/opcache/tests/issue0115.phpt] ISSUE #149 (Phar mount points not working this OPcache enabled) [ext/opcache/tests/issue0149.phpt] revalidate_path 01: OPCache must cache only resolved real paths when revalidate_path is set [ext/opcache/tests/revalidate_path_01.phpt] #46127, openssl_sign/verify: accept different algos [ext/openssl/tests/bug46127.phpt] Bug #48182: ssl handshake fails during asynchronous socket connection [ext/openssl/tests/bug48182.phpt] Bug #54992: Stream not closed and error not returned when SSL CN_match fails [ext/openssl/tests/bug54992.phpt] Bug #65538: SSL context "cafile" supports stream wrappers [ext/openssl/tests/bug65538_001.phpt] Bug #65538: SSL context "cafile" supports phar wrapper [ext/openssl/tests/bug65538_003.phpt] Bug #65729: CN_match gives false positive when wildcard is used [ext/openssl/tests/bug65729.phpt] Bug #68265: SAN match fails with trailing DNS dot [ext/openssl/tests/bug68265.phpt] Bug #68879: Match IP address fields in subjectAltName checks [ext/openssl/tests/bug68879.phpt] Bug #68920: peer_fingerprint input checks should be strict [ext/openssl/tests/bug68920.phpt] Bug #69215: Crypto servers should send client CA list [ext/openssl/tests/bug69215.phpt] Bug #72333: fwrite() on non-blocking SSL sockets doesn't work [ext/openssl/tests/bug72333.phpt] Bug #73072: Invalid path SNI_server_certs causes segfault [ext/openssl/tests/bug73072.phpt] Bug #74159: Writing a large buffer to non-blocking encrypted streams fails [ext/openssl/tests/bug74159.phpt] capture_peer_cert context captures on verify failure [ext/openssl/tests/capture_peer_cert_001.phpt] Testing peer fingerprint on connection [ext/openssl/tests/openssl_peer_fingerprint_basic.phpt] Peer verification enabled for client streams [ext/openssl/tests/peer_verification.phpt] Peer verification matches SAN names [ext/openssl/tests/san_peer_matching.phpt] Capture SSL session meta array in stream context [ext/openssl/tests/session_meta_capture.phpt] sni_server [ext/openssl/tests/sni_server.phpt] sni_server with separate pk and cert [ext/openssl/tests/sni_server_key_cert.phpt] Basic bitwise stream crypto context flag assignment [ext/openssl/tests/stream_crypto_flags_001.phpt] TLSv1.1 and TLSv1.2 bitwise stream crypto flag assignment [ext/openssl/tests/stream_crypto_flags_002.phpt] Server bitwise stream crypto flag assignment [ext/openssl/tests/stream_crypto_flags_003.phpt] Specific protocol method specification [ext/openssl/tests/stream_crypto_flags_004.phpt] TLS server rate-limits client-initiated renegotiation [ext/openssl/tests/stream_server_reneg_limit.phpt] Allow host name mismatch when "verify_host" disabled [ext/openssl/tests/stream_verify_peer_name_002.phpt] Host name mismatch triggers error [ext/openssl/tests/stream_verify_peer_name_003.phpt] Specific crypto method for ssl:// transports. [ext/openssl/tests/streams_crypto_method.phpt] tls stream wrapper with min version 1.0 and max version 1.1 [ext/openssl/tests/tls_min_v1.0_max_v1.1_wrapper.phpt] tls stream wrapper [ext/openssl/tests/tls_wrapper.phpt] tlsv1.0 stream wrapper [ext/openssl/tests/tlsv1.0_wrapper.phpt] tlsv1.1 stream wrapper [ext/openssl/tests/tlsv1.1_wrapper.phpt] tlsv1.2 stream wrapper [ext/openssl/tests/tlsv1.2_wrapper.phpt] Multicast support: IPv6 send options [ext/sockets/tests/mcast_ipv6_send.phpt] recvmsg(): receive SCM_CREDENTIALS messages [ext/sockets/tests/socket_cmsg_rights.phpt] ext/sockets - socket_getpeername_ipv6loop - basic test [ext/sockets/tests/socket_getpeername_ipv6loop.phpt] int socket_send ( resource $socket , string $buf , int $len , int $flags ); [ext/sockets/tests/socket_send.phpt] bool socket_shutdown ( resource $socket [, int $how = 2 ] ) ; [ext/sockets/tests/socket_shutdown.phpt] bool checkdnsrr ( string $host [, string $type = "MX" ] ); [ext/standard/tests/checkdnsrr.phpt] array dns_get_record ( string $hostname [, int $type = DNS_ANY [, array &$authns [, array &$addtl [, bool &$raw = false ]]]] ); [ext/standard/tests/dns_get_record.phpt] proc_open with PTY closes incorrect file descriptor [ext/standard/tests/file/bug69442.phpt] php_ini_loaded_file() function [ext/standard/tests/ini_info/php_ini_loaded_file.phpt] Bug #73594 (dns_get_record() does not populate $additional out parameter) [ext/standard/tests/network/bug73594.phpt] stream context tcp_nodelay server [ext/standard/tests/streams/stream_context_tcp_nodelay_server.phpt] mixed stream_socket_enable_crypto(resource $stream , bool $enable [, int $crypto_type [, resource $session_stream ]] ) ; [ext/standard/tests/streams/stream_socket_enable_crypto.phpt] int stream_socket_sendto ( resource $socket , string $data [, int $flags = 0 [, string $address ]] ); [ext/standard/tests/streams/stream_socket_sendto.phpt] ZipArchive::addGlob() method [ext/zip/tests/oo_addglob.phpt] Bug #55544 (ob_gzhandler always conflicts with zlib.output_compression) [ext/zlib/tests/bug55544.phpt] Test gzencode() function : variation [ext/zlib/tests/gzencode_variation1.phpt] Test gzencode() function : variation - verify header contents with all encoding modes [ext/zlib/tests/gzencode_variation2.phpt] CLI -a and libedit [sapi/cli/tests/017.phpt] HOST/PATH ini sections test for cli [sapi/cli/tests/023.phpt] Bug #74600 (crash (SIGSEGV) in _zend_hash_add_or_update_i) [sapi/cli/tests/bug74600.phpt] cli_get_process_title() function : basic functionality [sapi/cli/tests/cli_get_process_title_basic.phpt] Check cli_process_title support on Unix [sapi/cli/tests/cli_process_title_unix.phpt] cli_set_process_title() function : basic functionality [sapi/cli/tests/cli_set_process_title_basic.phpt] Fundamental breakpoints functionality [sapi/phpdbg/tests/breakpoints_001.phpt] Preserve breakpoints on restart [sapi/phpdbg/tests/breakpoints_002.phpt] Test deleting breakpoints [sapi/phpdbg/tests/breakpoints_003.phpt] Test opcode breakpoints [sapi/phpdbg/tests/breakpoints_004.phpt] Basic function breakpoints [sapi/phpdbg/tests/breakpoints_006.phpt] Test namespaced and non-lowercase breakpoint names [sapi/phpdbg/tests/breakpoints_008.phpt] Bug #73704 (phpdbg shows the wrong line in files with shebang) [sapi/phpdbg/tests/bug73704.phpt] Cleaning must preserve breakpoints [sapi/phpdbg/tests/clean_001.phpt] Test clearing breakpoints [sapi/phpdbg/tests/clear_001.phpt] Properly handle exceptions going to be uncaught [sapi/phpdbg/tests/exceptions_001.phpt] Test exceptions in eval during exception [sapi/phpdbg/tests/exceptions_002.phpt] Ensure proper saving of EX(opline) [sapi/phpdbg/tests/generator_run.phpt] include_once must include only once [sapi/phpdbg/tests/include_once.phpt] Test basic info functionality [sapi/phpdbg/tests/info_001.phpt] A script with die() must end "normally" [sapi/phpdbg/tests/normal_exit.phpt] Test phpdbg_break_next() function [sapi/phpdbg/tests/phpdbg_break_next.phpt] Getting executable lines from custom wrappers [sapi/phpdbg/tests/phpdbg_get_executable_stream_wrapper.phpt] Test phpdbg_*_oplog() functions [sapi/phpdbg/tests/phpdbg_oplog_001.phpt] Test argv passing [sapi/phpdbg/tests/run_001.phpt] Stdin and escaped args being passed to run command [sapi/phpdbg/tests/run_002.phpt] set_exception_handler() in phpdbg [sapi/phpdbg/tests/set_exception_handler.phpt] Test stdin input with breakpoints [sapi/phpdbg/tests/stdin_001.phpt] Test simple recursive watchpoint [sapi/phpdbg/tests/watch_001.phpt] Test simple array watchpoint with replace [sapi/phpdbg/tests/watch_002.phpt] Test simple watchpoint with replace [sapi/phpdbg/tests/watch_003.phpt] Test detection of inline string manipulations on zval watch [sapi/phpdbg/tests/watch_004.phpt] Test proper watch comparisons when having multiple levels of indirection from a zval to its value [sapi/phpdbg/tests/watch_005.phpt] Test multiple watch elements pointing to the same watchpoint [sapi/phpdbg/tests/watch_006.phpt] ===================================================================== ===================================================================== TEST RESULT SUMMARY --------------------------------------------------------------------- Exts skipped : 38 Exts tested : 37 --------------------------------------------------------------------- Number of tests : 15985 12256 Tests skipped : 3729 ( 23.3%) -------- Tests warned : 0 ( 0.0%) ( 0.0%) Tests failed : 89 ( 0.6%) ( 0.7%) Expected fail : 36 ( 0.2%) ( 0.3%) Tests passed : 12131 ( 75.9%) ( 99.0%) --------------------------------------------------------------------- Time taken : 2386 seconds ===================================================================== ===================================================================== EXPECTED FAILED TEST SUMMARY --------------------------------------------------------------------- Test open_basedir configuration [tests/security/open_basedir_linkinfo.phpt] XFAIL REASON: BUG: open_basedir cannot delete symlink to prohibited file. See also bugs 48111 and 52176. Inconsistencies when accessing protected members [Zend/tests/access_modifiers_008.phpt] XFAIL REASON: Discussion: http://marc.info/?l=php-internals&m=120221184420957&w=2 Inconsistencies when accessing protected members - 2 [Zend/tests/access_modifiers_009.phpt] XFAIL REASON: Discussion: http://marc.info/?l=php-internals&m=120221184420957&w=2 Bug #48770 (call_user_func_array() fails to call parent from inheriting class) [Zend/tests/bug48770.phpt] XFAIL REASON: See Bug #48770 Bug #48770 (call_user_func_array() fails to call parent from inheriting class) [Zend/tests/bug48770_2.phpt] XFAIL REASON: See Bug #48770 Bug #48770 (call_user_func_array() fails to call parent from inheriting class) [Zend/tests/bug48770_3.phpt] XFAIL REASON: See Bug #48770 Initial value of static var in method depends on the include time of the class definition [Zend/tests/method_static_var.phpt] XFAIL REASON: Maybe not a bug DateTime::add() -- fall type2 type3 [ext/date/tests/DateTime_add-fall-type2-type3.phpt] XFAIL REASON: Various bugs exist DateTime::add() -- fall type3 type2 [ext/date/tests/DateTime_add-fall-type3-type2.phpt] XFAIL REASON: Various bugs exist DateTime::add() -- fall type3 type3 [ext/date/tests/DateTime_add-fall-type3-type3.phpt] XFAIL REASON: Various bugs exist DateTime::add() -- spring type2 type3 [ext/date/tests/DateTime_add-spring-type2-type3.phpt] XFAIL REASON: Various bugs exist DateTime::add() -- spring type3 type2 [ext/date/tests/DateTime_add-spring-type3-type2.phpt] XFAIL REASON: Various bugs exist DateTime::add() -- spring type3 type3 [ext/date/tests/DateTime_add-spring-type3-type3.phpt] XFAIL REASON: Various bugs exist DateTime::diff() -- fall type2 type3 [ext/date/tests/DateTime_diff-fall-type2-type3.phpt] XFAIL REASON: Various bugs exist DateTime::diff() -- fall type3 type2 [ext/date/tests/DateTime_diff-fall-type3-type2.phpt] XFAIL REASON: Various bugs exist DateTime::diff() -- fall type3 type3 [ext/date/tests/DateTime_diff-fall-type3-type3.phpt] XFAIL REASON: Various bugs exist DateTime::diff() -- spring type2 type3 [ext/date/tests/DateTime_diff-spring-type2-type3.phpt] XFAIL REASON: Various bugs exist DateTime::diff() -- spring type3 type2 [ext/date/tests/DateTime_diff-spring-type3-type2.phpt] XFAIL REASON: Various bugs exist DateTime::diff() -- spring type3 type3 [ext/date/tests/DateTime_diff-spring-type3-type3.phpt] XFAIL REASON: Various bugs exist DateTime::sub() -- fall type2 type3 [ext/date/tests/DateTime_sub-fall-type2-type3.phpt] XFAIL REASON: Various bugs exist DateTime::sub() -- fall type3 type2 [ext/date/tests/DateTime_sub-fall-type3-type2.phpt] XFAIL REASON: Various bugs exist DateTime::sub() -- fall type3 type3 [ext/date/tests/DateTime_sub-fall-type3-type3.phpt] XFAIL REASON: Various bugs exist DateTime::sub() -- spring type2 type3 [ext/date/tests/DateTime_sub-spring-type2-type3.phpt] XFAIL REASON: Various bugs exist DateTime::sub() -- spring type3 type2 [ext/date/tests/DateTime_sub-spring-type3-type2.phpt] XFAIL REASON: Various bugs exist DateTime::sub() -- spring type3 type3 [ext/date/tests/DateTime_sub-spring-type3-type3.phpt] XFAIL REASON: Various bugs exist Bug #52480 (Incorrect difference using DateInterval) [ext/date/tests/bug52480.phpt] XFAIL REASON: See https://bugs.php.net/bug.php?id=52480 RFC: DateTime and Daylight Saving Time Transitions (zone type 3, bd2) [ext/date/tests/rfc-datetime_and_daylight_saving_time-type3-bd2.phpt] XFAIL REASON: Still not quite right RFC: DateTime and Daylight Saving Time Transitions (zone type 3, fs) [ext/date/tests/rfc-datetime_and_daylight_saving_time-type3-fs.phpt] XFAIL REASON: Still not quite right Bug #42718 (unsafe_raw filter not applied when configured as default filter) [ext/filter/tests/bug42718.phpt] XFAIL REASON: FILTER_UNSAFE_RAW not applied when configured as default filter, even with flags Bug #67296 (filter_input doesn't validate variables) [ext/filter/tests/bug49184.phpt] XFAIL REASON: See Bug #49184 Bug #67167: filter_var(null,FILTER_VALIDATE_BOOLEAN,FILTER_NULL_ON_FAILURE) returns null [ext/filter/tests/bug67167.02.phpt] XFAIL REASON: Requires php_zval_filter to not use convert_to_string for all filters. via [ext/pdo_sqlite/tests/common.phpt] SQLite PDO Common: PDOStatement::getColumnMeta [ext/pdo_sqlite/tests/pdo_022.phpt] XFAIL REASON: This feature is not yet finalized, no test makes sense Phar: bug #69958: Segfault in Phar::convertToData on invalid file [ext/phar/tests/bug69958.phpt] XFAIL REASON: Still has memory leaks, see https://bugs.php.net/bug.php?id=70005 updateTimestamp never called when session data is empty [ext/session/tests/bug71162.phpt] XFAIL REASON: Current session module is designed to write empty session always. In addition, current session module only supports SessionHandlerInterface only from PHP 7.0. Bug #73529 session_decode() silently fails on wrong input [ext/session/tests/bug73529.phpt] XFAIL REASON: session_decode() does not return proper status. Bug #70219 Use after free vulnerability in session deserializer [ext/standard/tests/serialize/bug70219.phpt] XFAIL REASON: Unfinished merge, needs fix. ===================================================================== ===================================================================== FAILED TEST SUMMARY --------------------------------------------------------------------- Blacklist (with glob, quote and comments) [ext/opcache/tests/blacklist.phpt] Bug #66338 (Optimization binding of class constants is not safely opcacheable) [ext/opcache/tests/bug66338.phpt] ISSUE #115 (path issue when using phar) [ext/opcache/tests/issue0115.phpt] ISSUE #149 (Phar mount points not working this OPcache enabled) [ext/opcache/tests/issue0149.phpt] revalidate_path 01: OPCache must cache only resolved real paths when revalidate_path is set [ext/opcache/tests/revalidate_path_01.phpt] #46127, openssl_sign/verify: accept different algos [ext/openssl/tests/bug46127.phpt] Bug #48182: ssl handshake fails during asynchronous socket connection [ext/openssl/tests/bug48182.phpt] Bug #54992: Stream not closed and error not returned when SSL CN_match fails [ext/openssl/tests/bug54992.phpt] Bug #65538: SSL context "cafile" supports stream wrappers [ext/openssl/tests/bug65538_001.phpt] Bug #65538: SSL context "cafile" supports phar wrapper [ext/openssl/tests/bug65538_003.phpt] Bug #65729: CN_match gives false positive when wildcard is used [ext/openssl/tests/bug65729.phpt] Bug #68265: SAN match fails with trailing DNS dot [ext/openssl/tests/bug68265.phpt] Bug #68879: Match IP address fields in subjectAltName checks [ext/openssl/tests/bug68879.phpt] Bug #68920: peer_fingerprint input checks should be strict [ext/openssl/tests/bug68920.phpt] Bug #69215: Crypto servers should send client CA list [ext/openssl/tests/bug69215.phpt] Bug #72333: fwrite() on non-blocking SSL sockets doesn't work [ext/openssl/tests/bug72333.phpt] Bug #73072: Invalid path SNI_server_certs causes segfault [ext/openssl/tests/bug73072.phpt] Bug #74159: Writing a large buffer to non-blocking encrypted streams fails [ext/openssl/tests/bug74159.phpt] capture_peer_cert context captures on verify failure [ext/openssl/tests/capture_peer_cert_001.phpt] Testing peer fingerprint on connection [ext/openssl/tests/openssl_peer_fingerprint_basic.phpt] Peer verification enabled for client streams [ext/openssl/tests/peer_verification.phpt] Peer verification matches SAN names [ext/openssl/tests/san_peer_matching.phpt] Capture SSL session meta array in stream context [ext/openssl/tests/session_meta_capture.phpt] sni_server [ext/openssl/tests/sni_server.phpt] sni_server with separate pk and cert [ext/openssl/tests/sni_server_key_cert.phpt] Basic bitwise stream crypto context flag assignment [ext/openssl/tests/stream_crypto_flags_001.phpt] TLSv1.1 and TLSv1.2 bitwise stream crypto flag assignment [ext/openssl/tests/stream_crypto_flags_002.phpt] Server bitwise stream crypto flag assignment [ext/openssl/tests/stream_crypto_flags_003.phpt] Specific protocol method specification [ext/openssl/tests/stream_crypto_flags_004.phpt] TLS server rate-limits client-initiated renegotiation [ext/openssl/tests/stream_server_reneg_limit.phpt] Allow host name mismatch when "verify_host" disabled [ext/openssl/tests/stream_verify_peer_name_002.phpt] Host name mismatch triggers error [ext/openssl/tests/stream_verify_peer_name_003.phpt] Specific crypto method for ssl:// transports. [ext/openssl/tests/streams_crypto_method.phpt] tls stream wrapper with min version 1.0 and max version 1.1 [ext/openssl/tests/tls_min_v1.0_max_v1.1_wrapper.phpt] tls stream wrapper [ext/openssl/tests/tls_wrapper.phpt] tlsv1.0 stream wrapper [ext/openssl/tests/tlsv1.0_wrapper.phpt] tlsv1.1 stream wrapper [ext/openssl/tests/tlsv1.1_wrapper.phpt] tlsv1.2 stream wrapper [ext/openssl/tests/tlsv1.2_wrapper.phpt] Multicast support: IPv6 send options [ext/sockets/tests/mcast_ipv6_send.phpt] recvmsg(): receive SCM_CREDENTIALS messages [ext/sockets/tests/socket_cmsg_rights.phpt] ext/sockets - socket_getpeername_ipv6loop - basic test [ext/sockets/tests/socket_getpeername_ipv6loop.phpt] int socket_send ( resource $socket , string $buf , int $len , int $flags ); [ext/sockets/tests/socket_send.phpt] bool socket_shutdown ( resource $socket [, int $how = 2 ] ) ; [ext/sockets/tests/socket_shutdown.phpt] bool checkdnsrr ( string $host [, string $type = "MX" ] ); [ext/standard/tests/checkdnsrr.phpt] array dns_get_record ( string $hostname [, int $type = DNS_ANY [, array &$authns [, array &$addtl [, bool &$raw = false ]]]] ); [ext/standard/tests/dns_get_record.phpt] proc_open with PTY closes incorrect file descriptor [ext/standard/tests/file/bug69442.phpt] php_ini_loaded_file() function [ext/standard/tests/ini_info/php_ini_loaded_file.phpt] Bug #73594 (dns_get_record() does not populate $additional out parameter) [ext/standard/tests/network/bug73594.phpt] stream context tcp_nodelay server [ext/standard/tests/streams/stream_context_tcp_nodelay_server.phpt] mixed stream_socket_enable_crypto(resource $stream , bool $enable [, int $crypto_type [, resource $session_stream ]] ) ; [ext/standard/tests/streams/stream_socket_enable_crypto.phpt] int stream_socket_sendto ( resource $socket , string $data [, int $flags = 0 [, string $address ]] ); [ext/standard/tests/streams/stream_socket_sendto.phpt] ZipArchive::addGlob() method [ext/zip/tests/oo_addglob.phpt] Bug #55544 (ob_gzhandler always conflicts with zlib.output_compression) [ext/zlib/tests/bug55544.phpt] Test gzencode() function : variation [ext/zlib/tests/gzencode_variation1.phpt] Test gzencode() function : variation - verify header contents with all encoding modes [ext/zlib/tests/gzencode_variation2.phpt] CLI -a and libedit [sapi/cli/tests/017.phpt] HOST/PATH ini sections test for cli [sapi/cli/tests/023.phpt] Bug #74600 (crash (SIGSEGV) in _zend_hash_add_or_update_i) [sapi/cli/tests/bug74600.phpt] cli_get_process_title() function : basic functionality [sapi/cli/tests/cli_get_process_title_basic.phpt] Check cli_process_title support on Unix [sapi/cli/tests/cli_process_title_unix.phpt] cli_set_process_title() function : basic functionality [sapi/cli/tests/cli_set_process_title_basic.phpt] Fundamental breakpoints functionality [sapi/phpdbg/tests/breakpoints_001.phpt] Preserve breakpoints on restart [sapi/phpdbg/tests/breakpoints_002.phpt] Test deleting breakpoints [sapi/phpdbg/tests/breakpoints_003.phpt] Test opcode breakpoints [sapi/phpdbg/tests/breakpoints_004.phpt] Basic function breakpoints [sapi/phpdbg/tests/breakpoints_006.phpt] Test namespaced and non-lowercase breakpoint names [sapi/phpdbg/tests/breakpoints_008.phpt] Bug #73704 (phpdbg shows the wrong line in files with shebang) [sapi/phpdbg/tests/bug73704.phpt] Cleaning must preserve breakpoints [sapi/phpdbg/tests/clean_001.phpt] Test clearing breakpoints [sapi/phpdbg/tests/clear_001.phpt] Properly handle exceptions going to be uncaught [sapi/phpdbg/tests/exceptions_001.phpt] Test exceptions in eval during exception [sapi/phpdbg/tests/exceptions_002.phpt] Ensure proper saving of EX(opline) [sapi/phpdbg/tests/generator_run.phpt] include_once must include only once [sapi/phpdbg/tests/include_once.phpt] Test basic info functionality [sapi/phpdbg/tests/info_001.phpt] A script with die() must end "normally" [sapi/phpdbg/tests/normal_exit.phpt] Test phpdbg_break_next() function [sapi/phpdbg/tests/phpdbg_break_next.phpt] Getting executable lines from custom wrappers [sapi/phpdbg/tests/phpdbg_get_executable_stream_wrapper.phpt] Test phpdbg_*_oplog() functions [sapi/phpdbg/tests/phpdbg_oplog_001.phpt] Test argv passing [sapi/phpdbg/tests/run_001.phpt] Stdin and escaped args being passed to run command [sapi/phpdbg/tests/run_002.phpt] set_exception_handler() in phpdbg [sapi/phpdbg/tests/set_exception_handler.phpt] Test stdin input with breakpoints [sapi/phpdbg/tests/stdin_001.phpt] Test simple recursive watchpoint [sapi/phpdbg/tests/watch_001.phpt] Test simple array watchpoint with replace [sapi/phpdbg/tests/watch_002.phpt] Test simple watchpoint with replace [sapi/phpdbg/tests/watch_003.phpt] Test detection of inline string manipulations on zval watch [sapi/phpdbg/tests/watch_004.phpt] Test proper watch comparisons when having multiple levels of indirection from a zval to its value [sapi/phpdbg/tests/watch_005.phpt] Test multiple watch elements pointing to the same watchpoint [sapi/phpdbg/tests/watch_006.phpt] ===================================================================== ================================================================================ /Users/dragonbe/tmp/php-7.3.0alpha4/ext/opcache/tests/blacklist.phpt ================================================================================ Array ( [0] => /path/to/foo [1] => /path/to/foo2 [2] => /path/to/bar [3] => __DIR__/blacklist.inc [4] => __DIR__/current.php [5] => /private/tmp/path/?nocache.inc [6] => /private/tmp/path/*/somedir ) ok 1 ================================================================================ 008+ [5] => /private/tmp/path/?nocache.inc 009+ [6] => /private/tmp/path/*/somedir 008- [5] => /tmp/path/?nocache.inc 009- [6] => /tmp/path/*/somedir ================================================================================ ================================================================================ /Users/dragonbe/tmp/php-7.3.0alpha4/ext/opcache/tests/bug66338.phpt ================================================================================ Server is not running ================================================================================ 001+ Server is not running 001- The President of the USA is Barack Hussein Obama II 002- The Prime Minister of the UK is David William Donald Cameron ================================================================================ ================================================================================ /Users/dragonbe/tmp/php-7.3.0alpha4/ext/opcache/tests/issue0115.phpt ================================================================================ Server is not running ================================================================================ 001+ Server is not running 001- Hello from Index 1. 002- Hello World 1! 003- Hello from Index 2. 004- Hello World 2! ================================================================================ ================================================================================ /Users/dragonbe/tmp/php-7.3.0alpha4/ext/opcache/tests/issue0149.phpt ================================================================================ Server is not running ================================================================================ 001+ Server is not running 001- OK 002- OK 003- OK ================================================================================ ================================================================================ /Users/dragonbe/tmp/php-7.3.0alpha4/ext/opcache/tests/revalidate_path_01.phpt ================================================================================ Server is not running ================================================================================ 001+ Server is not running 001- TEST 1 002- TEST 1 003- TEST 2 004- TEST 2 ================================================================================ ================================================================================ /Users/dragonbe/tmp/php-7.3.0alpha4/ext/openssl/tests/bug46127.phpt ================================================================================ Warning: stream_socket_client(): unable to connect to ssl://127.0.0.1:64321 (Connection refused) in /Users/dragonbe/tmp/php-7.3.0alpha4/ext/openssl/tests/ServerClientTestCase..inc(96) : eval()'d code on line 10 Warning: fgets() expects parameter 1 to be resource, bool given in /Users/dragonbe/tmp/php-7.3.0alpha4/ext/openssl/tests/ServerClientTestCase..inc(96) : eval()'d code on line 12 ================================================================================ 001+ Warning: stream_socket_client(): unable to connect to ssl://127.0.0.1:64321 (Connection refused) in /Users/dragonbe/tmp/php-7.3.0alpha4/ext/openssl/tests/ServerClientTestCase..inc(96) : eval()'d code on line 10 001- Sending bug 46127 002+ 003+ Warning: fgets() expects parameter 1 to be resource, bool given in /Users/dragonbe/tmp/php-7.3.0alpha4/ext/openssl/tests/ServerClientTestCase..inc(96) : eval()'d code on line 12 ================================================================================ ================================================================================ /Users/dragonbe/tmp/php-7.3.0alpha4/ext/openssl/tests/bug48182.phpt ================================================================================ Running bug48182 Warning: stream_socket_client(): SSL: Broken pipe in /Users/dragonbe/tmp/php-7.3.0alpha4/ext/openssl/tests/ServerClientTestCase..inc(96) : eval()'d code on line 9 Warning: stream_socket_client(): Failed to enable crypto in /Users/dragonbe/tmp/php-7.3.0alpha4/ext/openssl/tests/ServerClientTestCase..inc(96) : eval()'d code on line 9 Warning: stream_socket_client(): unable to connect to ssl://127.0.0.1:64321 (Unknown error) in /Users/dragonbe/tmp/php-7.3.0alpha4/ext/openssl/tests/ServerClientTestCase..inc(96) : eval()'d code on line 9 Warning: fwrite() expects parameter 1 to be resource, bool given in /Users/dragonbe/tmp/php-7.3.0alpha4/ext/openssl/tests/ServerClientTestCase..inc(96) : eval()'d code on line 13 Warning: fread() expects parameter 1 to be resource, bool given in /Users/dragonbe/tmp/php-7.3.0alpha4/ext/openssl/tests/ServerClientTestCase..inc(96) : eval()'d code on line 14 ================================================================================ 002+ 003+ Warning: stream_socket_client(): SSL: Broken pipe in /Users/dragonbe/tmp/php-7.3.0alpha4/ext/openssl/tests/ServerClientTestCase..inc(96) : eval()'d code on line 9 002- Sending bug48182 003- Sending data over to SSL server in async mode with contents like Hello World 004+ 005+ Warning: stream_socket_client(): Failed to enable crypto in /Users/dragonbe/tmp/php-7.3.0alpha4/ext/openssl/tests/ServerClientTestCase..inc(96) : eval()'d code on line 9 006+ 007+ Warning: stream_socket_client(): unable to connect to ssl://127.0.0.1:64321 (Unknown error) in /Users/dragonbe/tmp/php-7.3.0alpha4/ext/openssl/tests/ServerClientTestCase..inc(96) : eval()'d code on line 9 008+ 009+ Warning: fwrite() expects parameter 1 to be resource, bool given in /Users/dragonbe/tmp/php-7.3.0alpha4/ext/openssl/tests/ServerClientTestCase..inc(96) : eval()'d code on line 13 010+ 011+ Warning: fread() expects parameter 1 to be resource, bool given in /Users/dragonbe/tmp/php-7.3.0alpha4/ext/openssl/tests/ServerClientTestCase..inc(96) : eval()'d code on line 14 ================================================================================ ================================================================================ /Users/dragonbe/tmp/php-7.3.0alpha4/ext/openssl/tests/bug54992.phpt ================================================================================ Warning: stream_socket_client(): unable to connect to ssl://127.0.0.1:64321 (Connection refused) in /Users/dragonbe/tmp/php-7.3.0alpha4/ext/openssl/tests/ServerClientTestCase..inc(96) : eval()'d code on line 10 bool(false) ================================================================================ 001+ Warning: stream_socket_client(): unable to connect to ssl://127.0.0.1:64321 (Connection refused) in /Users/dragonbe/tmp/php-7.3.0alpha4/ext/openssl/tests/ServerClientTestCase..inc(96) : eval()'d code on line 10 001- Warning: stream_socket_client(): Peer certificate CN=`bug54992.local' did not match expected CN=`buga_buga' in %s on line %d 002- 003- Warning: stream_socket_client(): Failed to enable crypto in %s on line %d 004- 005- Warning: stream_socket_client(): unable to connect to ssl://127.0.0.1:64321 (Unknown error) in %s on line %d ================================================================================ ================================================================================ /Users/dragonbe/tmp/php-7.3.0alpha4/ext/openssl/tests/bug65538_001.phpt ================================================================================ Warning: file_get_contents(https://127.0.0.1:64321/): failed to open stream: Connection refused in /Users/dragonbe/tmp/php-7.3.0alpha4/ext/openssl/tests/ServerClientTestCase..inc(96) : eval()'d code on line 8 bool(false) ================================================================================ 001+ Warning: file_get_contents(https://127.0.0.1:64321/): failed to open stream: Connection refused in /Users/dragonbe/tmp/php-7.3.0alpha4/ext/openssl/tests/ServerClientTestCase..inc(96) : eval()'d code on line 8 001- string(12) "Hello World!" 002+ bool(false) ================================================================================ ================================================================================ /Users/dragonbe/tmp/php-7.3.0alpha4/ext/openssl/tests/bug65538_003.phpt ================================================================================ Warning: file_get_contents(https://127.0.0.1:64321/): failed to open stream: Connection refused in /Users/dragonbe/tmp/php-7.3.0alpha4/ext/openssl/tests/ServerClientTestCase..inc(96) : eval()'d code on line 8 bool(false) ================================================================================ 001+ Warning: file_get_contents(https://127.0.0.1:64321/): failed to open stream: Connection refused in /Users/dragonbe/tmp/php-7.3.0alpha4/ext/openssl/tests/ServerClientTestCase..inc(96) : eval()'d code on line 8 001- string(12) "Hello World!" 002+ bool(false) ================================================================================ ================================================================================ /Users/dragonbe/tmp/php-7.3.0alpha4/ext/openssl/tests/bug65729.phpt ================================================================================ Warning: stream_socket_client(): unable to connect to ssl://127.0.0.1:64321 (Connection refused) in /Users/dragonbe/tmp/php-7.3.0alpha4/ext/openssl/tests/ServerClientTestCase..inc(96) : eval()'d code on line 14 bool(false) Warning: stream_socket_client(): unable to connect to ssl://127.0.0.1:64321 (Connection refused) in /Users/dragonbe/tmp/php-7.3.0alpha4/ext/openssl/tests/ServerClientTestCase..inc(96) : eval()'d code on line 14 bool(false) Warning: stream_socket_client(): unable to connect to ssl://127.0.0.1:64321 (Connection refused) in /Users/dragonbe/tmp/php-7.3.0alpha4/ext/openssl/tests/ServerClientTestCase..inc(96) : eval()'d code on line 14 bool(false) Warning: stream_socket_client(): unable to connect to ssl://127.0.0.1:64321 (Connection refused) in /Users/dragonbe/tmp/php-7.3.0alpha4/ext/openssl/tests/ServerClientTestCase..inc(96) : eval()'d code on line 14 bool(false) ================================================================================ 001+ Warning: stream_socket_client(): unable to connect to ssl://127.0.0.1:64321 (Connection refused) in /Users/dragonbe/tmp/php-7.3.0alpha4/ext/openssl/tests/ServerClientTestCase..inc(96) : eval()'d code on line 14 002+ bool(false) 001- Warning: stream_socket_client(): Peer certificate CN=`*.test.com' did not match expected CN=`foo.test.com.sg' in %s on line %d 003- Warning: stream_socket_client(): Failed to enable crypto in %s on line %d 004+ Warning: stream_socket_client(): unable to connect to ssl://127.0.0.1:64321 (Connection refused) in /Users/dragonbe/tmp/php-7.3.0alpha4/ext/openssl/tests/ServerClientTestCase..inc(96) : eval()'d code on line 14 005+ bool(false) 005- Warning: stream_socket_client(): unable to connect to ssl://127.0.0.1:64321 (Unknown error) in %s on line %d 007+ Warning: stream_socket_client(): unable to connect to ssl://127.0.0.1:64321 (Connection refused) in /Users/dragonbe/tmp/php-7.3.0alpha4/ext/openssl/tests/ServerClientTestCase..inc(96) : eval()'d code on line 14 007- resource(%d) of type (stream) 008- resource(%d) of type (stream) 010+ Warning: stream_socket_client(): unable to connect to ssl://127.0.0.1:64321 (Connection refused) in /Users/dragonbe/tmp/php-7.3.0alpha4/ext/openssl/tests/ServerClientTestCase..inc(96) : eval()'d code on line 14 010- Warning: stream_socket_client(): Peer certificate CN=`*.test.com' did not match expected CN=`foo.bar.test.com' in %s on line %d 011- 012- Warning: stream_socket_client(): Failed to enable crypto in %s on line %d 013- 014- Warning: stream_socket_client(): unable to connect to ssl://127.0.0.1:64321 (Unknown error) in %s on line %d ================================================================================ ================================================================================ /Users/dragonbe/tmp/php-7.3.0alpha4/ext/openssl/tests/bug68265.phpt ================================================================================ Warning: stream_socket_client(): unable to connect to ssl://127.0.0.1:64321 (Connection refused) in /Users/dragonbe/tmp/php-7.3.0alpha4/ext/openssl/tests/ServerClientTestCase..inc(96) : eval()'d code on line 11 bool(false) ================================================================================ 001+ Warning: stream_socket_client(): unable to connect to ssl://127.0.0.1:64321 (Connection refused) in /Users/dragonbe/tmp/php-7.3.0alpha4/ext/openssl/tests/ServerClientTestCase..inc(96) : eval()'d code on line 11 001- resource(%d) of type (stream) 002+ bool(false) ================================================================================ ================================================================================ /Users/dragonbe/tmp/php-7.3.0alpha4/ext/openssl/tests/bug68879.phpt ================================================================================ Warning: stream_socket_client(): unable to connect to ssl://127.0.0.1:64321 (Connection refused) in /Users/dragonbe/tmp/php-7.3.0alpha4/ext/openssl/tests/ServerClientTestCase..inc(96) : eval()'d code on line 11 bool(false) ================================================================================ 001+ Warning: stream_socket_client(): unable to connect to ssl://127.0.0.1:64321 (Connection refused) in /Users/dragonbe/tmp/php-7.3.0alpha4/ext/openssl/tests/ServerClientTestCase..inc(96) : eval()'d code on line 11 001- resource(%d) of type (stream) 002+ bool(false) ================================================================================ ================================================================================ /Users/dragonbe/tmp/php-7.3.0alpha4/ext/openssl/tests/bug68920.phpt ================================================================================ Warning: stream_socket_client(): unable to connect to ssl://127.0.0.1:64321 (Connection refused) in /Users/dragonbe/tmp/php-7.3.0alpha4/ext/openssl/tests/ServerClientTestCase..inc(96) : eval()'d code on line 7 bool(false) Warning: stream_socket_client(): unable to connect to ssl://127.0.0.1:64321 (Connection refused) in /Users/dragonbe/tmp/php-7.3.0alpha4/ext/openssl/tests/ServerClientTestCase..inc(96) : eval()'d code on line 11 bool(false) Warning: stream_socket_client(): unable to connect to ssl://127.0.0.1:64321 (Connection refused) in /Users/dragonbe/tmp/php-7.3.0alpha4/ext/openssl/tests/ServerClientTestCase..inc(96) : eval()'d code on line 15 bool(false) Warning: stream_socket_client(): unable to connect to ssl://127.0.0.1:64321 (Connection refused) in /Users/dragonbe/tmp/php-7.3.0alpha4/ext/openssl/tests/ServerClientTestCase..inc(96) : eval()'d code on line 19 bool(false) ================================================================================ 001+ Warning: stream_socket_client(): unable to connect to ssl://127.0.0.1:64321 (Connection refused) in /Users/dragonbe/tmp/php-7.3.0alpha4/ext/openssl/tests/ServerClientTestCase..inc(96) : eval()'d code on line 7 002+ bool(false) 001- Warning: stream_socket_client(): Expected peer fingerprint must be a string or an array in %s on line %d 003- Warning: stream_socket_client(): Failed to enable crypto in %s on line %d 004+ Warning: stream_socket_client(): unable to connect to ssl://127.0.0.1:64321 (Connection refused) in /Users/dragonbe/tmp/php-7.3.0alpha4/ext/openssl/tests/ServerClientTestCase..inc(96) : eval()'d code on line 11 005+ bool(false) 005- Warning: stream_socket_client(): unable to connect to %s (Unknown error) in %s on line %d 007+ Warning: stream_socket_client(): unable to connect to ssl://127.0.0.1:64321 (Connection refused) in /Users/dragonbe/tmp/php-7.3.0alpha4/ext/openssl/tests/ServerClientTestCase..inc(96) : eval()'d code on line 15 008- Warning: stream_socket_client(): Expected peer fingerprint must be a string or an array in %s on line %d 009- 010- Warning: stream_socket_client(): Failed to enable crypto in %s on line %d 011- 012- Warning: stream_socket_client(): unable to connect to %s (Unknown error) in %s on line %d 010+ Warning: stream_socket_client(): unable to connect to ssl://127.0.0.1:64321 (Connection refused) in /Users/dragonbe/tmp/php-7.3.0alpha4/ext/openssl/tests/ServerClientTestCase..inc(96) : eval()'d code on line 19 014- 015- Warning: stream_socket_client(): Invalid peer_fingerprint array; [algo => fingerprint] form required in %s on line %d 016- 017- Warning: stream_socket_client(): peer_fingerprint match failure in %s on line %d 018- 019- Warning: stream_socket_client(): Failed to enable crypto in %s on line %d 020- 021- Warning: stream_socket_client(): unable to connect to %s (Unknown error) in %s on line %d 022- bool(false) 023- 024- Warning: stream_socket_client(): Invalid peer_fingerprint array; [algo => fingerprint] form required in %s on line %d 025- 026- Warning: stream_socket_client(): peer_fingerprint match failure in %s on line %d 027- 028- Warning: stream_socket_client(): Failed to enable crypto in %s on line %d 029- 030- Warning: stream_socket_client(): unable to connect to %s (Unknown error) in %s on line %d 031- bool(false) ================================================================================ ================================================================================ /Users/dragonbe/tmp/php-7.3.0alpha4/ext/openssl/tests/bug69215.phpt ================================================================================ Warning: stream_socket_client(): unable to connect to ssl://127.0.0.1:64321 (Connection refused) in /Users/dragonbe/tmp/php-7.3.0alpha4/ext/openssl/tests/ServerClientTestCase..inc(96) : eval()'d code on line 14 bool(false) ================================================================================ 001+ Warning: stream_socket_client(): unable to connect to ssl://127.0.0.1:64321 (Connection refused) in /Users/dragonbe/tmp/php-7.3.0alpha4/ext/openssl/tests/ServerClientTestCase..inc(96) : eval()'d code on line 14 001- resource(%d) of type (stream) 002+ bool(false) ================================================================================ ================================================================================ /Users/dragonbe/tmp/php-7.3.0alpha4/ext/openssl/tests/bug72333.phpt ================================================================================ Warning: stream_socket_client(): unable to connect to ssl://127.0.0.1:10011 (Connection refused) in /Users/dragonbe/tmp/php-7.3.0alpha4/ext/openssl/tests/ServerClientTestCase..inc(96) : eval()'d code on line 4 Warning: stream_set_blocking() expects parameter 1 to be resource, bool given in /Users/dragonbe/tmp/php-7.3.0alpha4/ext/openssl/tests/ServerClientTestCase..inc(96) : eval()'d code on line 5 Warning: stream_select(): supplied argument is not a valid stream resource in /Users/dragonbe/tmp/php-7.3.0alpha4/ext/openssl/tests/ServerClientTestCase..inc(96) : eval()'d code on line 10 Warning: stream_select(): No stream arrays were passed in /Users/dragonbe/tmp/php-7.3.0alpha4/ext/openssl/tests/ServerClientTestCase..inc(96) : eval()'d code on line 10 done ================================================================================ 001+ Warning: stream_socket_client(): unable to connect to ssl://127.0.0.1:10011 (Connection refused) in /Users/dragonbe/tmp/php-7.3.0alpha4/ext/openssl/tests/ServerClientTestCase..inc(96) : eval()'d code on line 4 002+ 003+ Warning: stream_set_blocking() expects parameter 1 to be resource, bool given in /Users/dragonbe/tmp/php-7.3.0alpha4/ext/openssl/tests/ServerClientTestCase..inc(96) : eval()'d code on line 5 004+ 005+ Warning: stream_select(): supplied argument is not a valid stream resource in /Users/dragonbe/tmp/php-7.3.0alpha4/ext/openssl/tests/ServerClientTestCase..inc(96) : eval()'d code on line 10 006+ 007+ Warning: stream_select(): No stream arrays were passed in /Users/dragonbe/tmp/php-7.3.0alpha4/ext/openssl/tests/ServerClientTestCase..inc(96) : eval()'d code on line 10 ================================================================================ ================================================================================ /Users/dragonbe/tmp/php-7.3.0alpha4/ext/openssl/tests/bug73072.phpt ================================================================================ ================================================================================ 001+ 001- done ================================================================================ ================================================================================ /Users/dragonbe/tmp/php-7.3.0alpha4/ext/openssl/tests/bug74159.phpt ================================================================================ stream_socket_client(): unable to connect to tcp://127.0.0.1:10012 (Connection refused) ================================================================================ 001+ stream_socket_client(): unable to connect to tcp://127.0.0.1:10012 (Connection refused) 001- Written 1048575 bytes 002- DONE ================================================================================ ================================================================================ /Users/dragonbe/tmp/php-7.3.0alpha4/ext/openssl/tests/capture_peer_cert_001.phpt ================================================================================ Notice: Undefined index: peer_certificate in /Users/dragonbe/tmp/php-7.3.0alpha4/ext/openssl/tests/ServerClientTestCase..inc(96) : eval()'d code on line 10 NULL ================================================================================ 001+ Notice: Undefined index: peer_certificate in /Users/dragonbe/tmp/php-7.3.0alpha4/ext/openssl/tests/ServerClientTestCase..inc(96) : eval()'d code on line 10 001- string(%d) "bug54992.local" 002+ NULL ================================================================================ ================================================================================ /Users/dragonbe/tmp/php-7.3.0alpha4/ext/openssl/tests/openssl_peer_fingerprint_basic.phpt ================================================================================ Warning: stream_socket_client(): unable to connect to ssl://127.0.0.1:64321 (Connection refused) in /Users/dragonbe/tmp/php-7.3.0alpha4/ext/openssl/tests/ServerClientTestCase..inc(96) : eval()'d code on line 14 bool(false) Warning: stream_socket_client(): unable to connect to ssl://127.0.0.1:64321 (Connection refused) in /Users/dragonbe/tmp/php-7.3.0alpha4/ext/openssl/tests/ServerClientTestCase..inc(96) : eval()'d code on line 19 bool(false) ================================================================================ 001+ Warning: stream_socket_client(): unable to connect to ssl://127.0.0.1:64321 (Connection refused) in /Users/dragonbe/tmp/php-7.3.0alpha4/ext/openssl/tests/ServerClientTestCase..inc(96) : eval()'d code on line 14 002+ bool(false) 001- Warning: stream_socket_client(): peer_fingerprint match failure in %s on line %d 003- Warning: stream_socket_client(): Failed to enable crypto in %s on line %d 004- 005- Warning: stream_socket_client(): unable to connect to ssl://127.0.0.1:64321 (Unknown error) in %s on line %d 004+ Warning: stream_socket_client(): unable to connect to ssl://127.0.0.1:64321 (Connection refused) in /Users/dragonbe/tmp/php-7.3.0alpha4/ext/openssl/tests/ServerClientTestCase..inc(96) : eval()'d code on line 19 007- resource(%d) of type (stream) ================================================================================ ================================================================================ /Users/dragonbe/tmp/php-7.3.0alpha4/ext/openssl/tests/peer_verification.phpt ================================================================================ bool(false) bool(false) Warning: stream_socket_client(): unable to connect to ssl://127.0.0.1:64321 (Connection refused) in /Users/dragonbe/tmp/php-7.3.0alpha4/ext/openssl/tests/ServerClientTestCase..inc(96) : eval()'d code on line 21 bool(false) Warning: stream_socket_client(): unable to connect to ssl://127.0.0.1:64321 (Connection refused) in /Users/dragonbe/tmp/php-7.3.0alpha4/ext/openssl/tests/ServerClientTestCase..inc(96) : eval()'d code on line 28 bool(false) ================================================================================ 003+ 004+ Warning: stream_socket_client(): unable to connect to ssl://127.0.0.1:64321 (Connection refused) in /Users/dragonbe/tmp/php-7.3.0alpha4/ext/openssl/tests/ServerClientTestCase..inc(96) : eval()'d code on line 21 003- resource(%d) of type (stream) 004- resource(%d) of type (stream) 005+ bool(false) 006+ 007+ Warning: stream_socket_client(): unable to connect to ssl://127.0.0.1:64321 (Connection refused) in /Users/dragonbe/tmp/php-7.3.0alpha4/ext/openssl/tests/ServerClientTestCase..inc(96) : eval()'d code on line 28 008+ bool(false) ================================================================================ ================================================================================ /Users/dragonbe/tmp/php-7.3.0alpha4/ext/openssl/tests/san_peer_matching.phpt ================================================================================ Warning: stream_socket_client(): unable to connect to ssl://127.0.0.1:64321 (Connection refused) in /Users/dragonbe/tmp/php-7.3.0alpha4/ext/openssl/tests/ServerClientTestCase..inc(96) : eval()'d code on line 11 bool(false) Warning: stream_socket_client(): unable to connect to ssl://127.0.0.1:64321 (Connection refused) in /Users/dragonbe/tmp/php-7.3.0alpha4/ext/openssl/tests/ServerClientTestCase..inc(96) : eval()'d code on line 14 bool(false) ================================================================================ 001+ Warning: stream_socket_client(): unable to connect to ssl://127.0.0.1:64321 (Connection refused) in /Users/dragonbe/tmp/php-7.3.0alpha4/ext/openssl/tests/ServerClientTestCase..inc(96) : eval()'d code on line 11 002+ bool(false) 001- resource(%d) of type (stream) 003- Warning: stream_socket_client(): Unable to locate peer certificate CN in %s on line %d 004- 005- Warning: stream_socket_client(): Failed to enable crypto in %s on line %d 006- 007- Warning: stream_socket_client(): unable to connect to ssl://127.0.0.1:64321 (Unknown error) in %s on line %d 004+ Warning: stream_socket_client(): unable to connect to ssl://127.0.0.1:64321 (Connection refused) in /Users/dragonbe/tmp/php-7.3.0alpha4/ext/openssl/tests/ServerClientTestCase..inc(96) : eval()'d code on line 14 ================================================================================ ================================================================================ /Users/dragonbe/tmp/php-7.3.0alpha4/ext/openssl/tests/session_meta_capture..phpt ================================================================================ Notice: Undefined index: session_meta in /Users/dragonbe/tmp/php-7.3.0alpha4/ext/openssl/tests/ServerClientTestCase..inc(96) : eval()'d code on line 14 NULL Notice: Undefined index: session_meta in /Users/dragonbe/tmp/php-7.3.0alpha4/ext/openssl/tests/ServerClientTestCase..inc(96) : eval()'d code on line 19 NULL Notice: Undefined index: session_meta in /Users/dragonbe/tmp/php-7.3.0alpha4/ext/openssl/tests/ServerClientTestCase..inc(96) : eval()'d code on line 24 NULL ================================================================================ 001+ Notice: Undefined index: session_meta in /Users/dragonbe/tmp/php-7.3.0alpha4/ext/openssl/tests/ServerClientTestCase..inc(96) : eval()'d code on line 14 002+ NULL 003+ 001- string(5) "TLSv1" 002- string(7) "TLSv1.1" 003- string(7) "TLSv1.2" 004+ Notice: Undefined index: session_meta in /Users/dragonbe/tmp/php-7.3.0alpha4/ext/openssl/tests/ServerClientTestCase..inc(96) : eval()'d code on line 19 005+ NULL 006+ 007+ Notice: Undefined index: session_meta in /Users/dragonbe/tmp/php-7.3.0alpha4/ext/openssl/tests/ServerClientTestCase..inc(96) : eval()'d code on line 24 008+ NULL ================================================================================ ================================================================================ /Users/dragonbe/tmp/php-7.3.0alpha4/ext/openssl/tests/sni_server.phpt ================================================================================ Warning: stream_socket_client(): unable to connect to tls://127.0.0.1:64321 (Connection refused) in /Users/dragonbe/tmp/php-7.3.0alpha4/ext/openssl/tests/ServerClientTestCase..inc(96) : eval()'d code on line 11 Notice: Undefined index: peer_certificate in /Users/dragonbe/tmp/php-7.3.0alpha4/ext/openssl/tests/ServerClientTestCase..inc(96) : eval()'d code on line 12 NULL Notice: Undefined index: peer_certificate in /Users/dragonbe/tmp/php-7.3.0alpha4/ext/openssl/tests/ServerClientTestCase..inc(96) : eval()'d code on line 18 NULL Notice: Undefined index: peer_certificate in /Users/dragonbe/tmp/php-7.3.0alpha4/ext/openssl/tests/ServerClientTestCase..inc(96) : eval()'d code on line 24 NULL ================================================================================ 001+ Warning: stream_socket_client(): unable to connect to tls://127.0.0.1:64321 (Connection refused) in /Users/dragonbe/tmp/php-7.3.0alpha4/ext/openssl/tests/ServerClientTestCase..inc(96) : eval()'d code on line 11 002+ 003+ Notice: Undefined index: peer_certificate in /Users/dragonbe/tmp/php-7.3.0alpha4/ext/openssl/tests/ServerClientTestCase..inc(96) : eval()'d code on line 12 001- string(%d) "cs.php.net" 002- string(%d) "uk.php.net" 003- string(%d) "us.php.net" 004+ NULL 005+ 006+ Notice: Undefined index: peer_certificate in /Users/dragonbe/tmp/php-7.3.0alpha4/ext/openssl/tests/ServerClientTestCase..inc(96) : eval()'d code on line 18 007+ NULL 008+ 009+ Notice: Undefined index: peer_certificate in /Users/dragonbe/tmp/php-7.3.0alpha4/ext/openssl/tests/ServerClientTestCase..inc(96) : eval()'d code on line 24 010+ NULL ================================================================================ ================================================================================ /Users/dragonbe/tmp/php-7.3.0alpha4/ext/openssl/tests/sni_server_key_cert.phpt ================================================================================ Warning: stream_socket_client(): unable to connect to tls://127.0.0.1:64321 (Connection refused) in /Users/dragonbe/tmp/php-7.3.0alpha4/ext/openssl/tests/ServerClientTestCase..inc(96) : eval()'d code on line 11 Notice: Undefined index: peer_certificate in /Users/dragonbe/tmp/php-7.3.0alpha4/ext/openssl/tests/ServerClientTestCase..inc(96) : eval()'d code on line 12 NULL Notice: Undefined index: peer_certificate in /Users/dragonbe/tmp/php-7.3.0alpha4/ext/openssl/tests/ServerClientTestCase..inc(96) : eval()'d code on line 18 NULL Notice: Undefined index: peer_certificate in /Users/dragonbe/tmp/php-7.3.0alpha4/ext/openssl/tests/ServerClientTestCase..inc(96) : eval()'d code on line 24 NULL ================================================================================ 001+ Warning: stream_socket_client(): unable to connect to tls://127.0.0.1:64321 (Connection refused) in /Users/dragonbe/tmp/php-7.3.0alpha4/ext/openssl/tests/ServerClientTestCase..inc(96) : eval()'d code on line 11 002+ 003+ Notice: Undefined index: peer_certificate in /Users/dragonbe/tmp/php-7.3.0alpha4/ext/openssl/tests/ServerClientTestCase..inc(96) : eval()'d code on line 12 001- string(%d) "cs.php.net" 002- string(%d) "uk.php.net" 003- string(%d) "us.php.net" 004+ NULL 005+ 006+ Notice: Undefined index: peer_certificate in /Users/dragonbe/tmp/php-7.3.0alpha4/ext/openssl/tests/ServerClientTestCase..inc(96) : eval()'d code on line 18 007+ NULL 008+ 009+ Notice: Undefined index: peer_certificate in /Users/dragonbe/tmp/php-7.3.0alpha4/ext/openssl/tests/ServerClientTestCase..inc(96) : eval()'d code on line 24 010+ NULL ================================================================================ ================================================================================ /Users/dragonbe/tmp/php-7.3.0alpha4/ext/openssl/tests/stream_crypto_flags_001.phpt ================================================================================ Warning: stream_socket_client(): unable to connect to ssl://127.0.0.1:64321 (Connection refused) in /Users/dragonbe/tmp/php-7.3.0alpha4/ext/openssl/tests/ServerClientTestCase..inc(96) : eval()'d code on line 12 bool(false) Warning: stream_socket_client(): unable to connect to ssl://127.0.0.1:64321 (Connection refused) in /Users/dragonbe/tmp/php-7.3.0alpha4/ext/openssl/tests/ServerClientTestCase..inc(96) : eval()'d code on line 15 bool(false) ================================================================================ 001+ Warning: stream_socket_client(): unable to connect to ssl://127.0.0.1:64321 (Connection refused) in /Users/dragonbe/tmp/php-7.3.0alpha4/ext/openssl/tests/ServerClientTestCase..inc(96) : eval()'d code on line 12 002+ bool(false) 001- resource(%d) of type (stream) 002- resource(%d) of type (stream) 003+ 004+ Warning: stream_socket_client(): unable to connect to ssl://127.0.0.1:64321 (Connection refused) in /Users/dragonbe/tmp/php-7.3.0alpha4/ext/openssl/tests/ServerClientTestCase..inc(96) : eval()'d code on line 15 005+ bool(false) ================================================================================ ================================================================================ /Users/dragonbe/tmp/php-7.3.0alpha4/ext/openssl/tests/stream_crypto_flags_002.phpt ================================================================================ Warning: stream_socket_client(): unable to connect to ssl://127.0.0.1:64321 (Connection refused) in /Users/dragonbe/tmp/php-7.3.0alpha4/ext/openssl/tests/ServerClientTestCase..inc(96) : eval()'d code on line 12 bool(false) Warning: stream_socket_client(): unable to connect to ssl://127.0.0.1:64321 (Connection refused) in /Users/dragonbe/tmp/php-7.3.0alpha4/ext/openssl/tests/ServerClientTestCase..inc(96) : eval()'d code on line 15 bool(false) Warning: stream_socket_client(): unable to connect to ssl://127.0.0.1:64321 (Connection refused) in /Users/dragonbe/tmp/php-7.3.0alpha4/ext/openssl/tests/ServerClientTestCase..inc(96) : eval()'d code on line 18 bool(false) Warning: stream_socket_client(): unable to connect to ssl://127.0.0.1:64321 (Connection refused) in /Users/dragonbe/tmp/php-7.3.0alpha4/ext/openssl/tests/ServerClientTestCase..inc(96) : eval()'d code on line 21 bool(false) ================================================================================ 001+ Warning: stream_socket_client(): unable to connect to ssl://127.0.0.1:64321 (Connection refused) in /Users/dragonbe/tmp/php-7.3.0alpha4/ext/openssl/tests/ServerClientTestCase..inc(96) : eval()'d code on line 12 002+ bool(false) 003+ 004+ Warning: stream_socket_client(): unable to connect to ssl://127.0.0.1:64321 (Connection refused) in /Users/dragonbe/tmp/php-7.3.0alpha4/ext/openssl/tests/ServerClientTestCase..inc(96) : eval()'d code on line 15 001- resource(%d) of type (stream) 002- resource(%d) of type (stream) 003- resource(%d) of type (stream) 004- resource(%d) of type (stream) 005+ bool(false) 006+ 007+ Warning: stream_socket_client(): unable to connect to ssl://127.0.0.1:64321 (Connection refused) in /Users/dragonbe/tmp/php-7.3.0alpha4/ext/openssl/tests/ServerClientTestCase..inc(96) : eval()'d code on line 18 008+ bool(false) 009+ 010+ Warning: stream_socket_client(): unable to connect to ssl://127.0.0.1:64321 (Connection refused) in /Users/dragonbe/tmp/php-7.3.0alpha4/ext/openssl/tests/ServerClientTestCase..inc(96) : eval()'d code on line 21 011+ bool(false) ================================================================================ ================================================================================ /Users/dragonbe/tmp/php-7.3.0alpha4/ext/openssl/tests/stream_crypto_flags_003.phpt ================================================================================ Warning: stream_socket_client(): unable to connect to ssl://127.0.0.1:64321 (Connection refused) in /Users/dragonbe/tmp/php-7.3.0alpha4/ext/openssl/tests/ServerClientTestCase..inc(96) : eval()'d code on line 12 bool(false) bool(false) bool(false) ================================================================================ 001+ Warning: stream_socket_client(): unable to connect to ssl://127.0.0.1:64321 (Connection refused) in /Users/dragonbe/tmp/php-7.3.0alpha4/ext/openssl/tests/ServerClientTestCase..inc(96) : eval()'d code on line 12 002+ bool(false) 003+ bool(false) 001- resource(%d) of type (stream) 002- resource(%d) of type (stream) 003- resource(%d) of type (stream) 004+ bool(false) ================================================================================ ================================================================================ /Users/dragonbe/tmp/php-7.3.0alpha4/ext/openssl/tests/stream_crypto_flags_004.phpt ================================================================================ bool(false) bool(false) bool(false) Warning: stream_socket_client(): unable to connect to ssl://127.0.0.1:64321 (Connection refused) in /Users/dragonbe/tmp/php-7.3.0alpha4/ext/openssl/tests/ServerClientTestCase..inc(96) : eval()'d code on line 25 bool(false) ================================================================================ 001+ bool(false) 002+ bool(false) 001- resource(%d) of type (stream) 004+ 005+ Warning: stream_socket_client(): unable to connect to ssl://127.0.0.1:64321 (Connection refused) in /Users/dragonbe/tmp/php-7.3.0alpha4/ext/openssl/tests/ServerClientTestCase..inc(96) : eval()'d code on line 25 004- resource(%d) of type (stream) ================================================================================ ================================================================================ /Users/dragonbe/tmp/php-7.3.0alpha4/ext/openssl/tests/stream_server_reneg_limit.phpt ================================================================================ ** ERROR: process timed out ** ================================================================================ 001+ ** ERROR: process timed out ** 001- resource(%d) of type (stream) ================================================================================ ================================================================================ /Users/dragonbe/tmp/php-7.3.0alpha4/ext/openssl/tests/stream_verify_peer_name_002.phpt ================================================================================ Warning: stream_socket_client(): unable to connect to ssl://127.0.0.1:64321 (Connection refused) in /Users/dragonbe/tmp/php-7.3.0alpha4/ext/openssl/tests/ServerClientTestCase..inc(96) : eval()'d code on line 10 bool(false) ================================================================================ 001+ Warning: stream_socket_client(): unable to connect to ssl://127.0.0.1:64321 (Connection refused) in /Users/dragonbe/tmp/php-7.3.0alpha4/ext/openssl/tests/ServerClientTestCase..inc(96) : eval()'d code on line 10 001- resource(%d) of type (stream) 002+ bool(false) ================================================================================ ================================================================================ /Users/dragonbe/tmp/php-7.3.0alpha4/ext/openssl/tests/stream_verify_peer_name_003.phpt ================================================================================ Warning: stream_socket_client(): unable to connect to ssl://127.0.0.1:64321 (Connection refused) in /Users/dragonbe/tmp/php-7.3.0alpha4/ext/openssl/tests/ServerClientTestCase..inc(96) : eval()'d code on line 9 bool(false) ================================================================================ 001+ Warning: stream_socket_client(): unable to connect to ssl://127.0.0.1:64321 (Connection refused) in /Users/dragonbe/tmp/php-7.3.0alpha4/ext/openssl/tests/ServerClientTestCase..inc(96) : eval()'d code on line 9 001- Warning: stream_socket_client(): Peer certificate CN=`bug54992.local' did not match expected CN=`127.0.0.1' in %s on line %d 002- 003- Warning: stream_socket_client(): Failed to enable crypto in %s on line %d 004- 005- Warning: stream_socket_client(): unable to connect to ssl://127.0.0.1:64321 (Unknown error) in %s on line %d ================================================================================ ================================================================================ /Users/dragonbe/tmp/php-7.3.0alpha4/ext/openssl/tests/streams_crypto_method.phpt ================================================================================ Warning: file_get_contents(https://127.0.0.1:64321/): failed to open stream: Connection refused in /Users/dragonbe/tmp/php-7.3.0alpha4/ext/openssl/tests/ServerClientTestCase..inc(96) : eval()'d code on line 10 ================================================================================ 001+ Warning: file_get_contents(https://127.0.0.1:64321/): failed to open stream: Connection refused in /Users/dragonbe/tmp/php-7.3.0alpha4/ext/openssl/tests/ServerClientTestCase..inc(96) : eval()'d code on line 10 001- Hello World! ================================================================================ ================================================================================ /Users/dragonbe/tmp/php-7.3.0alpha4/ext/openssl/tests/tls_min_v1.0_max_v1.1_wrapper.phpt ================================================================================ Warning: stream_socket_client(): unable to connect to tlsv1.0://127.0.0.1:64321 (Connection refused) in /Users/dragonbe/tmp/php-7.3.0alpha4/ext/openssl/tests/ServerClientTestCase..inc(96) : eval()'d code on line 9 bool(false) bool(false) bool(false) bool(false) bool(false) bool(false) ================================================================================ 001+ Warning: stream_socket_client(): unable to connect to tlsv1.0://127.0.0.1:64321 (Connection refused) in /Users/dragonbe/tmp/php-7.3.0alpha4/ext/openssl/tests/ServerClientTestCase..inc(96) : eval()'d code on line 9 002+ bool(false) 003+ bool(false) 004+ bool(false) 005+ bool(false) 001- resource(%d) of type (stream) 003- resource(%d) of type (stream) 005- resource(%d) of type (stream) 006- resource(%d) of type (stream) ================================================================================ ================================================================================ /Users/dragonbe/tmp/php-7.3.0alpha4/ext/openssl/tests/tls_wrapper.phpt ================================================================================ Warning: stream_socket_client(): unable to connect to tlsv1.0://127.0.0.1:64321 (Connection refused) in /Users/dragonbe/tmp/php-7.3.0alpha4/ext/openssl/tests/ServerClientTestCase..inc(96) : eval()'d code on line 9 bool(false) bool(false) bool(false) bool(false) bool(false) bool(false) ================================================================================ 001+ Warning: stream_socket_client(): unable to connect to tlsv1.0://127.0.0.1:64321 (Connection refused) in /Users/dragonbe/tmp/php-7.3.0alpha4/ext/openssl/tests/ServerClientTestCase..inc(96) : eval()'d code on line 9 002+ bool(false) 003+ bool(false) 004+ bool(false) 005+ bool(false) 006+ bool(false) 001- resource(%d) of type (stream) 003- resource(%d) of type (stream) 004- resource(%d) of type (stream) 005- resource(%d) of type (stream) 006- resource(%d) of type (stream) ================================================================================ ================================================================================ /Users/dragonbe/tmp/php-7.3.0alpha4/ext/openssl/tests/tlsv1.0_wrapper.phpt ================================================================================ Warning: stream_socket_client(): unable to connect to tlsv1.0://127.0.0.1:64321 (Connection refused) in /Users/dragonbe/tmp/php-7.3.0alpha4/ext/openssl/tests/ServerClientTestCase..inc(96) : eval()'d code on line 9 bool(false) bool(false) bool(false) ================================================================================ 001+ Warning: stream_socket_client(): unable to connect to tlsv1.0://127.0.0.1:64321 (Connection refused) in /Users/dragonbe/tmp/php-7.3.0alpha4/ext/openssl/tests/ServerClientTestCase..inc(96) : eval()'d code on line 9 002+ bool(false) 001- resource(%d) of type (stream) ================================================================================ ================================================================================ /Users/dragonbe/tmp/php-7.3.0alpha4/ext/openssl/tests/tlsv1.1_wrapper.phpt ================================================================================ Warning: stream_socket_client(): unable to connect to tlsv1.1://127.0.0.1:64321 (Connection refused) in /Users/dragonbe/tmp/php-7.3.0alpha4/ext/openssl/tests/ServerClientTestCase..inc(96) : eval()'d code on line 9 bool(false) bool(false) bool(false) ================================================================================ 001+ Warning: stream_socket_client(): unable to connect to tlsv1.1://127.0.0.1:64321 (Connection refused) in /Users/dragonbe/tmp/php-7.3.0alpha4/ext/openssl/tests/ServerClientTestCase..inc(96) : eval()'d code on line 9 002+ bool(false) 001- resource(%d) of type (stream) ================================================================================ ================================================================================ /Users/dragonbe/tmp/php-7.3.0alpha4/ext/openssl/tests/tlsv1.2_wrapper.phpt ================================================================================ Warning: stream_socket_client(): unable to connect to tlsv1.2://127.0.0.1:64321 (Connection refused) in /Users/dragonbe/tmp/php-7.3.0alpha4/ext/openssl/tests/ServerClientTestCase..inc(96) : eval()'d code on line 9 bool(false) bool(false) bool(false) ================================================================================ 001+ Warning: stream_socket_client(): unable to connect to tlsv1.2://127.0.0.1:64321 (Connection refused) in /Users/dragonbe/tmp/php-7.3.0alpha4/ext/openssl/tests/ServerClientTestCase..inc(96) : eval()'d code on line 9 002+ bool(false) 001- resource(%d) of type (stream) ================================================================================ ================================================================================ /Users/dragonbe/tmp/php-7.3.0alpha4/ext/sockets/tests/mcast_ipv6_send.phpt ================================================================================ Setting IPV6_MULTICAST_TTL bool(true) int(9) Setting IPV6_MULTICAST_LOOP bool(true) int(0) bool(true) int(1) Setting IPV6_MULTICAST_IF interface 0: Warning: socket_set_option(): unable to set socket option [49]: Can't assign requested address in /Users/dragonbe/tmp/php-7.3.0alpha4/ext/sockets/tests/mcast_ipv6_send.php on line 26 bool(false) int(0) interface 1: bool(true) int(1) ================================================================================ 013+ 014+ Warning: socket_set_option(): unable to set socket option [49]: Can't assign requested address in /Users/dragonbe/tmp/php-7.3.0alpha4/ext/sockets/tests/mcast_ipv6_send.php on line 26 015+ bool(false) 013- bool(true) ================================================================================ ================================================================================ /Users/dragonbe/tmp/php-7.3.0alpha4/ext/sockets/tests/socket_cmsg_rights.phpt ================================================================================ creating send socket resource(6) of type (Socket) creating receive socket resource(7) of type (Socket) bool(true) int(11) array(3) { ["name"]=> array(0) { } ["buffer_size"]=> int(2000) ["controllen"]=> int(28) } Array ( [name] => Array ( [family] => 1 [path] => ) [control] => Array ( [0] => Array ( [level] => 65535 [type] => 1 [data] => Array ( [0] => Resource id #8 [1] => Resource id #9 [2] => Resource id #10 [3] => Resource id #11 ) ) ) [iov] => Array ( [0] => test thing ) [flags] => 0 ) ================================================================================ 018+ [name] => Array 019+ ( 020+ [family] => 1 021+ [path] => 022+ ) 023+ 018- [name] => ================================================================================ ================================================================================ /Users/dragonbe/tmp/php-7.3.0alpha4/ext/sockets/tests/socket_getpeername_ipv6loop.phpt ================================================================================ Warning: socket_bind(): unable to bind address [48]: Address already in use in /Users/dragonbe/tmp/php-7.3.0alpha4/ext/sockets/tests/socket_getpeername_ipv6loop.php on line 15 string(3) "::1" bool(true) ================================================================================ 001+ Warning: socket_bind(): unable to bind address [48]: Address already in use in /Users/dragonbe/tmp/php-7.3.0alpha4/ext/sockets/tests/socket_getpeername_ipv6loop.php on line 15 ================================================================================ ================================================================================ /Users/dragonbe/tmp/php-7.3.0alpha4/ext/sockets/tests/socket_send.phpt ================================================================================ okey Warning: socket_send(): unable to write to socket [22]: Invalid argument in /Users/dragonbe/tmp/php-7.3.0alpha4/ext/sockets/tests/socket_send.php on line 14 okey okey ================================================================================ 002+ 003+ Warning: socket_send(): unable to write to socket [22]: Invalid argument in /Users/dragonbe/tmp/php-7.3.0alpha4/ext/sockets/tests/socket_send.php on line 14 004- okey ================================================================================ ================================================================================ /Users/dragonbe/tmp/php-7.3.0alpha4/ext/sockets/tests/socket_shutdown.phpt ================================================================================ bool(true) bool(true) bool(true) Warning: socket_shutdown(): unable to shutdown socket [57]: Socket is not connected in /Users/dragonbe/tmp/php-7.3.0alpha4/ext/sockets/tests/socket_shutdown.php on line 21 bool(false) Warning: socket_shutdown(): unable to shutdown socket [22]: Invalid argument in /Users/dragonbe/tmp/php-7.3.0alpha4/ext/sockets/tests/socket_shutdown.php on line 24 bool(false) ================================================================================ 005+ Warning: socket_shutdown(): unable to shutdown socket [57]: Socket is not connected in /Users/dragonbe/tmp/php-7.3.0alpha4/ext/sockets/tests/socket_shutdown.php on line 21 005- Warning: socket_shutdown(): unable to shutdown socket [%d]: Transport endpoint is not connected in %s on line %d ================================================================================ ================================================================================ /Users/dragonbe/tmp/php-7.3.0alpha4/ext/standard/tests/checkdnsrr.phpt ================================================================================ Warning: checkdnsrr() expects at least 1 parameter, 0 given in /Users/dragonbe/tmp/php-7.3.0alpha4/ext/standard/tests/checkdnsrr.php on line 3 NULL bool(false) bool(true) bool(false) bool(false) bool(false) bool(false) bool(false) bool(true) bool(false) bool(false) bool(false) bool(false) bool(true) ================================================================================ 003+ bool(false) 005+ bool(false) 006+ bool(false) 007+ bool(false) 008+ bool(false) 009+ bool(false) 011+ bool(false) 012+ bool(false) 013+ bool(false) 014+ bool(false) 006- bool(true) 007- bool(true) 008- bool(true) 009- bool(true) 010- bool(true) 011- bool(true) 012- bool(true) 013- bool(true) 014- bool(true) 015- bool(true) ================================================================================ ================================================================================ /Users/dragonbe/tmp/php-7.3.0alpha4/ext/standard/tests/dns_get_record.phpt ================================================================================ bool(true) bool(true) Warning: dns_get_record(): A temporary server error occurred. in /Users/dragonbe/tmp/php-7.3.0alpha4/ext/standard/tests/dns_get_record.php on line 6 bool(false) Warning: dns_get_record(): A temporary server error occurred. in /Users/dragonbe/tmp/php-7.3.0alpha4/ext/standard/tests/dns_get_record.php on line 7 bool(false) bool(true) bool(true) bool(true) bool(true) bool(true) bool(true) Warning: dns_get_record(): A temporary server error occurred. in /Users/dragonbe/tmp/php-7.3.0alpha4/ext/standard/tests/dns_get_record.php on line 14 bool(false) Warning: dns_get_record(): A temporary server error occurred. in /Users/dragonbe/tmp/php-7.3.0alpha4/ext/standard/tests/dns_get_record.php on line 15 bool(false) Warning: dns_get_record(): A temporary server error occurred. in /Users/dragonbe/tmp/php-7.3.0alpha4/ext/standard/tests/dns_get_record.php on line 16 bool(false) Warning: dns_get_record(): A temporary server error occurred. in /Users/dragonbe/tmp/php-7.3.0alpha4/ext/standard/tests/dns_get_record.php on line 17 bool(false) bool(true) Warning: dns_get_record(): A temporary server error occurred. in /Users/dragonbe/tmp/php-7.3.0alpha4/ext/standard/tests/dns_get_record.php on line 21 Warning: dns_get_record(): A temporary server error occurred. in /Users/dragonbe/tmp/php-7.3.0alpha4/ext/standard/tests/dns_get_record.php on line 22 Warning: dns_get_record(): A temporary server error occurred. in /Users/dragonbe/tmp/php-7.3.0alpha4/ext/standard/tests/dns_get_record.php on line 29 Warning: dns_get_record(): A temporary server error occurred. in /Users/dragonbe/tmp/php-7.3.0alpha4/ext/standard/tests/dns_get_record.php on line 30 Warning: dns_get_record(): A temporary server error occurred. in /Users/dragonbe/tmp/php-7.3.0alpha4/ext/standard/tests/dns_get_record.php on line 31 Warning: dns_get_record(): A temporary server error occurred. in /Users/dragonbe/tmp/php-7.3.0alpha4/ext/standard/tests/dns_get_record.php on line 32 bool(false) bool(false) bool(false) bool(false) bool(false) bool(false) bool(false) bool(false) bool(false) bool(false) bool(false) bool(false) bool(false) bool(false) Warning: dns_get_record(): A temporary server error occurred. in /Users/dragonbe/tmp/php-7.3.0alpha4/ext/standard/tests/dns_get_record.php on line 51 Warning: dns_get_record(): A temporary server error occurred. in /Users/dragonbe/tmp/php-7.3.0alpha4/ext/standard/tests/dns_get_record.php on line 52 Warning: dns_get_record(): A temporary server error occurred. in /Users/dragonbe/tmp/php-7.3.0alpha4/ext/standard/tests/dns_get_record.php on line 59 Warning: dns_get_record(): A temporary server error occurred. in /Users/dragonbe/tmp/php-7.3.0alpha4/ext/standard/tests/dns_get_record.php on line 60 Warning: dns_get_record(): A temporary server error occurred. in /Users/dragonbe/tmp/php-7.3.0alpha4/ext/standard/tests/dns_get_record.php on line 61 Warning: dns_get_record(): A temporary server error occurred. in /Users/dragonbe/tmp/php-7.3.0alpha4/ext/standard/tests/dns_get_record.php on line 62 bool(false) bool(false) bool(false) bool(false) bool(false) bool(false) bool(false) bool(false) bool(false) bool(false) bool(false) bool(false) bool(false) bool(false) bool(true) Warning: dns_get_record(): A temporary server error occurred. in /Users/dragonbe/tmp/php-7.3.0alpha4/ext/standard/tests/dns_get_record.php on line 81 bool(false) Warning: dns_get_record(): A temporary server error occurred. in /Users/dragonbe/tmp/php-7.3.0alpha4/ext/standard/tests/dns_get_record.php on line 82 bool(false) bool(true) bool(true) bool(true) bool(true) bool(true) bool(true) Warning: dns_get_record(): A temporary server error occurred. in /Users/dragonbe/tmp/php-7.3.0alpha4/ext/standard/tests/dns_get_record.php on line 89 bool(false) Warning: dns_get_record(): A temporary server error occurred. in /Users/dragonbe/tmp/php-7.3.0alpha4/ext/standard/tests/dns_get_record.php on line 90 bool(false) Warning: dns_get_record(): A temporary server error occurred. in /Users/dragonbe/tmp/php-7.3.0alpha4/ext/standard/tests/dns_get_record.php on line 91 bool(false) Warning: dns_get_record(): A temporary server error occurred. in /Users/dragonbe/tmp/php-7.3.0alpha4/ext/standard/tests/dns_get_record.php on line 92 bool(false) bool(true) bool(true) bool(true) Warning: dns_get_record(): A temporary server error occurred. in /Users/dragonbe/tmp/php-7.3.0alpha4/ext/standard/tests/dns_get_record.php on line 97 bool(false) Warning: dns_get_record(): A temporary server error occurred. in /Users/dragonbe/tmp/php-7.3.0alpha4/ext/standard/tests/dns_get_record.php on line 98 bool(false) bool(true) Warning: dns_get_record(): A temporary server error occurred. in /Users/dragonbe/tmp/php-7.3.0alpha4/ext/standard/tests/dns_get_record.php on line 100 bool(false) Warning: dns_get_record(): A temporary server error occurred. in /Users/dragonbe/tmp/php-7.3.0alpha4/ext/standard/tests/dns_get_record.php on line 101 bool(false) Warning: dns_get_record(): A temporary server error occurred. in /Users/dragonbe/tmp/php-7.3.0alpha4/ext/standard/tests/dns_get_record.php on line 102 bool(false) Warning: dns_get_record(): Numeric DNS record type must be between 1 and 65535, '134217728' given in /Users/dragonbe/tmp/php-7.3.0alpha4/ext/standard/tests/dns_get_record.php on line 103 bool(false) Warning: dns_get_record(): Numeric DNS record type must be between 1 and 65535, '33554432' given in /Users/dragonbe/tmp/php-7.3.0alpha4/ext/standard/tests/dns_get_record.php on line 104 bool(false) Warning: dns_get_record(): Numeric DNS record type must be between 1 and 65535, '67108864' given in /Users/dragonbe/tmp/php-7.3.0alpha4/ext/standard/tests/dns_get_record.php on line 105 bool(false) Warning: dns_get_record(): Numeric DNS record type must be between 1 and 65535, '16777216' given in /Users/dragonbe/tmp/php-7.3.0alpha4/ext/standard/tests/dns_get_record.php on line 106 bool(false) Warning: dns_get_record(): Numeric DNS record type must be between 1 and 65535, '251721779' given in /Users/dragonbe/tmp/php-7.3.0alpha4/ext/standard/tests/dns_get_record.php on line 107 bool(false) Warning: dns_get_record(): Numeric DNS record type must be between 1 and 65535, '268435456' given in /Users/dragonbe/tmp/php-7.3.0alpha4/ext/standard/tests/dns_get_record.php on line 108 bool(false) ================================================================================ 003+ 004+ Warning: dns_get_record(): A temporary server error occurred. in /Users/dragonbe/tmp/php-7.3.0alpha4/ext/standard/tests/dns_get_record.php on line 6 005+ bool(false) 006+ 007+ Warning: dns_get_record(): A temporary server error occurred. in /Users/dragonbe/tmp/php-7.3.0alpha4/ext/standard/tests/dns_get_record.php on line 7 008+ bool(false) 009- bool(true) 010- bool(true) 012- bool(true) 013- bool(true) 014- bool(true) 015- bool(true) 015+ 016+ Warning: dns_get_record(): A temporary server error occurred. in /Users/dragonbe/tmp/php-7.3.0alpha4/ext/standard/tests/dns_get_record.php on line 14 017+ bool(false) 018+ 019+ Warning: dns_get_record(): A temporary server error occurred. in /Users/dragonbe/tmp/php-7.3.0alpha4/ext/standard/tests/dns_get_record.php on line 15 020+ bool(false) 021+ 022+ Warning: dns_get_record(): A temporary server error occurred. in /Users/dragonbe/tmp/php-7.3.0alpha4/ext/standard/tests/dns_get_record.php on line 16 023+ bool(false) 024+ 025+ Warning: dns_get_record(): A temporary server error occurred. in /Users/dragonbe/tmp/php-7.3.0alpha4/ext/standard/tests/dns_get_record.php on line 17 026+ bool(false) 028+ 029+ Warning: dns_get_record(): A temporary server error occurred. in /Users/dragonbe/tmp/php-7.3.0alpha4/ext/standard/tests/dns_get_record.php on line 21 030+ 031+ Warning: dns_get_record(): A temporary server error occurred. in /Users/dragonbe/tmp/php-7.3.0alpha4/ext/standard/tests/dns_get_record.php on line 22 032+ 033+ Warning: dns_get_record(): A temporary server error occurred. in /Users/dragonbe/tmp/php-7.3.0alpha4/ext/standard/tests/dns_get_record.php on line 29 034+ 035+ Warning: dns_get_record(): A temporary server error occurred. in /Users/dragonbe/tmp/php-7.3.0alpha4/ext/standard/tests/dns_get_record.php on line 30 036+ 037+ Warning: dns_get_record(): A temporary server error occurred. in /Users/dragonbe/tmp/php-7.3.0alpha4/ext/standard/tests/dns_get_record.php on line 31 038+ 039+ Warning: dns_get_record(): A temporary server error occurred. in /Users/dragonbe/tmp/php-7.3.0alpha4/ext/standard/tests/dns_get_record.php on line 32 030- bool(false) 031- bool(false) 051- bool(true) 052- bool(true) 054+ 055+ Warning: dns_get_record(): A temporary server error occurred. in /Users/dragonbe/tmp/php-7.3.0alpha4/ext/standard/tests/dns_get_record.php on line 51 056+ 057+ Warning: dns_get_record(): A temporary server error occurred. in /Users/dragonbe/tmp/php-7.3.0alpha4/ext/standard/tests/dns_get_record.php on line 52 058+ 059+ Warning: dns_get_record(): A temporary server error occurred. in /Users/dragonbe/tmp/php-7.3.0alpha4/ext/standard/tests/dns_get_record.php on line 59 060+ 061+ Warning: dns_get_record(): A temporary server error occurred. in /Users/dragonbe/tmp/php-7.3.0alpha4/ext/standard/tests/dns_get_record.php on line 60 062+ 063+ Warning: dns_get_record(): A temporary server error occurred. in /Users/dragonbe/tmp/php-7.3.0alpha4/ext/standard/tests/dns_get_record.php on line 61 064+ 065+ Warning: dns_get_record(): A temporary server error occurred. in /Users/dragonbe/tmp/php-7.3.0alpha4/ext/standard/tests/dns_get_record.php on line 62 057- bool(true) 058- bool(true) 059- bool(true) 060- bool(true) 061- bool(true) 062- bool(true) 063- bool(true) 064- bool(true) 065- bool(true) 078+ bool(false) 079+ bool(false) 081+ 082+ Warning: dns_get_record(): A temporary server error occurred. in /Users/dragonbe/tmp/php-7.3.0alpha4/ext/standard/tests/dns_get_record.php on line 81 083+ bool(false) 084+ 085+ Warning: dns_get_record(): A temporary server error occurred. in /Users/dragonbe/tmp/php-7.3.0alpha4/ext/standard/tests/dns_get_record.php on line 82 086+ bool(false) 093+ 094+ Warning: dns_get_record(): A temporary server error occurred. in /Users/dragonbe/tmp/php-7.3.0alpha4/ext/standard/tests/dns_get_record.php on line 89 095+ bool(false) 096+ 097+ Warning: dns_get_record(): A temporary server error occurred. in /Users/dragonbe/tmp/php-7.3.0alpha4/ext/standard/tests/dns_get_record.php on line 90 098+ bool(false) 099+ 100+ Warning: dns_get_record(): A temporary server error occurred. in /Users/dragonbe/tmp/php-7.3.0alpha4/ext/standard/tests/dns_get_record.php on line 91 101+ bool(false) 102+ 103+ Warning: dns_get_record(): A temporary server error occurred. in /Users/dragonbe/tmp/php-7.3.0alpha4/ext/standard/tests/dns_get_record.php on line 92 104+ bool(false) 108+ 109+ Warning: dns_get_record(): A temporary server error occurred. in /Users/dragonbe/tmp/php-7.3.0alpha4/ext/standard/tests/dns_get_record.php on line 97 110+ bool(false) 111+ 112+ Warning: dns_get_record(): A temporary server error occurred. in /Users/dragonbe/tmp/php-7.3.0alpha4/ext/standard/tests/dns_get_record.php on line 98 113+ bool(false) 115+ 116+ Warning: dns_get_record(): A temporary server error occurred. in /Users/dragonbe/tmp/php-7.3.0alpha4/ext/standard/tests/dns_get_record.php on line 100 117+ bool(false) 118+ 119+ Warning: dns_get_record(): A temporary server error occurred. in /Users/dragonbe/tmp/php-7.3.0alpha4/ext/standard/tests/dns_get_record.php on line 101 120+ bool(false) 121+ 122+ Warning: dns_get_record(): A temporary server error occurred. in /Users/dragonbe/tmp/php-7.3.0alpha4/ext/standard/tests/dns_get_record.php on line 102 123+ bool(false) ================================================================================ ================================================================================ /Users/dragonbe/tmp/php-7.3.0alpha4/ext/standard/tests/file/bug69442.phpt ================================================================================ Warning: proc_open(): pty pseudo terminal not supported on this system in /Users/dragonbe/tmp/php-7.3.0alpha4/ext/standard/tests/file/bug69442.php on line 6 Warning: proc_close() expects parameter 1 to be resource, bool given in /Users/dragonbe/tmp/php-7.3.0alpha4/ext/standard/tests/file/bug69442.php on line 14 ================================================================================ 001+ Warning: proc_open(): pty pseudo terminal not supported on this system in /Users/dragonbe/tmp/php-7.3.0alpha4/ext/standard/tests/file/bug69442.php on line 6 002+ 003+ Warning: proc_close() expects parameter 1 to be resource, bool given in /Users/dragonbe/tmp/php-7.3.0alpha4/ext/standard/tests/file/bug69442.php on line 14 001- type 0 string(5) "foo 002- " 003- type 1 string(0) "" 004- type 2 string(0) "" 005- type 3 string(3) "42 006- " ================================================================================ ================================================================================ /Users/dragonbe/tmp/php-7.3.0alpha4/ext/standard/tests/ini_info/php_ini_loaded_file.phpt ================================================================================ bool(false) sh: line 1: 56170 Segmentation fault: 11 "/Users/dragonbe/tmp/php-7.3.0alpha4/sapi/cli/php" -c "/Users/dragonbe/tmp/php-7.3.0alpha4/ext/standard/tests/ini_info/loaded.ini" -r "var_dump(php_ini_loaded_file());" ================================================================================ 002+ sh: line 1: 56170 Segmentation fault: 11 "/Users/dragonbe/tmp/php-7.3.0alpha4/sapi/cli/php" -c "/Users/dragonbe/tmp/php-7.3.0alpha4/ext/standard/tests/ini_info/loaded.ini" -r "var_dump(php_ini_loaded_file());" 002- string\(\d+\) ".*[\/\\]loaded\.ini" ================================================================================ ================================================================================ /Users/dragonbe/tmp/php-7.3.0alpha4/ext/standard/tests/network/bug73594.phpt ================================================================================ bool(true) ================================================================================ 001+ bool(true) 001- bool(false) ================================================================================ ================================================================================ /Users/dragonbe/tmp/php-7.3.0alpha4/ext/standard/tests/streams/stream_context_tcp_nodelay_server.phpt ================================================================================ ** ERROR: process timed out ** ================================================================================ 001+ ** ERROR: process timed out ** 001- bool(false) 002- bool(true) ================================================================================ ================================================================================ /Users/dragonbe/tmp/php-7.3.0alpha4/ext/standard/tests/streams/stream_socket_enable_crypto.phpt ================================================================================ bool(false) Warning: stream_socket_enable_crypto(): When enabling encryption you must specify the crypto type in /Users/dragonbe/tmp/php-7.3.0alpha4/ext/standard/tests/streams/stream_socket_enable_crypto.php on line 7 bool(false) ** ERROR: process timed out ** ================================================================================ 006+ ** ERROR: process timed out ** 006- Warning: stream_socket_enable_crypto(): SSL: %a in %s on line %d 007- bool(false) 008- 009- Warning: stream_socket_enable_crypto(): SSL/TLS already set-up for this stream in %s on line %d 010- bool(false) 011- 012- Warning: stream_socket_enable_crypto(): SSL/TLS already set-up for this stream in %s on line %d 013- bool(false) 014- 015- Warning: stream_socket_enable_crypto(): SSL/TLS already set-up for this stream in %s on line %d 016- bool(false) 017- 018- Warning: stream_socket_enable_crypto(): SSL/TLS already set-up for this stream in %s on line %d 019- bool(false) 020- 021- Warning: stream_socket_enable_crypto(): SSL/TLS already set-up for this stream in %s on line %d 022- bool(false) 023- 024- Warning: stream_socket_enable_crypto(): SSL/TLS already set-up for this stream in %s on line %d 025- bool(false) 026- 027- Warning: stream_socket_enable_crypto(): SSL/TLS already set-up for this stream in %s on line %d 028- bool(false) ================================================================================ ================================================================================ /Users/dragonbe/tmp/php-7.3.0alpha4/ext/standard/tests/streams/stream_socket_sendto.phpt ================================================================================ Notice: fwrite(): send of 23 bytes failed with errno=57 Socket is not connected in /Users/dragonbe/tmp/php-7.3.0alpha4/ext/standard/tests/streams/stream_socket_sendto.php on line 9 Warning: stream_socket_sendto() expects at least 2 parameters, 0 given in /Users/dragonbe/tmp/php-7.3.0alpha4/ext/standard/tests/streams/stream_socket_sendto.php on line 10 bool(false) Warning: stream_socket_sendto() expects at least 2 parameters, 1 given in /Users/dragonbe/tmp/php-7.3.0alpha4/ext/standard/tests/streams/stream_socket_sendto.php on line 11 bool(false) Warning: stream_socket_sendto(): Socket is not connected in /Users/dragonbe/tmp/php-7.3.0alpha4/ext/standard/tests/streams/stream_socket_sendto.php on line 12 int(-1) Warning: stream_socket_sendto(): Socket is not connected in /Users/dragonbe/tmp/php-7.3.0alpha4/ext/standard/tests/streams/stream_socket_sendto.php on line 13 int(-1) Warning: stream_socket_sendto(): php_network_getaddresses: getaddrinfo failed: nodename nor servname provided, or not known in /Users/dragonbe/tmp/php-7.3.0alpha4/ext/standard/tests/streams/stream_socket_sendto.php on line 14 Warning: stream_socket_sendto(): Failed to resolve `tcp': php_network_getaddresses: getaddrinfo failed: nodename nor servname provided, or not known in /Users/dragonbe/tmp/php-7.3.0alpha4/ext/standard/tests/streams/stream_socket_sendto.php on line 14 Warning: stream_socket_sendto(): Failed to parse `tcp://127.0.0.1:31854' into a valid network address in /Users/dragonbe/tmp/php-7.3.0alpha4/ext/standard/tests/streams/stream_socket_sendto.php on line 14 bool(false) Warning: stream_socket_sendto(): php_network_getaddresses: getaddrinfo failed: nodename nor servname provided, or not known in /Users/dragonbe/tmp/php-7.3.0alpha4/ext/standard/tests/streams/stream_socket_sendto.php on line 15 Warning: stream_socket_sendto(): Failed to resolve `http': php_network_getaddresses: getaddrinfo failed: nodename nor servname provided, or not known in /Users/dragonbe/tmp/php-7.3.0alpha4/ext/standard/tests/streams/stream_socket_sendto.php on line 15 Warning: stream_socket_sendto(): Failed to parse `http://php.net' into a valid network address in /Users/dragonbe/tmp/php-7.3.0alpha4/ext/standard/tests/streams/stream_socket_sendto.php on line 15 bool(false) ================================================================================ 001+ Notice: fwrite(): send of 23 bytes failed with errno=57 Socket is not connected in /Users/dragonbe/tmp/php-7.3.0alpha4/ext/standard/tests/streams/stream_socket_sendto.php on line 9 001- Notice: fwrite(): send of %i bytes failed with errno=%i Broken pipe in %s on line %d 009+ Warning: stream_socket_sendto(): Socket is not connected 009- Warning: stream_socket_sendto(): Broken pipe 013+ Warning: stream_socket_sendto(): Socket is not connected 013- Warning: stream_socket_sendto(): Broken pipe 017+ Warning: stream_socket_sendto(): php_network_getaddresses: getaddrinfo failed: nodename nor servname provided, or not known in /Users/dragonbe/tmp/php-7.3.0alpha4/ext/standard/tests/streams/stream_socket_sendto.php on line 14 017- Warning: stream_socket_sendto(): php_network_getaddresses: getaddrinfo failed: Name or service not known in %s on line %d 019+ Warning: stream_socket_sendto(): Failed to resolve `tcp': php_network_getaddresses: getaddrinfo failed: nodename nor servname provided, or not known in /Users/dragonbe/tmp/php-7.3.0alpha4/ext/standard/tests/streams/stream_socket_sendto.php on line 14 019- Warning: stream_socket_sendto(): Failed to resolve %s: php_network_getaddresses: getaddrinfo failed: Name or service not known in %s on line %d 024+ Warning: stream_socket_sendto(): php_network_getaddresses: getaddrinfo failed: nodename nor servname provided, or not known in /Users/dragonbe/tmp/php-7.3.0alpha4/ext/standard/tests/streams/stream_socket_sendto.php on line 15 024- Warning: stream_socket_sendto(): php_network_getaddresses: getaddrinfo failed: Name or service not known in %s on line %d 026+ Warning: stream_socket_sendto(): Failed to resolve `http': php_network_getaddresses: getaddrinfo failed: nodename nor servname provided, or not known in /Users/dragonbe/tmp/php-7.3.0alpha4/ext/standard/tests/streams/stream_socket_sendto.php on line 15 026- Warning: stream_socket_sendto(): Failed to resolve %s: php_network_getaddresses: getaddrinfo failed: Name or service not known in %s on line %d ================================================================================ ================================================================================ /Users/dragonbe/tmp/php-7.3.0alpha4/ext/zip/tests/oo_addglob.phpt ================================================================================ 0 bar 1 foobar/ 2 foobar/baz 3 entry1.txt 4 baz/bar.baz 5 baz/foo.txt ================================================================================ 005+ 4 baz/bar.baz 006+ 5 baz/foo.txt 005- 4 baz/foo.txt 006- 5 baz/bar.baz ================================================================================ ================================================================================ /Users/dragonbe/tmp/php-7.3.0alpha4/ext/zlib/tests/bug55544.phpt ================================================================================ ‹ËȬ*“Ø ================================================================================ 001+ ‹ËȬ*“Ø 001- ‹ËȬ*“Ø ================================================================================ ================================================================================ /Users/dragonbe/tmp/php-7.3.0alpha4/ext/zlib/tests/gzencode_variation1.phpt ================================================================================ *** Testing gzencode() : variation *** -- Testing multiple compression -- string(3658) "1f8b0800000000000013010e07f1f81f8b08000000000000136d574d6fe4c80dbdeb57d4ad2f3dfe01eb83e1ec22980e309b4562c067b64449159754dafab0b6e7d7e73d96da1e4c72184c4b2ab2c8f7c847fa25baabba98dc1a8b2b7c38bb324b713ee37f757f56cdc5c7f5b17b9d152f923b157c5ae335e0b75fedd0e2d781c6b98ea3a6ee05affe1dfc3a6527f8f09c52dcb38ba38bb5249934d6ecfe1e53a9ab76ff4c342cf2a64ed2028349fc9a8b139755685352acb82b9fbb67f8bade5cdcb698e1fcec94b7ceba3cb897e806cfc8114350dd1ebbdfa35b62d2478b0056d23ed809b9b95d696d91ce2aa97c911e3fa539c43f84c887554a4d125c9e63ff96711cc08c0866263cb37a0bbe2122ae8f6baecb2284abfb4ddf916db8354cddeef37c1afe5fa02fc7afb3db34f5b3acbdf2eb905490d8f38d7468d253a323d5ebb903760d7944d3b2024e834a99ddce77669bdd823cfbb8e899d4ad4c799677452e6029e80023a03b2374005590641f7d3877df2ad09f3c0e82a54d6a5644fd63049a37ed4bc362016fd9f51264f1e5c630727421ae930b7ed416e93e47b7c71a400390361ffbecb7561bb98f69b5da289e91becc27f08b3b724cb8704f9144d366431d0cb870c56b205deaa2e17636063761a911039fb7e4bf9f06c4f0aecd2ec80e8b41831ca7515e31286166458ea3ef71f2ce7cde2ae269c96d60525724a9c9170b713ed5750758f3cd2a361fc8b288fc92358ce884692e8ea0fe59bd969a0da2eed5831b715749eaae7178f3ebd30fb88c92105f367cce2c882955dc6bf8eca0d5d57540b3092894743ba0fd5b2dad021836191f1afc0bba14dde1642cb0b1aa6879c38907dcefa0720082b801bec61417469219175267dfa047df35b0bd1332001c28cdfafd3bcabe91e74368cdd8d8478e494c190e7ee90c67f2bde288e68ab6b15e883c995be4f8feb6c6dda4278e4f38578ddbdc7be36788daf0c3cb1d1819c73822f7000a0d1813fa94153b572315e51343b536bc64977dff163cebfd8418773261f524017e251fccc60ae29a5770ae097594d52e9c1229d87ce967a36401c46b69945afb249d101c9d420ffa9a123e232c20e76467d5d169202a2dd4c582949e013e745df7958d4b0cc4fd4377a737cd4feea7974070000f314d423e0634cb9a618fdf5dc64fd422181fd59c9230c9f6f9d18dc8fc23e9cccbc7188733b04aa57de83ebea0be3633cff5fa1ff83269be7f44f5a8d84550cc703255fd345dd402034d0b3e11a73ec6e3d4a77f4f685b614329f1b3132ae7af33d02e1e55e291fa6574b758d1f0200e7423dbc852211818043a7c9ce80aa9d59fce0401959f5ea2cf71fde90824f8c9192dbe9d329db143794675ddcf257dd7755273b67340414e3ccad12e3f661f8aad9cf9957dc1275d10a51d3934fa81e68dc6768fb8ee23e373936c8e13feab8b0f50d227f7af76f561fb0950f3d099bbc316c3892a42fb36806d8660e800fa4f43fd4b962d2097d71933a54b77ff948677848eb17bb3a88b621682cfb3bbb49cf42fed6b3944124ad8358ca688aa44dd5f2144c7c9ab16f25b9aca9654ef357ec9ad55c40d324d6cc3d9e3920b863c231d31a95d937fb5520f9c816c79b7dcecc593fb9593cc05a51ebb1eeddd5b49eb437769738d0f64adc579d372b8b7f7c0208487ee3915ebf5766e148ebd77cf4e01f3ec285047011e55838968b6494d517fe29224777b24dd3ddf933101695b102e87db805eef291b74dcfd91628fb2a53f93dbd2968ef2e598746c9204f89fba1f0246fc671610a0591806e46a1346f77c40d910a47c5e20ffb23f003c04b648327a4ed98032c1965bd35bb0044f5344248f56fdb99aa61d6451d68e33489a83bffbe6573541b2da5f64681ea12090f778b2075374778810f73965fa3626a9d41f4df2f83f7c34658cec921b5a9bde49dd5007ec882b02adc514f81aa85898b5cc98e1b137733c0a8789b7f5648d2d231b80bf74978f25d61ce08a8abd11801fd8f995e066676307192ff7641f1cc6e0dee68565b8b22ac3889cd067bf732754a6b270af1044c6a8776811a4f6d8bd0477a9f516064201b920b92d7cd4dc7eee13e6b3eb3528a82f9abb3f388ebe6a8f871393461b73816ec54c99d604174bc5a6801de13908f86aea6a7d0fea107d682bcf1ec348b83872e6b8a316ecd02eb8f8dc86a609bf59a2dd03f1dfa4079436d55e24617be1a2854d008b2b2b1705e2078a7f3946318df1c24f6bf70d4b456eca286ec2b585b28262cc048a098c3e2d5f325a92bb36f691afdc14c822da1b116c9c1c07bb362eb0a04b78834c812134230ebf2044ac2e3c0e3ad00f848dc5010f3bf917ec2fc700b7bf26dacea8440620e04f90f4d97d6dd77cfde8a05c7d3930f1e5811fb8ec5c70964dcc8187ec90e32fdd6b64eec7586413b7d55bed65c4cce39a9b6c15e70e9da94e53fc904e6286f01f5b5562c94211befbc23507e01b2a3865e2f45b5d7b591f290087a5605b82495b4e393f31aa5b37211ec40241a746d903c5eebf117a4d3ddb0d0000ed6ebe4d0e070000" ===Done=== ================================================================================ 004+ string(3658) "1f8b0800000000000013010e07f1f81f8b08000000000000136d574d6fe4c80dbdeb57d4ad2f3dfe01eb83e1ec22980e309b4562c067b64449159754dafab0b6e7d7e73d96da1e4c72184c4b2ab2c8f7c847fa25baabba98dc1a8b2b7c38bb324b713ee37f757f56cdc5c7f5b17b9d152f923b157c5ae335e0b75fedd0e2d781c6b98ea3a6ee05affe1dfc3a6527f8f09c52dcb38ba38bb5249934d6ecfe1e53a9ab76ff4c342cf2a64ed2028349fc9a8b139755685352acb82b9fbb67f8bade5cdcb698e1fcec94b7ceba3cb897e806cfc8114350dd1ebbdfa35b62d2478b0056d23ed809b9b95d696d91ce2aa97c911e3fa539c43f84c887554a4d125c9e63ff96711cc08c0866263cb37a0bbe2122ae8f6baecb2284abfb4ddf916db8354cddeef37c1afe5fa02fc7afb3db34f5b3acbdf2eb905490d8f38d7468d253a323d5ebb903760d7944d3b2024e834a99ddce77669bdd823cfbb8e899d4ad4c799677452e6029e80023a03b2374005590641f7d3877df2ad09f3c0e82a54d6a5644fd63049a37ed4bc362016fd9f51264f1e5c630727421ae930b7ed416e93e47b7c71a400390361ffbecb7561bb98f69b5da289e91becc27f08b3b724cb8704f9144d366431d0cb870c56b205deaa2e17636063761a911039fb7e4bf9f06c4f0aecd2ec80e8b41831ca7515e31286166458ea3ef71f2ce7cde2ae269c96d60525724a9c9170b713ed5750758f3cd2a361fc8b288fc92358ce884692e8ea0fe59bd969a0da2eed5831b715749eaae7178f3ebd30fb88c92105f367cce2c882955dc6bf8eca0d5d57540b3092894743ba0fd5b2dad021836191f1afc0bba14dde1642cb0b1aa6879c38907dcefa0720082b801bec61417469219175267dfa047df35b0bd1332001c28cdfafd3bcabe91e74368cdd8d8478e494c190e7ee90c67f2bde288e68ab6b15e883c995be4f8feb6c6dda4278e4f38578ddbdc7be36788daf0c3cb1d1819c73822f7000a0d1813fa94153b572315e51343b536bc64977dff163cebfd8418773261f524017e251fccc60ae29a5770ae097594d52e9c1229d87ce967a36401c46b69945afb249d101c9d420ffa9a123e232c20e76467d5d169202a2dd4c582949e013e745df7958d4b0cc4fd4377a737cd4feea7974070000f314d423e0634cb9a618fdf5dc64fd422181fd59c9230c9f6f9d18dc8fc23e9cccbc7188733b04aa57de83ebea0be3633cff5fa1ff83269be7f44f5a8d84550cc703255fd345dd402034d0b3e11a73ec6e3d4a77f4f685b614329f1b3132ae7af33d02e1e55e291fa6574b758d1f0200e7423dbc852211818043a7c9ce80aa9d59fce0401959f5ea2cf71fde90824f8c9192dbe9d329db143794675ddcf257dd7755273b67340414e3ccad12e3f661f8aad9cf9957dc1275d10a51d3934fa81e68dc6768fb8ee23e373936c8e13feab8b0f50d227f7af76f561fb0950f3d099bbc316c3892a42fb36806d8660e800fa4f43fd4b962d2097d71933a54b77ff948677848eb17bb3a88b621682cfb3bbb49cf42fed6b3944124ad8358ca688aa44dd5f2144c7c9ab16f25b9aca9654ef357ec9ad55c40d324d6cc3d9e3920b863c231d31a95d937fb5520f9c816c79b7dcecc593fb9593cc05a51ebb1eeddd5b49eb437769738d0f64adc579d372b8b7f7c0208487ee3915ebf5766e148ebd77cf4e01f3ec285047011e55838968b6494d517fe29224777b24dd3ddf933101695b102e87db805eef291b74dcfd91628fb2a53f93dbd2968ef2e598746c9204f89fba1f0246fc671610a0591806e46a1346f77c40d910a47c5e20ffb23f003c04b648327a4ed98032c1965bd35bb0044f5344248f56fdb99aa61d6451d68e33489a83bffbe6573541b2da5f64681ea12090f778b2075374778810f73965fa3626a9d41f4df2f83f7c34658cec921b5a9bde49dd5007ec882b02adc514f81aa85898b5cc98e1b137733c0a8789b7f5648d2d231b80bf74978f25d61ce08a8abd11801fd8f995e066676307192ff7641f1cc6e0dee68565b8b22ac3889cd067bf732754a6b270af1044c6a8776811a4f6d8bd0477a9f516064201b920b92d7cd4dc7eee13e6b3eb3528a82f9abb3f388ebe6a8f871393461b73816ec54c99d604174bc5a6801de13908f86aea6a7d0fea107d682bcf1ec348b83872e6b8a316ecd02eb8f8dc86a609bf59a2dd03f1dfa4079436d55e24617be1a2854d008b2b2b1705e2078a7f3946318df1c24f6bf70d4b456eca286ec2b585b28262cc048a098c3e2d5f325a92bb36f691afdc14c822da1b116c9c1c07bb362eb0a04b78834c812134230ebf2044ac2e3c0e3ad00f848dc5010f3bf917ec2fc700b7bf26dacea8440620e04f90f4d97d6dd77cfde8a05c7d3930f1e5811fb8ec5c70964dcc8187ec90e32fdd6b64eec7586413b7d55bed65c4cce39a9b6c15e70e9da94e53fc904e6286f01f5b5562c94211befbc23507e01b2a3865e2f45b5d7b591f290087a5605b82495b4e393f31aa5b37211ec40241a746d903c5eebf117a4d3ddb0d0000ed6ebe4d0e070000" 004- string(3658) "1f8b0800000000000003010e07f1f81f8b08000000000000036d574d6fe4c80dbdeb57d4ad2f3dfe01eb83e1ec22980e309b4562c067b64449159754dafab0b6e7d7e73d96da1e4c72184c4b2ab2c8f7c847fa25baabba98dc1a8b2b7c38bb324b713ee37f757f56cdc5c7f5b17b9d152f923b157c5ae335e0b75fedd0e2d781c6b98ea3a6ee05affe1dfc3a6527f8f09c52dcb38ba38bb5249934d6ecfe1e53a9ab76ff4c342cf2a64ed2028349fc9a8b139755685352acb82b9fbb67f8bade5cdcb698e1fcec94b7ceba3cb897e806cfc8114350dd1ebbdfa35b62d2478b0056d23ed809b9b95d696d91ce2aa97c911e3fa539c43f84c887554a4d125c9e63ff96711cc08c0866263cb37a0bbe2122ae8f6baecb2284abfb4ddf916db8354cddeef37c1afe5fa02fc7afb3db34f5b3acbdf2eb905490d8f38d7468d253a323d5ebb903760d7944d3b2024e834a99ddce77669bdd823cfbb8e899d4ad4c799677452e6029e80023a03b2374005590641f7d3877df2ad09f3c0e82a54d6a5644fd63049a37ed4bc362016fd9f51264f1e5c630727421ae930b7ed416e93e47b7c71a400390361ffbecb7561bb98f69b5da289e91becc27f08b3b724cb8704f9144d366431d0cb870c56b205deaa2e17636063761a911039fb7e4bf9f06c4f0aecd2ec80e8b41831ca7515e31286166458ea3ef71f2ce7cde2ae269c96d60525724a9c9170b713ed5750758f3cd2a361fc8b288fc92358ce884692e8ea0fe59bd969a0da2eed5831b715749eaae7178f3ebd30fb88c92105f367cce2c882955dc6bf8eca0d5d57540b3092894743ba0fd5b2dad021836191f1afc0bba14dde1642cb0b1aa6879c38907dcefa0720082b801bec61417469219175267dfa047df35b0bd1332001c28cdfafd3bcabe91e74368cdd8d8478e494c190e7ee90c67f2bde288e68ab6b15e883c995be4f8feb6c6dda4278e4f38578ddbdc7be36788daf0c3cb1d1819c73822f7000a0d1813fa94153b572315e51343b536bc64977dff163cebfd8418773261f524017e251fccc60ae29a5770ae097594d52e9c1229d87ce967a36401c46b69945afb249d101c9d420ffa9a123e232c20e76467d5d169202a2dd4c582949e013e745df7958d4b0cc4fd4377a737cd4feea7974070000f314d423e0634cb9a618fdf5dc64fd422181fd59c9230c9f6f9d18dc8fc23e9cccbc7188733b04aa57de83ebea0be3633cff5fa1ff83269be7f44f5a8d84550cc703255fd345dd402034d0b3e11a73ec6e3d4a77f4f685b614329f1b3132ae7af33d02e1e55e291fa6574b758d1f0200e7423dbc852211818043a7c9ce80aa9d59fce0401959f5ea2cf71fde90824f8c9192dbe9d329db143794675ddcf257dd7755273b67340414e3ccad12e3f661f8aad9cf9957dc1275d10a51d3934fa81e68dc6768fb8ee23e373936c8e13feab8b0f50d227f7af76f561fb0950f3d099bbc316c3892a42fb36806d8660e800fa4f43fd4b962d2097d71933a54b77ff948677848eb17bb3a88b621682cfb3bbb49cf42fed6b3944124ad8358ca688aa44dd5f2144c7c9ab16f25b9aca9654ef357ec9ad55c40d324d6cc3d9e3920b863c231d31a95d937fb5520f9c816c79b7dcecc593fb9593cc05a51ebb1eeddd5b49eb437769738d0f64adc579d372b8b7f7c0208487ee3915ebf5766e148ebd77cf4e01f3ec285047011e55838968b6494d517fe29224777b24dd3ddf933101695b102e87db805eef291b74dcfd91628fb2a53f93dbd2968ef2e598746c9204f89fba1f0246fc671610a0591806e46a1346f77c40d910a47c5e20ffb23f003c04b648327a4ed98032c1965bd35bb0044f5344248f56fdb99aa61d6451d68e33489a83bffbe6573541b2da5f64681ea12090f778b2075374778810f73965fa3626a9d41f4df2f83f7c34658cec921b5a9bde49dd5007ec882b02adc514f81aa85898b5cc98e1b137733c0a8789b7f5648d2d231b80bf74978f25d61ce08a8abd11801fd8f995e066676307192ff7641f1cc6e0dee68565b8b22ac3889cd067bf732754a6b270af1044c6a8776811a4f6d8bd0477a9f516064201b920b92d7cd4dc7eee13e6b3eb3528a82f9abb3f388ebe6a8f871393461b73816ec54c99d604174bc5a6801de13908f86aea6a7d0fea107d682bcf1ec348b83872e6b8a316ecd02eb8f8dc86a609bf59a2dd03f1dfa4079436d55e24617be1a2854d008b2b2b1705e2078a7f3946318df1c24f6bf70d4b456eca286ec2b585b28262cc048a098c3e2d5f325a92bb36f691afdc14c822da1b116c9c1c07bb362eb0a04b78834c812134230ebf2044ac2e3c0e3ad00f848dc5010f3bf917ec2fc700b7bf26dacea8440620e04f90f4d97d6dd77cfde8a05c7d3930f1e5811fb8ec5c70964dcc8187ec90e32fdd6b64eec7586413b7d55bed65c4cce39a9b6c15e70e9da94e53fc904e6286f01f5b5562c94211befbc23507e01b2a3865e2f45b5d7b591f290087a5605b82495b4e393f31aa5b37211ec40241a746d903c5eebf117a4d3ddb0d00007b64cbc70e070000" ================================================================================ ================================================================================ /Users/dragonbe/tmp/php-7.3.0alpha4/ext/zlib/tests/gzencode_variation2.phpt ================================================================================ *** Testing gzencode() : variation *** -- Testing with each encoding_mode -- string(90) "1f8b0800000000000013735428ce4dccc951282e29cacc4b5728c95748cd4bce4f49e50200d7739de519000000" string(90) "1f8b0800000000000013735428ce4dccc951282e29cacc4b5728c95748cd4bce4f49e50200d7739de519000000" string(66) "789c735428ce4dccc951282e29cacc4b5728c95748cd4bce4f49e50200735808cd" ===DONE=== ================================================================================ 004+ string(90) "1f8b0800000000000013735428ce4dccc951282e29cacc4b5728c95748cd4bce4f49e50200d7739de519000000" 005+ string(90) "1f8b0800000000000013735428ce4dccc951282e29cacc4b5728c95748cd4bce4f49e50200d7739de519000000" 004- string(90) "1f8b0800000000000003735428ce4dccc951282e29cacc4b5728c95748cd4bce4f49e50200d7739de519000000" 005- string(90) "1f8b0800000000000003735428ce4dccc951282e29cacc4b5728c95748cd4bce4f49e50200d7739de519000000" ================================================================================ ================================================================================ /Users/dragonbe/tmp/php-7.3.0alpha4/sapi/cli/tests/017.phpt ================================================================================ -------------- Snippet no. 1: -------------- sh: line 1: 62321 Done echo 'echo '\''Hello world'\''; exit' 62322 Segmentation fault: 11 | "/Users/dragonbe/tmp/php-7.3.0alpha4/sapi/cli/php" -a -------------- Snippet no. 2: -------------- sh: line 3: 62324 Done echo 'echo '\''multine single quote'\''; exit' 62325 Segmentation fault: 11 | "/Users/dragonbe/tmp/php-7.3.0alpha4/sapi/cli/php" -a -------------- Snippet no. 3: -------------- sh: line 5: 62327 Done echo 'echo <<<HEREDOC Here comes the doc HEREDOC;' 62328 Segmentation fault: 11 | "/Users/dragonbe/tmp/php-7.3.0alpha4/sapi/cli/php" -a -------------- Snippet no. 4: -------------- sh: line 3: 62330 Done echo 'if (0) { echo "I'\''m not there"; } echo "Done";' 62331 Segmentation fault: 11 | "/Users/dragonbe/tmp/php-7.3.0alpha4/sapi/cli/php" -a -------------- Snippet no. 5: -------------- sh: line 3: 62333 Done echo 'function a_function_with_some_name() { echo "I was called!"; } a_function_w );' 62334 Segmentation fault: 11 | "/Users/dragonbe/tmp/php-7.3.0alpha4/sapi/cli/php" -a Done ================================================================================ 004+ sh: line 1: 62321 Done echo 'echo '\''Hello world'\''; 005+ exit' 006+ 62322 Segmentation fault: 11 | "/Users/dragonbe/tmp/php-7.3.0alpha4/sapi/cli/php" -a 004- Interactive shell 006- Hello world 008- 012+ sh: line 3: 62324 Done echo 'echo '\''multine 013+ single 014+ quote'\''; 015+ exit' 016+ 62325 Segmentation fault: 11 | "/Users/dragonbe/tmp/php-7.3.0alpha4/sapi/cli/php" -a 012- Interactive shell 013- 014- multine 015- single 016- quote 022+ sh: line 5: 62327 Done echo 'echo <<<HEREDOC 022- Interactive shell 023- 027+ HEREDOC;' 028+ 62328 Segmentation fault: 11 | "/Users/dragonbe/tmp/php-7.3.0alpha4/sapi/cli/php" -a 033- Interactive shell 034+ sh: line 3: 62330 Done echo 'if (0) { 035+ echo "I'\''m not there"; 036+ } 037+ echo "Done";' 038+ 62331 Segmentation fault: 11 | "/Users/dragonbe/tmp/php-7.3.0alpha4/sapi/cli/php" -a 035- Done 037- 041- Interactive shell 044+ sh: line 3: 62333 Done echo 'function a_function_with_some_name() { 045+ echo "I was called!"; 046+ } 047+ a_function_w );' 048+ 62334 Segmentation fault: 11 | "/Users/dragonbe/tmp/php-7.3.0alpha4/sapi/cli/php" -a 044- Parse error: syntax error, unexpected ')' in php shell code on line 1 045- 046- ================================================================================ ================================================================================ /Users/dragonbe/tmp/php-7.3.0alpha4/sapi/cli/tests/023.phpt ================================================================================ string(0) "" string(0) "" ================================================================================ 001+ string(0) "" 001- string(3) "40M" ================================================================================ ================================================================================ /Users/dragonbe/tmp/php-7.3.0alpha4/sapi/cli/tests/bug74600.phpt ================================================================================ string(0) "" string(0) "" ================================================================================ 001+ string(0) "" 001- string(4) "okey" ================================================================================ ================================================================================ /Users/dragonbe/tmp/php-7.3.0alpha4/sapi/cli/tests/cli_get_process_title_basic.phpt ================================================================================ Warning: cli_set_process_title(): cli_set_process_title had an error: Not initialized correctly in /Users/dragonbe/tmp/php-7.3.0alpha4/sapi/cli/tests/cli_get_process_title_basic.php on line 2 ================================================================================ 001+ Warning: cli_set_process_title(): cli_set_process_title had an error: Not initialized correctly in /Users/dragonbe/tmp/php-7.3.0alpha4/sapi/cli/tests/cli_get_process_title_basic.php on line 2 001- Title correctly retrieved! ================================================================================ ================================================================================ /Users/dragonbe/tmp/php-7.3.0alpha4/sapi/cli/tests/cli_process_title_unix.phpt ================================================================================ *** Testing setting the process title *** Warning: cli_set_process_title(): cli_set_process_title had an error: Not initialized correctly in /Users/dragonbe/tmp/php-7.3.0alpha4/sapi/cli/tests/cli_process_title_unix.php on line 7 Actually loaded from ps: /Users/dragonbe/tmp/php-7.3.0alpha4/sapi/cli/php -n -c /Users/dragonbe/tmp/php-7.3.0alpha4/tmp-php.ini -d output_handler= -d open_basedir= -d disable_functions= -d output_buffering=Off -d error_reporting=32767 -d display_errors=1 -d display_startup_errors=1 -d log_errors=0 -d html_errors=0 -d track_errors=0 -d report_memleaks=1 -d report_zend_debug=0 -d docref_root= -d docref_ext=.html -d error_prepend_string= -d error_append_string= -d auto_prepend_file= -d auto_append_file= -d ignore_repeated_errors=0 -d precision=14 -d memory_limit=128M -d log_errors_max_len=0 -d opcache.fast_shutdown=0 -d opcache.file_update_protection=0 -d zend.assertions=1 -d extension_dir=/Users/dragonbe/tmp/php-7.3.0alpha4/modules/ -d zend_extension=/Users/dragonbe/tmp/php-7.3.0alpha4/modules/opcache.so -d session.auto_start=0 -d zlib.output_compression=Off -d mbstring.func_overload=0 -f /Users/dragonbe/tmp/php-7.3.0alpha4/sapi/cli/tests/cli_process_title_unix.php Warning: cli_get_process_title(): cli_get_process_title had an error: Not initialized correctly in /Users/dragonbe/tmp/php-7.3.0alpha4/sapi/cli/tests/cli_process_title_unix.php on line 35 Actually loaded from get: ================================================================================ 002+ 003+ Warning: cli_set_process_title(): cli_set_process_title had an error: Not initialized correctly in /Users/dragonbe/tmp/php-7.3.0alpha4/sapi/cli/tests/cli_process_title_unix.php on line 7 004+ Actually loaded from ps: /Users/dragonbe/tmp/php-7.3.0alpha4/sapi/cli/php -n -c /Users/dragonbe/tmp/php-7.3.0alpha4/tmp-php.ini -d output_handler= -d open_basedir= -d disable_functions= -d output_buffering=Off -d error_reporting=32767 -d display_errors=1 -d display_startup_errors=1 -d log_errors=0 -d html_errors=0 -d track_errors=0 -d report_memleaks=1 -d report_zend_debug=0 -d docref_root= -d docref_ext=.html -d error_prepend_string= -d error_append_string= -d auto_prepend_file= -d auto_append_file= -d ignore_repeated_errors=0 -d precision=14 -d memory_limit=128M -d log_errors_max_len=0 -d opcache.fast_shutdown=0 -d opcache.file_update_protection=0 -d zend.assertions=1 -d extension_dir=/Users/dragonbe/tmp/php-7.3.0alpha4/modules/ -d zend_extension=/Users/dragonbe/tmp/php-7.3.0alpha4/modules/opcache.so -d session.auto_start=0 -d zlib.output_compression=Off -d mbstring.func_overload=0 -f /Users/dragonbe/tmp/php-7.3.0alpha4/sapi/cli/tests/cli_process_title_unix.php 002- Successfully set title 003- Successfully verified title using ps 004- Successfully verified title using get 005+ 006+ Warning: cli_get_process_title(): cli_get_process_title had an error: Not initialized correctly in /Users/dragonbe/tmp/php-7.3.0alpha4/sapi/cli/tests/cli_process_title_unix.php on line 35 007+ Actually loaded from get: ================================================================================ ================================================================================ /Users/dragonbe/tmp/php-7.3.0alpha4/sapi/cli/tests/cli_set_process_title_basic.phpt ================================================================================ Warning: cli_set_process_title(): cli_set_process_title had an error: Not initialized correctly in /Users/dragonbe/tmp/php-7.3.0alpha4/sapi/cli/tests/cli_set_process_title_basic.php on line 2 ================================================================================ 001+ Warning: cli_set_process_title(): cli_set_process_title had an error: Not initialized correctly in /Users/dragonbe/tmp/php-7.3.0alpha4/sapi/cli/tests/cli_set_process_title_basic.php on line 2 001- Successfully set title ================================================================================ ================================================================================ /Users/dragonbe/tmp/php-7.3.0alpha4/sapi/phpdbg/tests/breakpoints_001.phpt ================================================================================ [Successful compilation of /Users/dragonbe/tmp/php-7.3.0alpha4/sapi/phpdbg/tests/breakpoints_001.php] prompt> [Breakpoint #0 added at /Users/dragonbe/tmp/php-7.3.0alpha4/sapi/phpdbg/tests/breakpoints_001.php:3] prompt> [Breakpoint #0 at /Users/dragonbe/tmp/php-7.3.0alpha4/sapi/phpdbg/tests/breakpoints_001.php:3, hits: 1] >00003: echo $i++; 00004: echo $i++; 00005: echo $i++; prompt> [Breakpoint #1 added at /Users/dragonbe/tmp/php-7.3.0alpha4/sapi/phpdbg/tests/breakpoints_001.php:4] prompt> 1 [Breakpoint #1 at /Users/dragonbe/tmp/php-7.3.0alpha4/sapi/phpdbg/tests/breakpoints_001.php:4, hits: 1] >00004: echo $i++; 00005: echo $i++; 00006: echo $i++; prompt> 234 [Script ended normally] Termsig=11 ================================================================================ 015+ 015- prompt> 016+ Termsig=11 ================================================================================ ================================================================================ /Users/dragonbe/tmp/php-7.3.0alpha4/sapi/phpdbg/tests/breakpoints_002.phpt ================================================================================ [Successful compilation of /Users/dragonbe/tmp/php-7.3.0alpha4/sapi/phpdbg/tests/breakpoints_002.php] prompt> [Breakpoint #0 added at /Users/dragonbe/tmp/php-7.3.0alpha4/sapi/phpdbg/tests/breakpoints_002.php:4] prompt> 1 [Breakpoint #0 at /Users/dragonbe/tmp/php-7.3.0alpha4/sapi/phpdbg/tests/breakpoints_002.php:4, hits: 1] >00004: echo $i++; 00005: echo $i++; 00006: echo $i++; prompt> [Breakpoint #1 added at /Users/dragonbe/tmp/php-7.3.0alpha4/sapi/phpdbg/tests/breakpoints_002.php:3] prompt> Do you really want to restart execution? (type y or n): Termsig=11 ================================================================================ 009+ prompt> Do you really want to restart execution? (type y or n): 010+ Termsig=11 009- prompt> Do you really want to restart execution? (type y or n): [Breakpoint #1 at %s:3, hits: 1] 010- >00003: echo $i++; 011- 00004: echo $i++; 012- 00005: echo $i++; 013- prompt> 1 014- [Breakpoint #0 at %s:4, hits: 1] 015- >00004: echo $i++; 016- 00005: echo $i++; 017- 00006: echo $i++; 018- prompt> 234 019- [Script ended normally] 020- prompt> ================================================================================ ================================================================================ /Users/dragonbe/tmp/php-7.3.0alpha4/sapi/phpdbg/tests/breakpoints_003.phpt ================================================================================ [Successful compilation of /Users/dragonbe/tmp/php-7.3.0alpha4/sapi/phpdbg/tests/breakpoints_003.php] prompt> [Breakpoint #0 added at /Users/dragonbe/tmp/php-7.3.0alpha4/sapi/phpdbg/tests/breakpoints_003.php:4] prompt> [Deleted breakpoint #0] prompt> [Breakpoint #1 added at /Users/dragonbe/tmp/php-7.3.0alpha4/sapi/phpdbg/tests/breakpoints_003.php:5] prompt> 12 [Breakpoint #1 at /Users/dragonbe/tmp/php-7.3.0alpha4/sapi/phpdbg/tests/breakpoints_003.php:5, hits: 1] >00005: echo $i++; 00006: echo $i++; 00007: prompt> [Deleted breakpoint #1] prompt> Do you really want to restart execution? (type y or n): Termsig=11 ================================================================================ 011+ prompt> Do you really want to restart execution? (type y or n): 012+ Termsig=11 011- prompt> Do you really want to restart execution? (type y or n): 1234 012- [Script ended normally] 013- prompt> ================================================================================ ================================================================================ /Users/dragonbe/tmp/php-7.3.0alpha4/sapi/phpdbg/tests/breakpoints_004.phpt ================================================================================ [Successful compilation of /Users/dragonbe/tmp/php-7.3.0alpha4/sapi/phpdbg/tests/breakpoints_004.php] prompt> [Breakpoint #0 added at ZEND_ECHO] prompt> [Breakpoint #0 in ZEND_ECHO at /Users/dragonbe/tmp/php-7.3.0alpha4/sapi/phpdbg/tests/breakpoints_004.php:3, hits: 1] >00003: echo $i++; 00004: echo $i++; 00005: echo $i++; prompt> 1 [Breakpoint #0 in ZEND_ECHO at /Users/dragonbe/tmp/php-7.3.0alpha4/sapi/phpdbg/tests/breakpoints_004.php:4, hits: 2] >00004: echo $i++; 00005: echo $i++; 00006: echo $i++; prompt> 2 [Breakpoint #0 in ZEND_ECHO at /Users/dragonbe/tmp/php-7.3.0alpha4/sapi/phpdbg/tests/breakpoints_004.php:5, hits: 3] >00005: echo $i++; 00006: echo $i++; 00007: prompt> 3 [Breakpoint #0 in ZEND_ECHO at /Users/dragonbe/tmp/php-7.3.0alpha4/sapi/phpdbg/tests/breakpoints_004.php:6, hits: 4] >00006: echo $i++; 00007: prompt> 4 [Script ended normally] Termsig=11 ================================================================================ 023+ 023- prompt> 024+ Termsig=11 ================================================================================ ================================================================================ /Users/dragonbe/tmp/php-7.3.0alpha4/sapi/phpdbg/tests/breakpoints_006.phpt ================================================================================ [Successful compilation of /Users/dragonbe/tmp/php-7.3.0alpha4/sapi/phpdbg/tests/breakpoints_006.php] prompt> [Breakpoint #0 added at foo] prompt> [Breakpoint #0 in foo() at /Users/dragonbe/tmp/php-7.3.0alpha4/sapi/phpdbg/tests/breakpoints_006.php:4, hits: 1] >00004: var_dump($bar); 00005: } 00006: prompt> string(4) "test" [Script ended normally] Termsig=11 ================================================================================ 009+ 009- prompt> 010+ Termsig=11 ================================================================================ ================================================================================ /Users/dragonbe/tmp/php-7.3.0alpha4/sapi/phpdbg/tests/breakpoints_008.phpt ================================================================================ [Successful compilation of /Users/dragonbe/tmp/php-7.3.0alpha4/sapi/phpdbg/tests/breakpoints_008.php] prompt> [Breakpoint #0 added at foo\bar::foo] prompt> [Breakpoint exists at Foo\Bar::Foo] prompt> [Breakpoint #0 in foo\bar::foo() at /Users/dragonbe/tmp/php-7.3.0alpha4/sapi/phpdbg/tests/breakpoints_008.php:6, hits: 1] >00006: var_dump($bar); 00007: } 00008: } prompt> string(4) "test" [Script ended normally] Termsig=11 ================================================================================ 010+ 010- prompt> 011+ Termsig=11 ================================================================================ ================================================================================ /Users/dragonbe/tmp/php-7.3.0alpha4/sapi/phpdbg/tests/bug73704.phpt ================================================================================ [Successful compilation of /Users/dragonbe/tmp/php-7.3.0alpha4/sapi/phpdbg/tests/bug73704.php] prompt> 00001: #!/usr/bin/env php 00002: <?php 00003: 00004: echo 1; 00005: prompt> [Breakpoint #0 added at /Users/dragonbe/tmp/php-7.3.0alpha4/sapi/phpdbg/tests/bug73704.php:4] prompt> [Breakpoint #0 at /Users/dragonbe/tmp/php-7.3.0alpha4/sapi/phpdbg/tests/bug73704.php:4, hits: 1] >00004: echo 1; 00005: prompt> 1 [Script ended normally] Termsig=11 ================================================================================ 013+ 013- prompt> 014+ Termsig=11 ================================================================================ ================================================================================ /Users/dragonbe/tmp/php-7.3.0alpha4/sapi/phpdbg/tests/clean_001.phpt ================================================================================ [Successful compilation of /Users/dragonbe/tmp/php-7.3.0alpha4/sapi/phpdbg/tests/clean_001.php] prompt> [Breakpoint #0 added at /Users/dragonbe/tmp/php-7.3.0alpha4/sapi/phpdbg/tests/clean_001.php:4] prompt> [Breakpoint #1 added at foo] prompt> 1 [Breakpoint #0 at /Users/dragonbe/tmp/php-7.3.0alpha4/sapi/phpdbg/tests/clean_001.php:4, hits: 1] >00004: echo 2; 00005: echo 3; 00006: foo(); prompt> 23 [Breakpoint #1 in foo() at /Users/dragonbe/tmp/php-7.3.0alpha4/sapi/phpdbg/tests/clean_001.php:9, hits: 1] >00009: echo 4; 00010: } 00011: prompt> Do you really want to clean your current environment? (type y or n): Cleaning Execution Environment Classes 170 Functions 1239 Constants 1756 Includes 0 Termsig=11 ================================================================================ 019+ 020+ Termsig=11 019- prompt> [Not running] 020- prompt> 1 021- [Breakpoint #0 at %s:4, hits: 1] 022- >00004: echo 2; 023- 00005: echo 3; 024- 00006: foo(); 025- prompt> 23 026- [Breakpoint #1 in foo() at %s:9, hits: 1] 027- >00009: echo 4; 028- 00010: } 029- 00011: 030- prompt> 4 031- [Script ended normally] 032- prompt> ================================================================================ ================================================================================ /Users/dragonbe/tmp/php-7.3.0alpha4/sapi/phpdbg/tests/clear_001.phpt ================================================================================ [Successful compilation of /Users/dragonbe/tmp/php-7.3.0alpha4/sapi/phpdbg/tests/clear_001.php] prompt> [Breakpoint #0 added at /Users/dragonbe/tmp/php-7.3.0alpha4/sapi/phpdbg/tests/clear_001.php:4] prompt> [Breakpoint #1 added at foo] prompt> 1 [Breakpoint #0 at /Users/dragonbe/tmp/php-7.3.0alpha4/sapi/phpdbg/tests/clear_001.php:4, hits: 1] >00004: echo 2; 00005: echo 3; 00006: foo(); prompt> Clearing Breakpoints File 1 Functions 1 Methods 0 Oplines 0 File oplines 0 Function oplines 0 Method oplines 0 Conditionals 0 prompt> 234 [Script ended normally] Termsig=11 ================================================================================ 020+ 020- prompt> prompt> 021+ Termsig=11 ================================================================================ ================================================================================ /Users/dragonbe/tmp/php-7.3.0alpha4/sapi/phpdbg/tests/exceptions_001.phpt ================================================================================ [Successful compilation of /Users/dragonbe/tmp/php-7.3.0alpha4/sapi/phpdbg/tests/exceptions_001.php] prompt> handle first [Uncaught Error in /Users/dragonbe/tmp/php-7.3.0alpha4/sapi/phpdbg/tests/exceptions_001.php on line 16: Call to undefined function foo()] >00016: foo(); // Error 00017: } catch (\Exception $e) { 00018: var_dump($e); prompt> frame #0: {closure}() at /Users/dragonbe/tmp/php-7.3.0alpha4/sapi/phpdbg/tests/exceptions_001.php:16 frame #1: {main} at /Users/dragonbe/tmp/php-7.3.0alpha4/sapi/phpdbg/tests/exceptions_001.php:22 prompt> 3 prompt> [Uncaught Error in /Users/dragonbe/tmp/php-7.3.0alpha4/sapi/phpdbg/tests/exceptions_001.php on line 16] Error: Call to undefined function foo() in /Users/dragonbe/tmp/php-7.3.0alpha4/sapi/phpdbg/tests/exceptions_001.php:16 Stack trace: #0 /Users/dragonbe/tmp/php-7.3.0alpha4/sapi/phpdbg/tests/exceptions_001.php(22): {closure}() #1 {main} [Script ended normally] Termsig=11 ================================================================================ 016+ 016- prompt> 017+ Termsig=11 ================================================================================ ================================================================================ /Users/dragonbe/tmp/php-7.3.0alpha4/sapi/phpdbg/tests/exceptions_002.phpt ================================================================================ [Successful compilation of /Users/dragonbe/tmp/php-7.3.0alpha4/sapi/phpdbg/tests/exceptions_002.php] prompt> handle first [Uncaught Error in /Users/dragonbe/tmp/php-7.3.0alpha4/sapi/phpdbg/tests/exceptions_002.php on line 16: Call to undefined function foo()] >00016: foo(); // Error 00017: } catch (\Exception $e) { 00018: var_dump($e); prompt> Fatal error: Uncaught Error: Call to undefined function next_error() in eval()'d code:1 Stack trace: #0 /Users/dragonbe/tmp/php-7.3.0alpha4/sapi/phpdbg/tests/exceptions_002.php(16): unknown() #1 /Users/dragonbe/tmp/php-7.3.0alpha4/sapi/phpdbg/tests/exceptions_002.php(20): {closure}() #2 {main} thrown in eval()'d code on line 1 prompt> [Uncaught Error in /Users/dragonbe/tmp/php-7.3.0alpha4/sapi/phpdbg/tests/exceptions_002.php on line 16] Error: Call to undefined function foo() in /Users/dragonbe/tmp/php-7.3.0alpha4/sapi/phpdbg/tests/exceptions_002.php:16 Stack trace: #0 /Users/dragonbe/tmp/php-7.3.0alpha4/sapi/phpdbg/tests/exceptions_002.php(20): {closure}() #1 {main} [Script ended normally] Termsig=11 ================================================================================ 020+ 021+ Termsig=11 020- prompt> [The stack contains nothing !] 021- prompt> ================================================================================ ================================================================================ /Users/dragonbe/tmp/php-7.3.0alpha4/sapi/phpdbg/tests/generator_run.phpt ================================================================================ [Successful compilation of /Users/dragonbe/tmp/php-7.3.0alpha4/sapi/phpdbg/tests/generator_run.php] prompt> caught Generator exception [Script ended normally] Termsig=11 ================================================================================ 004+ 004- prompt> 005+ Termsig=11 ================================================================================ ================================================================================ /Users/dragonbe/tmp/php-7.3.0alpha4/sapi/phpdbg/tests/include_once.phpt ================================================================================ [Successful compilation of /Users/dragonbe/tmp/php-7.3.0alpha4/sapi/phpdbg/tests/include_once.php] prompt> 1 [Script ended normally] Termsig=11 ================================================================================ 004+ 004- prompt> 005+ Termsig=11 ================================================================================ ================================================================================ /Users/dragonbe/tmp/php-7.3.0alpha4/sapi/phpdbg/tests/info_001.phpt ================================================================================ [Successful compilation of /Users/dragonbe/tmp/php-7.3.0alpha4/sapi/phpdbg/tests/info_001.php] prompt> [User Classes (1)] User Class Foo\Bar (2) |---- in /Users/dragonbe/tmp/php-7.3.0alpha4/sapi/phpdbg/tests/info_001.php on line 4 prompt> [User Functions (1)] |-------- foo in /Users/dragonbe/tmp/php-7.3.0alpha4/sapi/phpdbg/tests/info_001.php on line 14 prompt> [Breakpoint #0 added at foo] prompt> string(4) "test" [Breakpoint #0 in foo() at /Users/dragonbe/tmp/php-7.3.0alpha4/sapi/phpdbg/tests/info_001.php:15, hits: 1] >00015: var_dump(strrev($baz)); 00016: } 00017: prompt> [Variables in foo() (1)] Address Refs Type Variable 0x102023120 1 string $baz string (4) "test" prompt> [Superglobal variables (8)] Address Refs Type Variable 0x10206acc0 2 array $_GET 0x10206ace0 2 array $_POST 0x10206ad00 2 array $_COOKIE 0x10206ad20 2 array $_SERVER 0x10206ad40 2 array $_ENV 0x10206ad60 1 array $_REQUEST 0x10206ad80 2 array $_FILES 0x102006098 1 array &$GLOBALS prompt> ------------------------------------------------ Function Breakpoints: #0 foo prompt> [User-defined constants (0)] prompt> [Included files: 0] prompt> [No error found!] prompt> [Literal Constants in foo() (2)] |-------- C0 -------> [var_dump] |-------- C1 -------> [strrev] prompt> string(4) "tset" [Script ended normally] Termsig=11 ================================================================================ 038+ 039+ Termsig=11 038- prompt> [No active op array!] 039- prompt> ================================================================================ ================================================================================ /Users/dragonbe/tmp/php-7.3.0alpha4/sapi/phpdbg/tests/normal_exit.phpt ================================================================================ [Successful compilation of /Users/dragonbe/tmp/php-7.3.0alpha4/sapi/phpdbg/tests/normal_exit.php] prompt> [Script ended normally] Termsig=11 ================================================================================ 003+ 003- prompt> 004+ Termsig=11 ================================================================================ ================================================================================ /Users/dragonbe/tmp/php-7.3.0alpha4/sapi/phpdbg/tests/phpdbg_break_next.phpt ================================================================================ [Successful compilation of /Users/dragonbe/tmp/php-7.3.0alpha4/sapi/phpdbg/tests/phpdbg_break_next.php] prompt> A [Breakpoint #0 added at 10ce70840] [Breakpoint #0 in 10ce70840 at /Users/dragonbe/tmp/php-7.3.0alpha4/sapi/phpdbg/tests/phpdbg_break_next.php:5, hits: 1] >00005: echo 'B'; 00006: prompt> B [Script ended normally] Termsig=11 ================================================================================ 009+ 009- prompt> 010+ Termsig=11 ================================================================================ ================================================================================ /Users/dragonbe/tmp/php-7.3.0alpha4/sapi/phpdbg/tests/phpdbg_get_executable_stream_wrapper.phpt ================================================================================ [Successful compilation of /Users/dragonbe/tmp/php-7.3.0alpha4/sapi/phpdbg/tests/phpdbg_get_executable_stream_wrapper.php] prompt> array(1) { [5]=> int(0) } [Script ended normally] Termsig=11 ================================================================================ 007+ 007- prompt> 008+ Termsig=11 ================================================================================ ================================================================================ /Users/dragonbe/tmp/php-7.3.0alpha4/sapi/phpdbg/tests/phpdbg_oplog_001.phpt ================================================================================ [Successful compilation of /Users/dragonbe/tmp/php-7.3.0alpha4/sapi/phpdbg/tests/phpdbg_oplog_001.php] prompt> halloarray(2) { ["/Users/dragonbe/tmp/php-7.3.0alpha4/sapi/phpdbg/tests/phpdbg_oplog_001.php"]=> array(5) { [13]=> int(1) [17]=> int(2) [18]=> int(2) [19]=> int(3) [21]=> int(4) } ["A::b"]=> array(3) { [4]=> int(1) [5]=> int(3) [8]=> int(2) } } [Script ended normally] Termsig=11 ================================================================================ 027+ 027- prompt> 028+ Termsig=11 ================================================================================ ================================================================================ /Users/dragonbe/tmp/php-7.3.0alpha4/sapi/phpdbg/tests/run_001.phpt ================================================================================ [Successful compilation of /Users/dragonbe/tmp/php-7.3.0alpha4/sapi/phpdbg/tests/run_001.php] prompt> int(5) array(5) { [0]=> string(65) "/Users/dragonbe/tmp/php-7.3.0alpha4/sapi/phpdbg/tests/run_001.php" [1]=> string(2) "--" [2]=> string(1) "1" [3]=> string(1) "2" [4]=> string(1) "3" } [Script ended normally] ================================================================================ 016- prompt> int(4) 017- array(4) { 018- [0]=> 019- string(%d) "%s" 020- [1]=> 021- string(1) "1" 022- [2]=> 023- string(1) "2" 024- [3]=> 025- string(1) "3" 026- } 027- [Script ended normally] 028- prompt> int(5) 029- array(5) { 030- [0]=> 031- string(%d) "%s" 032- [1]=> 033- string(2) "--" 034- [2]=> 035- string(1) "1" 036- [3]=> 037- string(1) "2" 038- [4]=> 039- string(1) "3" 040- } 041- [Script ended normally] 042- prompt> ================================================================================ ================================================================================ /Users/dragonbe/tmp/php-7.3.0alpha4/sapi/phpdbg/tests/run_002.phpt ================================================================================ [Successful compilation of /Users/dragonbe/tmp/php-7.3.0alpha4/sapi/phpdbg/tests/run_002.php] prompt> 10 prompt> [Breakpoint #0 added at /Users/dragonbe/tmp/php-7.3.0alpha4/sapi/phpdbg/tests/run_002.php:6] prompt> array(1) { [0]=> string(65) "/Users/dragonbe/tmp/php-7.3.0alpha4/sapi/phpdbg/tests/run_002.php" } string(10) "stdin data" [Breakpoint #0 at /Users/dragonbe/tmp/php-7.3.0alpha4/sapi/phpdbg/tests/run_002.php:6, hits: 1] >00006: echo "ok\n"; 00007: prompt> Do you really want to restart execution? (type y or n): Termsig=11 ================================================================================ 013+ prompt> Do you really want to restart execution? (type y or n): 014+ Termsig=11 013- prompt> Do you really want to restart execution? (type y or n): array(3) { 014- [0]=> 015- string(%d) "%s" 016- [1]=> 017- string(4) "arg1" 018- [2]=> 019- string(10) "_ ' arg2 "" 020- } 021- string(10) "stdin 022- data" 023- [Breakpoint #0 at %s:6, hits: 1] 024- >00006: echo "ok\n"; 025- 00007: 026- prompt> ok 027- [Script ended normally] 028- prompt> ================================================================================ ================================================================================ /Users/dragonbe/tmp/php-7.3.0alpha4/sapi/phpdbg/tests/set_exception_handler.phpt ================================================================================ [Successful compilation of /Users/dragonbe/tmp/php-7.3.0alpha4/sapi/phpdbg/tests/set_exception_handler.php] prompt> [Uncaught Exception in /Users/dragonbe/tmp/php-7.3.0alpha4/sapi/phpdbg/tests/set_exception_handler.php on line 4: test] >00004: throw new Exception("test"); 00005: prompt> EX [Script ended normally] Termsig=11 ================================================================================ 007+ 007- prompt> 008+ Termsig=11 ================================================================================ ================================================================================ /Users/dragonbe/tmp/php-7.3.0alpha4/sapi/phpdbg/tests/stdin_001.phpt ================================================================================ prompt> [Successful compilation of stdin input] prompt> [Breakpoint #0 added at Standard input code:3] prompt> [Breakpoint #0 at Standard input code:3, hits: 1] >00003: echo "Hello, world!\n"; 00004: prompt> Hello, world! [Script ended normally] Termsig=11 ================================================================================ 008+ 009+ Termsig=11 008- prompt> [Breakpoint #0 at Standard input code:3, hits: 1] 009- >00003: echo "Hello, world!\n"; 010- 00004: 011- prompt> ================================================================================ ================================================================================ /Users/dragonbe/tmp/php-7.3.0alpha4/sapi/phpdbg/tests/watch_001.phpt ================================================================================ [Successful compilation of /Users/dragonbe/tmp/php-7.3.0alpha4/sapi/phpdbg/tests/watch_001.php] prompt> [Breakpoint #0 added at /Users/dragonbe/tmp/php-7.3.0alpha4/sapi/phpdbg/tests/watch_001.php:3] prompt> [Breakpoint #0 at /Users/dragonbe/tmp/php-7.3.0alpha4/sapi/phpdbg/tests/watch_001.php:3, hits: 1] >00003: $a = 1; 00004: $b = [$a]; 00005: prompt> [Added recursive watchpoint #0 for $b] prompt> [Breaking on watchpoint $b] Old value: New value: Array ([0] => 1) >00006: unset($b); 00007: $b = 2; 00008: prompt> [Breaking on watchpoint $b] Old value inaccessible or destroyed New value: >00007: $b = 2; 00008: prompt> [Breaking on watchpoint $b] Old value: New value: 2 >00008: prompt> [$b has been removed, removing watchpoint recursively] [Script ended normally] Termsig=11 ================================================================================ 025+ 025- prompt> 026+ Termsig=11 ================================================================================ ================================================================================ /Users/dragonbe/tmp/php-7.3.0alpha4/sapi/phpdbg/tests/watch_002.phpt ================================================================================ [Successful compilation of /Users/dragonbe/tmp/php-7.3.0alpha4/sapi/phpdbg/tests/watch_002.php] prompt> [Breakpoint #0 added at /Users/dragonbe/tmp/php-7.3.0alpha4/sapi/phpdbg/tests/watch_002.php:6] prompt> [Breakpoint #0 at /Users/dragonbe/tmp/php-7.3.0alpha4/sapi/phpdbg/tests/watch_002.php:6, hits: 1] >00006: $a[0] = 2; 00007: 00008: $a = [0 => 3, 1 => 4]; prompt> [Added watchpoint #0 for $a[]] prompt> [Breaking on watchpoint $a[]] 1 elements were added to the array >00009: prompt> [$a[] has been removed, removing watchpoint] [Script ended normally] Termsig=11 ================================================================================ 013+ 013- prompt> 014+ Termsig=11 ================================================================================ ================================================================================ /Users/dragonbe/tmp/php-7.3.0alpha4/sapi/phpdbg/tests/watch_003.phpt ================================================================================ [Successful compilation of /Users/dragonbe/tmp/php-7.3.0alpha4/sapi/phpdbg/tests/watch_003.php] prompt> [Breakpoint #0 added at /Users/dragonbe/tmp/php-7.3.0alpha4/sapi/phpdbg/tests/watch_003.php:6] prompt> [Breakpoint #0 at /Users/dragonbe/tmp/php-7.3.0alpha4/sapi/phpdbg/tests/watch_003.php:6, hits: 1] >00006: $a[0] = 2; 00007: 00008: $a = [0 => 3, 1 => 4]; prompt> [Added watchpoint #0 for $a[0]] prompt> [Breaking on watchpoint $a[0]] Old value: 1 New value: 2 >00008: $a = [0 => 3, 1 => 4]; 00009: prompt> [Breaking on watchpoint $a[0]] Old value: 2 New value: 3 >00009: prompt> [$a[0] has been removed, removing watchpoint] [Script ended normally] Termsig=11 ================================================================================ 019+ 019- prompt> 020+ Termsig=11 ================================================================================ ================================================================================ /Users/dragonbe/tmp/php-7.3.0alpha4/sapi/phpdbg/tests/watch_004.phpt ================================================================================ [Successful compilation of /Users/dragonbe/tmp/php-7.3.0alpha4/sapi/phpdbg/tests/watch_004.php] prompt> [Breakpoint #0 added at /Users/dragonbe/tmp/php-7.3.0alpha4/sapi/phpdbg/tests/watch_004.php:3] prompt> [Breakpoint #0 at /Users/dragonbe/tmp/php-7.3.0alpha4/sapi/phpdbg/tests/watch_004.php:3, hits: 1] >00003: $b = "a"; 00004: $a = $b.$b; 00005: $a[1] = "b"; prompt> [Added watchpoint #0 for $a] prompt> [Breaking on watchpoint $a] Old value: New value: aa >00005: $a[1] = "b"; 00006: prompt> [Breaking on watchpoint $a] Old value: aa New value: ab >00006: prompt> [$a has been removed, removing watchpoint] [Script ended normally] Termsig=11 ================================================================================ 019+ 019- prompt> 020+ Termsig=11 ================================================================================ ================================================================================ /Users/dragonbe/tmp/php-7.3.0alpha4/sapi/phpdbg/tests/watch_005.phpt ================================================================================ [Successful compilation of /Users/dragonbe/tmp/php-7.3.0alpha4/sapi/phpdbg/tests/watch_005.php] prompt> [Breakpoint #0 added at /Users/dragonbe/tmp/php-7.3.0alpha4/sapi/phpdbg/tests/watch_005.php:3] prompt> [Breakpoint #0 at /Users/dragonbe/tmp/php-7.3.0alpha4/sapi/phpdbg/tests/watch_005.php:3, hits: 1] >00003: $b = "a"; 00004: $a = $b.$b; 00005: $c = &$a; prompt> [Added recursive watchpoint #0 for $a] prompt> [Breaking on watchpoint $a] Old value: New value: aa >00005: $c = &$a; 00006: $a[1] = "b"; 00007: prompt> [Breaking on watchpoint $a] Old value inaccessible or destroyed New value (reference): aa >00006: $a[1] = "b"; 00007: 00008: exit; prompt> [Breaking on watchpoint $a] Old value: aa New value: ab >00008: exit; 00009: prompt> [$a has been removed, removing watchpoint recursively] [Script ended normally] Termsig=11 ================================================================================ 027+ 027- prompt> 028+ Termsig=11 ================================================================================ ================================================================================ /Users/dragonbe/tmp/php-7.3.0alpha4/sapi/phpdbg/tests/watch_006.phpt ================================================================================ [Successful compilation of /Users/dragonbe/tmp/php-7.3.0alpha4/sapi/phpdbg/tests/watch_006.php] prompt> [Breakpoint #0 added at /Users/dragonbe/tmp/php-7.3.0alpha4/sapi/phpdbg/tests/watch_006.php:4] prompt> [Breakpoint #0 at /Users/dragonbe/tmp/php-7.3.0alpha4/sapi/phpdbg/tests/watch_006.php:4, hits: 1] >00004: $a[0] = 1; 00005: $b = &$a; 00006: $a[0] = 2; prompt> [Added watchpoint #0 for $a[0]] prompt> [Added recursive watchpoint #1 for $b] prompt> [Breaking on watchpoint $a[0]] Old value: 0 New value: 1 >00005: $b = &$a; 00006: $a[0] = 2; 00007: $a[1] = 3; prompt> [Breaking on watchpoint $b] Old value: New value (reference): Array ([0] => 1) >00006: $a[0] = 2; 00007: $a[1] = 3; 00008: $c = [1]; prompt> [Breaking on watchpoint $a[0]] Old value: 1 New value: 2 >00007: $a[1] = 3; 00008: $c = [1]; 00009: $b = &$c; prompt> [Element 1 has been added to watchpoint] [Breaking on watchpoint $b[]] 1 elements were added to the array >00008: $c = [1]; 00009: $b = &$c; 00010: prompt> [Breaking on watchpoint $b] Old value inaccessible or destroyed New value (reference): Array ([0] => 2,[1] => 3) >00009: $b = &$c; 00010: prompt> [Breaking on watchpoint $b] Old value inaccessible or destroyed New value (reference): Array ([0] => 1) >00010: prompt> [$b has been removed, removing watchpoint recursively] [$a[0] has been removed, removing watchpoint] [Script ended normally] Termsig=11 ================================================================================ 045+ 045- prompt> 046+ Termsig=11 ================================================================================ ================================================================================ BUILD ENVIRONMENT ================================================================================ OS: Darwin - Darwin in2it-mbp.FH-Holding.Local 17.7.0 Darwin Kernel Version 17.7.0: Thu Jun 21 22:53:14 PDT 2018; root:xnu-4570.71.2~1/RELEASE_X86_64 x86_64 Autoconf: autoconf (GNU Autoconf) 2.69 Copyright (C) 2012 Free Software Foundation, Inc. License GPLv3+/Autoconf: GNU GPL version 3 or later <http://gnu.org/licenses/gpl.html>, <http://gnu.org/licenses/exceptions.html> This is free software: you are free to change and redistribute it. There is NO WARRANTY, to the extent permitted by law. Written by David J. MacKenzie and Akim Demaille. Bundled Libtool: ltmain.sh (GNU libtool) 1.5.26 (1.1220.2.492 2008/01/30 06:40:56) Copyright (C) 2008 Free Software Foundation, Inc. This is free software; see the source for copying conditions. There is NO warranty; not even for MERCHANTABILITY or FITNESS FOR A PARTICULAR PURPOSE. System Libtool: libtool (GNU libtool) 2.4.6 Written by Gordon Matzigkeit, 1996 Copyright (C) 2014 Free Software Foundation, Inc. This is free software; see the source for copying conditions. There is NO warranty; not even for MERCHANTABILITY or FITNESS FOR A PARTICULAR PURPOSE. Compiler: Apple LLVM version 9.1.0 (clang-902.0.39.2) Target: x86_64-apple-darwin17.7.0 Thread model: posix InstalledDir: /Applications/Xcode.app/Contents/Developer/Toolchains/XcodeDefault.xctoolchain/usr/bin Bison: Libraries: ================================================================================ PHPINFO ================================================================================
« previous php.qa.reports (#33995) next »