Geoff CLEVENGER
Direct +1 415 315-9926
Mobile +1 415 902-0283
Skype geoffc1028
=====================================================================
EXPECTED FAILED TEST SUMMARY
---------------------------------------------------------------------
Test open_basedir configuration [tests/security/open_basedir_linkinfo.phpt] XFAIL REASON: BUG: open_basedir cannot delete symlink to prohibited file. See also
bugs 48111 and 52176.
Inconsistencies when accessing protected members [Zend/tests/access_modifiers_008.phpt] XFAIL REASON: Discussion: http://marc.info/?l=php-internals&m=120221184420957&w=2
Inconsistencies when accessing protected members - 2 [Zend/tests/access_modifiers_009.phpt] XFAIL REASON: Discussion: http://marc.info/?l=php-internals&m=120221184420957&w=2
Bug #48770 (call_user_func_array() fails to call parent from inheriting class) [Zend/tests/bug48770.phpt] XFAIL REASON: See Bug #48770
Bug #48770 (call_user_func_array() fails to call parent from inheriting class) [Zend/tests/bug48770_2.phpt] XFAIL REASON: See Bug #48770
Bug #48770 (call_user_func_array() fails to call parent from inheriting class) [Zend/tests/bug48770_3.phpt] XFAIL REASON: See Bug #48770
Initial value of static var in method depends on the include time of the class definition [Zend/tests/method_static_var.phpt] XFAIL REASON: Maybe not a bug
DateTime::add() -- fall type2 type3 [ext/date/tests/DateTime_add-fall-type2-type3.phpt] XFAIL REASON: Various bugs exist
DateTime::add() -- fall type3 type2 [ext/date/tests/DateTime_add-fall-type3-type2.phpt] XFAIL REASON: Various bugs exist
DateTime::add() -- fall type3 type3 [ext/date/tests/DateTime_add-fall-type3-type3.phpt] XFAIL REASON: Various bugs exist
DateTime::add() -- spring type2 type3 [ext/date/tests/DateTime_add-spring-type2-type3.phpt] XFAIL REASON: Various bugs exist
DateTime::add() -- spring type3 type2 [ext/date/tests/DateTime_add-spring-type3-type2.phpt] XFAIL REASON: Various bugs exist
DateTime::add() -- spring type3 type3 [ext/date/tests/DateTime_add-spring-type3-type3.phpt] XFAIL REASON: Various bugs exist
DateTime::diff() -- fall type2 type3 [ext/date/tests/DateTime_diff-fall-type2-type3.phpt] XFAIL REASON: Various bugs exist
DateTime::diff() -- fall type3 type2 [ext/date/tests/DateTime_diff-fall-type3-type2.phpt] XFAIL REASON: Various bugs exist
DateTime::diff() -- fall type3 type3 [ext/date/tests/DateTime_diff-fall-type3-type3.phpt] XFAIL REASON: Various bugs exist
DateTime::diff() -- spring type2 type3 [ext/date/tests/DateTime_diff-spring-type2-type3.phpt] XFAIL REASON: Various bugs exist
DateTime::diff() -- spring type3 type2 [ext/date/tests/DateTime_diff-spring-type3-type2.phpt] XFAIL REASON: Various bugs exist
DateTime::diff() -- spring type3 type3 [ext/date/tests/DateTime_diff-spring-type3-type3.phpt] XFAIL REASON: Various bugs exist
DateTime::sub() -- fall type2 type3 [ext/date/tests/DateTime_sub-fall-type2-type3.phpt] XFAIL REASON: Various bugs exist
DateTime::sub() -- fall type3 type2 [ext/date/tests/DateTime_sub-fall-type3-type2.phpt] XFAIL REASON: Various bugs exist
DateTime::sub() -- fall type3 type3 [ext/date/tests/DateTime_sub-fall-type3-type3.phpt] XFAIL REASON: Various bugs exist
DateTime::sub() -- spring type2 type3 [ext/date/tests/DateTime_sub-spring-type2-type3.phpt] XFAIL REASON: Various bugs exist
DateTime::sub() -- spring type3 type2 [ext/date/tests/DateTime_sub-spring-type3-type2.phpt] XFAIL REASON: Various bugs exist
DateTime::sub() -- spring type3 type3 [ext/date/tests/DateTime_sub-spring-type3-type3.phpt] XFAIL REASON: Various bugs exist
Bug #52480 (Incorrect difference using DateInterval) [ext/date/tests/bug52480.phpt] XFAIL REASON: See https://bugs.php.net/bug.php?id=52480
RFC: DateTime and Daylight Saving Time Transitions (zone type 3, bd2) [ext/date/tests/rfc-datetime_and_daylight_saving_time-type3-bd2.phpt] XFAIL REASON: Still not quite right
RFC: DateTime and Daylight Saving Time Transitions (zone type 3, fs) [ext/date/tests/rfc-datetime_and_daylight_saving_time-type3-fs.phpt] XFAIL REASON: Still not quite right
Bug #67296 (filter_input doesn't validate variables) [ext/filter/tests/bug49184.phpt] XFAIL REASON: See Bug #49184
Bug #67167: filter_var(null,FILTER_VALIDATE_BOOLEAN,FILTER_NULL_ON_FAILURE) returns null [ext/filter/tests/bug67167.02.phpt] XFAIL REASON: Requires php_zval_filter to not use convert_to_string for all filters.
Phar: bug #69958: Segfault in Phar::convertToData on invalid file [ext/phar/tests/bug69958.phpt] XFAIL REASON: Still has memory leaks, see https://bugs.php.net/bug.php?id=70005
updateTimestamp never called when session data is empty [ext/session/tests/bug71162.phpt] XFAIL REASON: Current session module is designed to write empty session always. In addition, current session module only supports SessionHandlerInterface only from PHP 7.0.
Bug #73529 session_decode() silently fails on wrong input [ext/session/tests/bug73529.phpt] XFAIL REASON: session_decode() does not return proper status.
Bug #70219 Use after free vulnerability in session deserializer [ext/standard/tests/serialize/bug70219.phpt] XFAIL REASON: Unfinished merge, needs fix.
=====================================================================
=====================================================================
FAILED TEST SUMMARY
---------------------------------------------------------------------
Bug #64267 (CURLOPT_INFILE doesn't allow reset) [ext/curl/tests/bug64267.phpt]
Bug #76675 (Segfault with H2 server push write/writeheader handlers) [ext/curl/tests/bug76675.phpt]
Bug #78775: TLS issues from HTTP request affecting other encrypted connections [ext/curl/tests/bug78775.phpt]
Test json_encode() function : basic functionality [ext/json/tests/json_encode_basic.phpt]
Multicast support: IPv6 send options [ext/sockets/tests/mcast_ipv6_send.phpt]
recvmsg(): receive SCM_CREDENTIALS messages [ext/sockets/tests/socket_cmsg_rights.phpt]
Test if socket_create_listen() returns false, when it cannot bind to the port. [ext/sockets/tests/socket_create_listen-nobind.phpt]
int socket_send ( resource $socket , string $buf , int $len , int $flags ); [ext/sockets/tests/socket_send.phpt]
Test if socket_recvfrom() receives data sent by socket_sendto() via IPv6 UDP [ext/sockets/tests/socket_sentto_recvfrom_ipv6_udp.phpt]
bool socket_shutdown ( resource $socket [, int $how = 2 ] ) ; [ext/sockets/tests/socket_shutdown.phpt]
Bug #80067 (Omitting the port in bindto setting errors) [ext/standard/tests/network/bug80067.phpt]
mixed stream_socket_enable_crypto(resource $stream , bool $enable [, int $crypto_type [, resource $session_stream ]] ) ; [ext/standard/tests/streams/stream_socket_enable_crypto.phpt]
Test gzencode() function : variation [ext/zlib/tests/gzencode_variation1.phpt]
Test gzencode() function : variation - verify header contents with all encoding modes [ext/zlib/tests/gzencode_variation2.phpt]
cli_get_process_title() function : basic functionality [sapi/cli/tests/cli_get_process_title_basic.phpt]
Check cli_process_title support on Unix [sapi/cli/tests/cli_process_title_unix.phpt]
cli_set_process_title() function : basic functionality [sapi/cli/tests/cli_set_process_title_basic.phpt]
=====================================================================
=====================================================================
TEST RESULT SUMMARY
---------------------------------------------------------------------
Exts skipped : 41
Exts tested : 34
---------------------------------------------------------------------
Number of tests : 16475 12344
Tests skipped : 4131 ( 25.1%) --------
Tests warned : 0 ( 0.0%) ( 0.0%)
Tests failed : 17 ( 0.1%) ( 0.1%)
Expected fail : 34 ( 0.2%) ( 0.3%)
Tests passed : 12293 ( 74.6%) ( 99.6%)
---------------------------------------------------------------------
Time taken : 22288 seconds
=====================================================================
=====================================================================
EXPECTED FAILED TEST SUMMARY
---------------------------------------------------------------------
Test open_basedir configuration [tests/security/open_basedir_linkinfo.phpt] XFAIL REASON: BUG: open_basedir cannot delete symlink to prohibited file. See also
bugs 48111 and 52176.
Inconsistencies when accessing protected members [Zend/tests/access_modifiers_008.phpt] XFAIL REASON: Discussion: http://marc.info/?l=php-internals&m=120221184420957&w=2
Inconsistencies when accessing protected members - 2 [Zend/tests/access_modifiers_009.phpt] XFAIL REASON: Discussion: http://marc.info/?l=php-internals&m=120221184420957&w=2
Bug #48770 (call_user_func_array() fails to call parent from inheriting class) [Zend/tests/bug48770.phpt] XFAIL REASON: See Bug #48770
Bug #48770 (call_user_func_array() fails to call parent from inheriting class) [Zend/tests/bug48770_2.phpt] XFAIL REASON: See Bug #48770
Bug #48770 (call_user_func_array() fails to call parent from inheriting class) [Zend/tests/bug48770_3.phpt] XFAIL REASON: See Bug #48770
Initial value of static var in method depends on the include time of the class definition [Zend/tests/method_static_var.phpt] XFAIL REASON: Maybe not a bug
DateTime::add() -- fall type2 type3 [ext/date/tests/DateTime_add-fall-type2-type3.phpt] XFAIL REASON: Various bugs exist
DateTime::add() -- fall type3 type2 [ext/date/tests/DateTime_add-fall-type3-type2.phpt] XFAIL REASON: Various bugs exist
DateTime::add() -- fall type3 type3 [ext/date/tests/DateTime_add-fall-type3-type3.phpt] XFAIL REASON: Various bugs exist
DateTime::add() -- spring type2 type3 [ext/date/tests/DateTime_add-spring-type2-type3.phpt] XFAIL REASON: Various bugs exist
DateTime::add() -- spring type3 type2 [ext/date/tests/DateTime_add-spring-type3-type2.phpt] XFAIL REASON: Various bugs exist
DateTime::add() -- spring type3 type3 [ext/date/tests/DateTime_add-spring-type3-type3.phpt] XFAIL REASON: Various bugs exist
DateTime::diff() -- fall type2 type3 [ext/date/tests/DateTime_diff-fall-type2-type3.phpt] XFAIL REASON: Various bugs exist
DateTime::diff() -- fall type3 type2 [ext/date/tests/DateTime_diff-fall-type3-type2.phpt] XFAIL REASON: Various bugs exist
DateTime::diff() -- fall type3 type3 [ext/date/tests/DateTime_diff-fall-type3-type3.phpt] XFAIL REASON: Various bugs exist
DateTime::diff() -- spring type2 type3 [ext/date/tests/DateTime_diff-spring-type2-type3.phpt] XFAIL REASON: Various bugs exist
DateTime::diff() -- spring type3 type2 [ext/date/tests/DateTime_diff-spring-type3-type2.phpt] XFAIL REASON: Various bugs exist
DateTime::diff() -- spring type3 type3 [ext/date/tests/DateTime_diff-spring-type3-type3.phpt] XFAIL REASON: Various bugs exist
DateTime::sub() -- fall type2 type3 [ext/date/tests/DateTime_sub-fall-type2-type3.phpt] XFAIL REASON: Various bugs exist
DateTime::sub() -- fall type3 type2 [ext/date/tests/DateTime_sub-fall-type3-type2.phpt] XFAIL REASON: Various bugs exist
DateTime::sub() -- fall type3 type3 [ext/date/tests/DateTime_sub-fall-type3-type3.phpt] XFAIL REASON: Various bugs exist
DateTime::sub() -- spring type2 type3 [ext/date/tests/DateTime_sub-spring-type2-type3.phpt] XFAIL REASON: Various bugs exist
DateTime::sub() -- spring type3 type2 [ext/date/tests/DateTime_sub-spring-type3-type2.phpt] XFAIL REASON: Various bugs exist
DateTime::sub() -- spring type3 type3 [ext/date/tests/DateTime_sub-spring-type3-type3.phpt] XFAIL REASON: Various bugs exist
Bug #52480 (Incorrect difference using DateInterval) [ext/date/tests/bug52480.phpt] XFAIL REASON: See https://bugs.php.net/bug.php?id=52480
RFC: DateTime and Daylight Saving Time Transitions (zone type 3, bd2) [ext/date/tests/rfc-datetime_and_daylight_saving_time-type3-bd2.phpt] XFAIL REASON: Still not quite right
RFC: DateTime and Daylight Saving Time Transitions (zone type 3, fs) [ext/date/tests/rfc-datetime_and_daylight_saving_time-type3-fs.phpt] XFAIL REASON: Still not quite right
Bug #67296 (filter_input doesn't validate variables) [ext/filter/tests/bug49184.phpt] XFAIL REASON: See Bug #49184
Bug #67167: filter_var(null,FILTER_VALIDATE_BOOLEAN,FILTER_NULL_ON_FAILURE) returns null [ext/filter/tests/bug67167.02.phpt] XFAIL REASON: Requires php_zval_filter to not use convert_to_string for all filters.
Phar: bug #69958: Segfault in Phar::convertToData on invalid file [ext/phar/tests/bug69958.phpt] XFAIL REASON: Still has memory leaks, see https://bugs.php.net/bug.php?id=70005
updateTimestamp never called when session data is empty [ext/session/tests/bug71162.phpt] XFAIL REASON: Current session module is designed to write empty session always. In addition, current session module only supports SessionHandlerInterface only from PHP 7.0.
Bug #73529 session_decode() silently fails on wrong input [ext/session/tests/bug73529.phpt] XFAIL REASON: session_decode() does not return proper status.
Bug #70219 Use after free vulnerability in session deserializer [ext/standard/tests/serialize/bug70219.phpt] XFAIL REASON: Unfinished merge, needs fix.
=====================================================================
=====================================================================
FAILED TEST SUMMARY
---------------------------------------------------------------------
Bug #64267 (CURLOPT_INFILE doesn't allow reset) [ext/curl/tests/bug64267.phpt]
Bug #76675 (Segfault with H2 server push write/writeheader handlers) [ext/curl/tests/bug76675.phpt]
Bug #78775: TLS issues from HTTP request affecting other encrypted connections [ext/curl/tests/bug78775.phpt]
Test json_encode() function : basic functionality [ext/json/tests/json_encode_basic.phpt]
Multicast support: IPv6 send options [ext/sockets/tests/mcast_ipv6_send.phpt]
recvmsg(): receive SCM_CREDENTIALS messages [ext/sockets/tests/socket_cmsg_rights.phpt]
Test if socket_create_listen() returns false, when it cannot bind to the port. [ext/sockets/tests/socket_create_listen-nobind.phpt]
int socket_send ( resource $socket , string $buf , int $len , int $flags ); [ext/sockets/tests/socket_send.phpt]
Test if socket_recvfrom() receives data sent by socket_sendto() via IPv6 UDP [ext/sockets/tests/socket_sentto_recvfrom_ipv6_udp.phpt]
bool socket_shutdown ( resource $socket [, int $how = 2 ] ) ; [ext/sockets/tests/socket_shutdown.phpt]
Bug #80067 (Omitting the port in bindto setting errors) [ext/standard/tests/network/bug80067.phpt]
mixed stream_socket_enable_crypto(resource $stream , bool $enable [, int $crypto_type [, resource $session_stream ]] ) ; [ext/standard/tests/streams/stream_socket_enable_crypto.phpt]
Test gzencode() function : variation [ext/zlib/tests/gzencode_variation1.phpt]
Test gzencode() function : variation - verify header contents with all encoding modes [ext/zlib/tests/gzencode_variation2.phpt]
cli_get_process_title() function : basic functionality [sapi/cli/tests/cli_get_process_title_basic.phpt]
Check cli_process_title support on Unix [sapi/cli/tests/cli_process_title_unix.phpt]
cli_set_process_title() function : basic functionality [sapi/cli/tests/cli_set_process_title_basic.phpt]
=====================================================================
================================================================================
/Users/GeoffC/php-7.3.26/ext/curl/tests/bug64267.phpt
================================================================================
TEST
bool(true)
bool(true)
int(0)
===DONE===
================================================================================
004+ int(0)
004- int(30%d)
================================================================================
================================================================================
/Users/GeoffC/php-7.3.26/ext/curl/tests/bug76675.phpt
================================================================================
================================================================================
001+
001- (Received \d+)+
================================================================================
================================================================================
/Users/GeoffC/php-7.3.26/ext/curl/tests/bug78775.phpt
================================================================================
Warning: fsockopen(): php_network_getaddresses: getaddrinfo failed: nodename nor servname provided, or not known in /Users/GeoffC/php-7.3.26/ext/curl/tests/bug78775.php on line 3
Warning: fsockopen(): unable to connect to tls://google.com:443 (php_network_getaddresses: getaddrinfo failed: nodename nor servname provided, or not known) in /Users/GeoffC/php-7.3.26/ext/curl/tests/bug78775.php on line 3
bool(false)
bool(false)
Warning: fwrite() expects parameter 1 to be resource, bool given in /Users/GeoffC/php-7.3.26/ext/curl/tests/bug78775.php on line 19
Warning: fread() expects parameter 1 to be resource, bool given in /Users/GeoffC/php-7.3.26/ext/curl/tests/bug78775.php on line 20
bool(false)
================================================================================
001+ Warning: fsockopen(): php_network_getaddresses: getaddrinfo failed: nodename nor servname provided, or not known in /Users/GeoffC/php-7.3.26/ext/curl/tests/bug78775.php on line 3
002+
003+ Warning: fsockopen(): unable to connect to tls://google.com:443 (php_network_getaddresses: getaddrinfo failed: nodename nor servname provided, or not known) in /Users/GeoffC/php-7.3.26/ext/curl/tests/bug78775.php on line 3
004+ bool(false)
005+ bool(false)
006+
007+ Warning: fwrite() expects parameter 1 to be resource, bool given in /Users/GeoffC/php-7.3.26/ext/curl/tests/bug78775.php on line 19
008+
009+ Warning: fread() expects parameter 1 to be resource, bool given in /Users/GeoffC/php-7.3.26/ext/curl/tests/bug78775.php on line 20
001- resource(%d) of type (stream)
003- string(8) "HTTP/1.0"
================================================================================
================================================================================
/Users/GeoffC/php-7.3.26/ext/json/tests/json_encode_basic.phpt
================================================================================
*** Testing json_encode() : basic functionality ***
-- Iteration 1 --
string(1) "0"
-- Iteration 2 --
string(3) "123"
-- Iteration 3 --
string(4) "-123"
-- Iteration 4 --
string(10) "2147483647"
-- Iteration 5 --
string(11) "-2147483648"
-- Iteration 6 --
string(50) "123.4560000000000030695446184836328029632568359375"
-- Iteration 7 --
string(4) "1230"
-- Iteration 8 --
string(5) "-1230"
-- Iteration 9 --
string(4) "true"
-- Iteration 10 --
string(4) "true"
-- Iteration 11 --
string(5) "false"
-- Iteration 12 --
string(5) "false"
-- Iteration 13 --
string(4) "null"
-- Iteration 14 --
string(4) "null"
-- Iteration 15 --
string(5) ""abc""
-- Iteration 16 --
string(5) ""abc""
-- Iteration 17 --
string(18) ""Hello\t\tWorld\n""
-- Iteration 18 --
string(2) "[]"
-- Iteration 19 --
string(11) "[1,2,3,4,5]"
-- Iteration 20 --
string(72) "{"1":"Sun","2":"Mon","3":"Tue","4":"Wed","5":"Thur","6":"Fri","7":"Sat"}"
-- Iteration 21 --
string(58) "{"Jan":31,"Feb":29,"Mar":31,"April":30,"May":31,"June":30}"
-- Iteration 22 --
string(2) """"
-- Iteration 23 --
string(2) """"
-- Iteration 24 --
string(4) "null"
-- Iteration 25 --
string(4) "null"
-- Iteration 26 --
bool(false)
-- Iteration 27 --
string(126) "{"MyInt":99,"MyFloat":123.4500000000000028421709430404007434844970703125,"MyBool":true,"MyNull":null,"MyString":"Hello World"}"
===Done===
================================================================================
013+ string(50) "123.4560000000000030695446184836328029632568359375"
013- string(7) "123.456"
055+ string(126) "{"MyInt":99,"MyFloat":123.4500000000000028421709430404007434844970703125,"MyBool":true,"MyNull":null,"MyString":"Hello World"}"
055- string(82) "{"MyInt":99,"MyFloat":123.45,"MyBool":true,"MyNull":null,"MyString":"Hello World"}"
================================================================================
================================================================================
/Users/GeoffC/php-7.3.26/ext/sockets/tests/mcast_ipv6_send.phpt
================================================================================
Setting IPV6_MULTICAST_TTL
bool(true)
int(9)
Setting IPV6_MULTICAST_LOOP
bool(true)
int(0)
bool(true)
int(1)
Setting IPV6_MULTICAST_IF
interface 0:
Warning: socket_set_option(): unable to set socket option [49]: Can't assign requested address in /Users/GeoffC/php-7.3.26/ext/sockets/tests/mcast_ipv6_send.php on line 26
bool(false)
int(0)
interface 1:
bool(true)
int(1)
================================================================================
013+
014+ Warning: socket_set_option(): unable to set socket option [49]: Can't assign requested address in /Users/GeoffC/php-7.3.26/ext/sockets/tests/mcast_ipv6_send.php on line 26
015+ bool(false)
013- bool(true)
================================================================================
================================================================================
/Users/GeoffC/php-7.3.26/ext/sockets/tests/socket_cmsg_rights.phpt
================================================================================
creating send socket
resource(6) of type (Socket)
creating receive socket
resource(7) of type (Socket)
bool(true)
int(11)
array(3) {
["name"]=>
array(0) {
}
["buffer_size"]=>
int(2000)
["controllen"]=>
int(28)
}
Array
(
[name] => Array
(
[family] => 1
[path] =>
)
[control] => Array
(
[0] => Array
(
[level] => 65535
[type] => 1
[data] => Array
(
[0] => Resource id #8
[1] => Resource id #9
[2] => Resource id #10
[3] => Resource id #11
)
)
)
[iov] => Array
(
[0] => test thing
)
[flags] => 0
)
================================================================================
018+ [name] => Array
019+ (
020+ [family] => 1
021+ [path] =>
022+ )
023+
018- [name] =>
================================================================================
================================================================================
/Users/GeoffC/php-7.3.26/ext/sockets/tests/socket_create_listen-nobind.phpt
================================================================================
================================================================================
001+
001- Warning: socket_create_listen(): unable to bind to given address [13]: Permission denied in %s on line %d
================================================================================
================================================================================
/Users/GeoffC/php-7.3.26/ext/sockets/tests/socket_send.phpt
================================================================================
okey
Warning: socket_send(): unable to write to socket [22]: Invalid argument in /Users/GeoffC/php-7.3.26/ext/sockets/tests/socket_send.php on line 14
okey
okey
================================================================================
002+
003+ Warning: socket_send(): unable to write to socket [22]: Invalid argument in /Users/GeoffC/php-7.3.26/ext/sockets/tests/socket_send.php on line 14
004- okey
================================================================================
================================================================================
/Users/GeoffC/php-7.3.26/ext/sockets/tests/socket_sentto_recvfrom_ipv6_udp.phpt
================================================================================
bool(false)
Warning: Wrong parameter count for socket_sendto() in /Users/GeoffC/php-7.3.26/ext/sockets/tests/socket_sentto_recvfrom_ipv6_udp.php on line 11
Warning: socket_recvfrom() expects at least 5 parameters, 4 given in /Users/GeoffC/php-7.3.26/ext/sockets/tests/socket_sentto_recvfrom_ipv6_udp.php on line 27
Warning: Wrong parameter count for socket_recvfrom() in /Users/GeoffC/php-7.3.26/ext/sockets/tests/socket_sentto_recvfrom_ipv6_udp.php on line 28
bytes have been received instead of the 5 bytes expected
================================================================================
008+ bytes have been received instead of the 5 bytes expected
008- Received Ping! from remote address ::1 and remote port 1223
================================================================================
================================================================================
/Users/GeoffC/php-7.3.26/ext/sockets/tests/socket_shutdown.phpt
================================================================================
bool(true)
bool(true)
bool(true)
Warning: socket_shutdown(): unable to shutdown socket [57]: Socket is not connected in /Users/GeoffC/php-7.3.26/ext/sockets/tests/socket_shutdown.php on line 21
bool(false)
Warning: socket_shutdown(): unable to shutdown socket [22]: Invalid argument in /Users/GeoffC/php-7.3.26/ext/sockets/tests/socket_shutdown.php on line 24
bool(false)
================================================================================
005+ Warning: socket_shutdown(): unable to shutdown socket [57]: Socket is not connected in /Users/GeoffC/php-7.3.26/ext/sockets/tests/socket_shutdown.php on line 21
005- Warning: socket_shutdown(): unable to shutdown socket [%d]: Transport endpoint is not connected in %s on line %d
================================================================================
================================================================================
/Users/GeoffC/php-7.3.26/ext/standard/tests/network/bug80067.phpt
================================================================================
Warning: file_get_contents(): SSL operation failed with code 1. OpenSSL Error messages:
error:1416F086:SSL routines:tls_process_server_certificate:certificate verify failed in /Users/GeoffC/php-7.3.26/ext/standard/tests/network/bug80067.php on line 3
Warning: file_get_contents(): Failed to enable crypto in /Users/GeoffC/php-7.3.26/ext/standard/tests/network/bug80067.php on line 3
Warning: file_get_contents(https://httpbin.org/get): failed to open stream: operation failed in /Users/GeoffC/php-7.3.26/ext/standard/tests/network/bug80067.php on line 3
bool(false)
================================================================================
001+ Warning: file_get_contents(): SSL operation failed with code 1. OpenSSL Error messages:
001- bool(true)
002+ error:1416F086:SSL routines:tls_process_server_certificate:certificate verify failed in /Users/GeoffC/php-7.3.26/ext/standard/tests/network/bug80067.php on line 3
003+
004+ Warning: file_get_contents(): Failed to enable crypto in /Users/GeoffC/php-7.3.26/ext/standard/tests/network/bug80067.php on line 3
005+
006+ Warning: file_get_contents(https://httpbin.org/get): failed to open stream: operation failed in /Users/GeoffC/php-7.3.26/ext/standard/tests/network/bug80067.php on line 3
007+ bool(false)
================================================================================
================================================================================
/Users/GeoffC/php-7.3.26/ext/standard/tests/streams/stream_socket_enable_crypto.phpt
================================================================================
bool(false)
Warning: stream_socket_enable_crypto(): When enabling encryption you must specify the crypto type in /Users/GeoffC/php-7.3.26/ext/standard/tests/streams/stream_socket_enable_crypto.php on line 7
bool(false)
** ERROR: process timed out **
================================================================================
006+ ** ERROR: process timed out **
006- Warning: stream_socket_enable_crypto(): SSL: %a in %s on line %d
007- bool(false)
008-
009- Warning: stream_socket_enable_crypto(): SSL/TLS already set-up for this stream in %s on line %d
010- bool(false)
011-
012- Warning: stream_socket_enable_crypto(): SSL/TLS already set-up for this stream in %s on line %d
013- bool(false)
014-
015- Warning: stream_socket_enable_crypto(): SSL/TLS already set-up for this stream in %s on line %d
016- bool(false)
017-
018- Warning: stream_socket_enable_crypto(): SSL/TLS already set-up for this stream in %s on line %d
019- bool(false)
020-
021- Warning: stream_socket_enable_crypto(): SSL/TLS already set-up for this stream in %s on line %d
022- bool(false)
023-
024- Warning: stream_socket_enable_crypto(): SSL/TLS already set-up for this stream in %s on line %d
025- bool(false)
026-
027- Warning: stream_socket_enable_crypto(): SSL/TLS already set-up for this stream in %s on line %d
028- bool(false)
================================================================================
================================================================================
/Users/GeoffC/php-7.3.26/ext/zlib/tests/gzencode_variation1.phpt
================================================================================
*** Testing gzencode() : variation ***
-- Testing multiple compression --
string(3658) "1f8b0800000000000013010e07f1f81f8b08000000000000136d574d6fe4c80dbdeb57d4ad2f3dfe01eb83e1ec22980e309b4562c067b64449159754dafab0b6e7d7e73d96da1e4c72184c4b2ab2c8f7c847fa25baabba98dc1a8b2b7c38bb324b713ee37f757f56cdc5c7f5b17b9d152f923b157c5ae335e0b75fedd0e2d781c6b98ea3a6ee05affe1dfc3a6527f8f09c52dcb38ba38bb5249934d6ecfe1e53a9ab76ff4c342cf2a64ed2028349fc9a8b139755685352acb82b9fbb67f8bade5cdcb698e1fcec94b7ceba3cb897e806cfc8114350dd1ebbdfa35b62d2478b0056d23ed809b9b95d696d91ce2aa97c911e3fa539c43f84c887554a4d125c9e63ff96711cc08c0866263cb37a0bbe2122ae8f6baecb2284abfb4ddf916db8354cddeef37c1afe5fa02fc7afb3db34f5b3acbdf2eb905490d8f38d7468d253a323d5ebb903760d7944d3b2024e834a99ddce77669bdd823cfbb8e899d4ad4c799677452e6029e80023a03b2374005590641f7d3877df2ad09f3c0e82a54d6a5644fd63049a37ed4bc362016fd9f51264f1e5c630727421ae930b7ed416e93e47b7c71a400390361ffbecb7561bb98f69b5da289e91becc27f08b3b724cb8704f9144d366431d0cb870c56b205deaa2e17636063761a911039fb7e4bf9f06c4f0aecd2ec80e8b41831ca7515e31286166458ea3ef71f2ce7cde2ae269c96d60525724a9c9170b713ed5750758f3cd2a361fc8b288fc92358ce884692e8ea0fe59bd969a0da2eed5831b715749eaae7178f3ebd30fb88c92105f367cce2c882955dc6bf8eca0d5d57540b3092894743ba0fd5b2dad021836191f1afc0bba14dde1642cb0b1aa6879c38907dcefa0720082b801bec61417469219175267dfa047df35b0bd1332001c28cdfafd3bcabe91e74368cdd8d8478e494c190e7ee90c67f2bde288e68ab6b15e883c995be4f8feb6c6dda4278e4f38578ddbdc7be36788daf0c3cb1d1819c73822f7000a0d1813fa94153b572315e51343b536bc64977dff163cebfd8418773261f524017e251fccc60ae29a5770ae097594d52e9c1229d87ce967a36401c46b69945afb249d101c9d420ffa9a123e232c20e76467d5d169202a2dd4c582949e013e745df7958d4b0cc4fd4377a737cd4feea7974070000f314d423e0634cb9a618fdf5dc64fd422181fd59c9230c9f6f9d18dc8fc23e9cccbc7188733b04aa57de83ebea0be3633cff5fa1ff83269be7f44f5a8d84550cc703255fd345dd402034d0b3e11a73ec6e3d4a77f4f685b614329f1b3132ae7af33d02e1e55e291fa6574b758d1f0200e7423dbc852211818043a7c9ce80aa9d59fce0401959f5ea2cf71fde90824f8c9192dbe9d329db143794675ddcf257dd7755273b67340414e3ccad12e3f661f8aad9cf9957dc1275d10a51d3934fa81e68dc6768fb8ee23e373936c8e13feab8b0f50d227f7af76f561fb0950f3d099bbc316c3892a42fb36806d8660e800fa4f43fd4b962d2097d71933a54b77ff948677848eb17bb3a88b621682cfb3bbb49cf42fed6b3944124ad8358ca688aa44dd5f2144c7c9ab16f25b9aca9654ef357ec9ad55c40d324d6cc3d9e3920b863c231d31a95d937fb5520f9c816c79b7dcecc593fb9593cc05a51ebb1eeddd5b49eb437769738d0f64adc579d372b8b7f7c0208487ee3915ebf5766e148ebd77cf4e01f3ec285047011e55838968b6494d517fe29224777b24dd3ddf933101695b102e87db805eef291b74dcfd91628fb2a53f93dbd2968ef2e598746c9204f89fba1f0246fc671610a0591806e46a1346f77c40d910a47c5e20ffb23f003c04b648327a4ed98032c1965bd35bb0044f5344248f56fdb99aa61d6451d68e33489a83bffbe6573541b2da5f64681ea12090f778b2075374778810f73965fa3626a9d41f4df2f83f7c34658cec921b5a9bde49dd5007ec882b02adc514f81aa85898b5cc98e1b137733c0a8789b7f5648d2d231b80bf74978f25d61ce08a8abd11801fd8f995e066676307192ff7641f1cc6e0dee68565b8b22ac3889cd067bf732754a6b270af1044c6a8776811a4f6d8bd0477a9f516064201b920b92d7cd4dc7eee13e6b3eb3528a82f9abb3f388ebe6a8f871393461b73816ec54c99d604174bc5a6801de13908f86aea6a7d0fea107d682bcf1ec348b83872e6b8a316ecd02eb8f8dc86a609bf59a2dd03f1dfa4079436d55e24617be1a2854d008b2b2b1705e2078a7f3946318df1c24f6bf70d4b456eca286ec2b585b28262cc048a098c3e2d5f325a92bb36f691afdc14c822da1b116c9c1c07bb362eb0a04b78834c812134230ebf2044ac2e3c0e3ad00f848dc5010f3bf917ec2fc700b7bf26dacea8440620e04f90f4d97d6dd77cfde8a05c7d3930f1e5811fb8ec5c70964dcc8187ec90e32fdd6b64eec7586413b7d55bed65c4cce39a9b6c15e70e9da94e53fc904e6286f01f5b5562c94211befbc23507e01b2a3865e2f45b5d7b591f290087a5605b82495b4e393f31aa5b37211ec40241a746d903c5eebf117a4d3ddb0d0000ed6ebe4d0e070000"
===Done===
================================================================================
004+ string(3658) "1f8b0800000000000013010e07f1f81f8b08000000000000136d574d6fe4c80dbdeb57d4ad2f3dfe01eb83e1ec22980e309b4562c067b64449159754dafab0b6e7d7e73d96da1e4c72184c4b2ab2c8f7c847fa25baabba98dc1a8b2b7c38bb324b713ee37f757f56cdc5c7f5b17b9d152f923b157c5ae335e0b75fedd0e2d781c6b98ea3a6ee05affe1dfc3a6527f8f09c52dcb38ba38bb5249934d6ecfe1e53a9ab76ff4c342cf2a64ed2028349fc9a8b139755685352acb82b9fbb67f8bade5cdcb698e1fcec94b7ceba3cb897e806cfc8114350dd1ebbdfa35b62d2478b0056d23ed809b9b95d696d91ce2aa97c911e3fa539c43f84c887554a4d125c9e63ff96711cc08c0866263cb37a0bbe2122ae8f6baecb2284abfb4ddf916db8354cddeef37c1afe5fa02fc7afb3db34f5b3acbdf2eb905490d8f38d7468d253a323d5ebb903760d7944d3b2024e834a99ddce77669bdd823cfbb8e899d4ad4c799677452e6029e80023a03b2374005590641f7d3877df2ad09f3c0e82a54d6a5644fd63049a37ed4bc362016fd9f51264f1e5c630727421ae930b7ed416e93e47b7c71a400390361ffbecb7561bb98f69b5da289e91becc27f08b3b724cb8704f9144d366431d0cb870c56b205deaa2e17636063761a911039fb7e4bf9f06c4f0aecd2ec80e8b41831ca7515e31286166458ea3ef71f2ce7cde2ae269c96d60525724a9c9170b713ed5750758f3cd2a361fc8b288fc92358ce884692e8ea0fe59bd969a0da2eed5831b715749eaae7178f3ebd30fb88c92105f367cce2c882955dc6bf8eca0d5d57540b3092894743ba0fd5b2dad021836191f1afc0bba14dde1642cb0b1aa6879c38907dcefa0720082b801bec61417469219175267dfa047df35b0bd1332001c28cdfafd3bcabe91e74368cdd8d8478e494c190e7ee90c67f2bde288e68ab6b15e883c995be4f8feb6c6dda4278e4f38578ddbdc7be36788daf0c3cb1d1819c73822f7000a0d1813fa94153b572315e51343b536bc64977dff163cebfd8418773261f524017e251fccc60ae29a5770ae097594d52e9c1229d87ce967a36401c46b69945afb249d101c9d420ffa9a123e232c20e76467d5d169202a2dd4c582949e013e745df7958d4b0cc4fd4377a737cd4feea7974070000f314d423e0634cb9a618fdf5dc64fd422181fd59c9230c9f6f9d18dc8fc23e9cccbc7188733b04aa57de83ebea0be3633cff5fa1ff83269be7f44f5a8d84550cc703255fd345dd402034d0b3e11a73ec6e3d4a77f4f685b614329f1b3132ae7af33d02e1e55e291fa6574b758d1f0200e7423dbc852211818043a7c9ce80aa9d59fce0401959f5ea2cf71fde90824f8c9192dbe9d329db143794675ddcf257dd7755273b67340414e3ccad12e3f661f8aad9cf9957dc1275d10a51d3934fa81e68dc6768fb8ee23e373936c8e13feab8b0f50d227f7af76f561fb0950f3d099bbc316c3892a42fb36806d8660e800fa4f43fd4b962d2097d71933a54b77ff948677848eb17bb3a88b621682cfb3bbb49cf42fed6b3944124ad8358ca688aa44dd5f2144c7c9ab16f25b9aca9654ef357ec9ad55c40d324d6cc3d9e3920b863c231d31a95d937fb5520f9c816c79b7dcecc593fb9593cc05a51ebb1eeddd5b49eb437769738d0f64adc579d372b8b7f7c0208487ee3915ebf5766e148ebd77cf4e01f3ec285047011e55838968b6494d517fe29224777b24dd3ddf933101695b102e87db805eef291b74dcfd91628fb2a53f93dbd2968ef2e598746c9204f89fba1f0246fc671610a0591806e46a1346f77c40d910a47c5e20ffb23f003c04b648327a4ed98032c1965bd35bb0044f5344248f56fdb99aa61d6451d68e33489a83bffbe6573541b2da5f64681ea12090f778b2075374778810f73965fa3626a9d41f4df2f83f7c34658cec921b5a9bde49dd5007ec882b02adc514f81aa85898b5cc98e1b137733c0a8789b7f5648d2d231b80bf74978f25d61ce08a8abd11801fd8f995e066676307192ff7641f1cc6e0dee68565b8b22ac3889cd067bf732754a6b270af1044c6a8776811a4f6d8bd0477a9f516064201b920b92d7cd4dc7eee13e6b3eb3528a82f9abb3f388ebe6a8f871393461b73816ec54c99d604174bc5a6801de13908f86aea6a7d0fea107d682bcf1ec348b83872e6b8a316ecd02eb8f8dc86a609bf59a2dd03f1dfa4079436d55e24617be1a2854d008b2b2b1705e2078a7f3946318df1c24f6bf70d4b456eca286ec2b585b28262cc048a098c3e2d5f325a92bb36f691afdc14c822da1b116c9c1c07bb362eb0a04b78834c812134230ebf2044ac2e3c0e3ad00f848dc5010f3bf917ec2fc700b7bf26dacea8440620e04f90f4d97d6dd77cfde8a05c7d3930f1e5811fb8ec5c70964dcc8187ec90e32fdd6b64eec7586413b7d55bed65c4cce39a9b6c15e70e9da94e53fc904e6286f01f5b5562c94211befbc23507e01b2a3865e2f45b5d7b591f290087a5605b82495b4e393f31aa5b37211ec40241a746d903c5eebf117a4d3ddb0d0000ed6ebe4d0e070000"
004- string(3658) "1f8b0800000000000003010e07f1f81f8b08000000000000036d574d6fe4c80dbdeb57d4ad2f3dfe01eb83e1ec22980e309b4562c067b64449159754dafab0b6e7d7e73d96da1e4c72184c4b2ab2c8f7c847fa25baabba98dc1a8b2b7c38bb324b713ee37f757f56cdc5c7f5b17b9d152f923b157c5ae335e0b75fedd0e2d781c6b98ea3a6ee05affe1dfc3a6527f8f09c52dcb38ba38bb5249934d6ecfe1e53a9ab76ff4c342cf2a64ed2028349fc9a8b139755685352acb82b9fbb67f8bade5cdcb698e1fcec94b7ceba3cb897e806cfc8114350dd1ebbdfa35b62d2478b0056d23ed809b9b95d696d91ce2aa97c911e3fa539c43f84c887554a4d125c9e63ff96711cc08c0866263cb37a0bbe2122ae8f6baecb2284abfb4ddf916db8354cddeef37c1afe5fa02fc7afb3db34f5b3acbdf2eb905490d8f38d7468d253a323d5ebb903760d7944d3b2024e834a99ddce77669bdd823cfbb8e899d4ad4c799677452e6029e80023a03b2374005590641f7d3877df2ad09f3c0e82a54d6a5644fd63049a37ed4bc362016fd9f51264f1e5c630727421ae930b7ed416e93e47b7c71a400390361ffbecb7561bb98f69b5da289e91becc27f08b3b724cb8704f9144d366431d0cb870c56b205deaa2e17636063761a911039fb7e4bf9f06c4f0aecd2ec80e8b41831ca7515e31286166458ea3ef71f2ce7cde2ae269c96d60525724a9c9170b713ed5750758f3cd2a361fc8b288fc92358ce884692e8ea0fe59bd969a0da2eed5831b715749eaae7178f3ebd30fb88c92105f367cce2c882955dc6bf8eca0d5d57540b3092894743ba0fd5b2dad021836191f1afc0bba14dde1642cb0b1aa6879c38907dcefa0720082b801bec61417469219175267dfa047df35b0bd1332001c28cdfafd3bcabe91e74368cdd8d8478e494c190e7ee90c67f2bde288e68ab6b15e883c995be4f8feb6c6dda4278e4f38578ddbdc7be36788daf0c3cb1d1819c73822f7000a0d1813fa94153b572315e51343b536bc64977dff163cebfd8418773261f524017e251fccc60ae29a5770ae097594d52e9c1229d87ce967a36401c46b69945afb249d101c9d420ffa9a123e232c20e76467d5d169202a2dd4c582949e013e745df7958d4b0cc4fd4377a737cd4feea7974070000f314d423e0634cb9a618fdf5dc64fd422181fd59c9230c9f6f9d18dc8fc23e9cccbc7188733b04aa57de83ebea0be3633cff5fa1ff83269be7f44f5a8d84550cc703255fd345dd402034d0b3e11a73ec6e3d4a77f4f685b614329f1b3132ae7af33d02e1e55e291fa6574b758d1f0200e7423dbc852211818043a7c9ce80aa9d59fce0401959f5ea2cf71fde90824f8c9192dbe9d329db143794675ddcf257dd7755273b67340414e3ccad12e3f661f8aad9cf9957dc1275d10a51d3934fa81e68dc6768fb8ee23e373936c8e13feab8b0f50d227f7af76f561fb0950f3d099bbc316c3892a42fb36806d8660e800fa4f43fd4b962d2097d71933a54b77ff948677848eb17bb3a88b621682cfb3bbb49cf42fed6b3944124ad8358ca688aa44dd5f2144c7c9ab16f25b9aca9654ef357ec9ad55c40d324d6cc3d9e3920b863c231d31a95d937fb5520f9c816c79b7dcecc593fb9593cc05a51ebb1eeddd5b49eb437769738d0f64adc579d372b8b7f7c0208487ee3915ebf5766e148ebd77cf4e01f3ec285047011e55838968b6494d517fe29224777b24dd3ddf933101695b102e87db805eef291b74dcfd91628fb2a53f93dbd2968ef2e598746c9204f89fba1f0246fc671610a0591806e46a1346f77c40d910a47c5e20ffb23f003c04b648327a4ed98032c1965bd35bb0044f5344248f56fdb99aa61d6451d68e33489a83bffbe6573541b2da5f64681ea12090f778b2075374778810f73965fa3626a9d41f4df2f83f7c34658cec921b5a9bde49dd5007ec882b02adc514f81aa85898b5cc98e1b137733c0a8789b7f5648d2d231b80bf74978f25d61ce08a8abd11801fd8f995e066676307192ff7641f1cc6e0dee68565b8b22ac3889cd067bf732754a6b270af1044c6a8776811a4f6d8bd0477a9f516064201b920b92d7cd4dc7eee13e6b3eb3528a82f9abb3f388ebe6a8f871393461b73816ec54c99d604174bc5a6801de13908f86aea6a7d0fea107d682bcf1ec348b83872e6b8a316ecd02eb8f8dc86a609bf59a2dd03f1dfa4079436d55e24617be1a2854d008b2b2b1705e2078a7f3946318df1c24f6bf70d4b456eca286ec2b585b28262cc048a098c3e2d5f325a92bb36f691afdc14c822da1b116c9c1c07bb362eb0a04b78834c812134230ebf2044ac2e3c0e3ad00f848dc5010f3bf917ec2fc700b7bf26dacea8440620e04f90f4d97d6dd77cfde8a05c7d3930f1e5811fb8ec5c70964dcc8187ec90e32fdd6b64eec7586413b7d55bed65c4cce39a9b6c15e70e9da94e53fc904e6286f01f5b5562c94211befbc23507e01b2a3865e2f45b5d7b591f290087a5605b82495b4e393f31aa5b37211ec40241a746d903c5eebf117a4d3ddb0d00007b64cbc70e070000"
================================================================================
================================================================================
/Users/GeoffC/php-7.3.26/ext/zlib/tests/gzencode_variation2.phpt
================================================================================
*** Testing gzencode() : variation ***
-- Testing with each encoding_mode --
string(90) "1f8b0800000000000013735428ce4dccc951282e29cacc4b5728c95748cd4bce4f49e50200d7739de519000000"
string(90) "1f8b0800000000000013735428ce4dccc951282e29cacc4b5728c95748cd4bce4f49e50200d7739de519000000"
string(66) "789c735428ce4dccc951282e29cacc4b5728c95748cd4bce4f49e50200735808cd"
===DONE===
================================================================================
004+ string(90) "1f8b0800000000000013735428ce4dccc951282e29cacc4b5728c95748cd4bce4f49e50200d7739de519000000"
005+ string(90) "1f8b0800000000000013735428ce4dccc951282e29cacc4b5728c95748cd4bce4f49e50200d7739de519000000"
004- string(90) "1f8b0800000000000003735428ce4dccc951282e29cacc4b5728c95748cd4bce4f49e50200d7739de519000000"
005- string(90) "1f8b0800000000000003735428ce4dccc951282e29cacc4b5728c95748cd4bce4f49e50200d7739de519000000"
================================================================================
================================================================================
/Users/GeoffC/php-7.3.26/sapi/cli/tests/cli_get_process_title_basic.phpt
================================================================================
Warning: cli_set_process_title(): cli_set_process_title had an error: Not initialized correctly in /Users/GeoffC/php-7.3.26/sapi/cli/tests/cli_get_process_title_basic.php on line 2
================================================================================
001+ Warning: cli_set_process_title(): cli_set_process_title had an error: Not initialized correctly in /Users/GeoffC/php-7.3.26/sapi/cli/tests/cli_get_process_title_basic.php on line 2
001- Title correctly retrieved!
================================================================================
================================================================================
/Users/GeoffC/php-7.3.26/sapi/cli/tests/cli_process_title_unix.phpt
================================================================================
*** Testing setting the process title ***
Warning: cli_set_process_title(): cli_set_process_title had an error: Not initialized correctly in /Users/GeoffC/php-7.3.26/sapi/cli/tests/cli_process_title_unix.php on line 7
Actually loaded from ps: /Users/GeoffC/php-7.3.26/sapi/cli/php -n -c /Users/GeoffC/php-7.3.26/tmp-php.ini -d output_handler= -d open_basedir= -d disable_functions= -d output_buffering=Off -d error_reporting=32767 -d display_errors=1 -d display_startup_errors=1 -d log_errors=0 -d html_errors=0 -d track_errors=0 -d report_memleaks=1 -d report_zend_debug=0 -d docref_root= -d docref_ext=.html -d error_prepend_string= -d error_append_string= -d auto_prepend_file= -d auto_append_file= -d ignore_repeated_errors=0 -d precision=14 -d memory_limit=128M -d log_errors_max_len=0 -d opcache.fast_shutdown=0 -d opcache.file_update_protection=0 -d zend.assertions=1 -d extension_dir=/Users/GeoffC/php-7.3.26/modules/ -d session.auto_start=0 -d zlib.output_compression=Off -d mbstring.func_overload=0 -f /Users/GeoffC/php-7.3.26/sapi/cli/tests/cli_process_title_unix.php
Warning: cli_get_process_title(): cli_get_process_title had an error: Not initialized correctly in /Users/GeoffC/php-7.3.26/sapi/cli/tests/cli_process_title_unix.php on line 35
Actually loaded from get:
================================================================================
002+
003+ Warning: cli_set_process_title(): cli_set_process_title had an error: Not initialized correctly in /Users/GeoffC/php-7.3.26/sapi/cli/tests/cli_process_title_unix.php on line 7
004+ Actually loaded from ps: /Users/GeoffC/php-7.3.26/sapi/cli/php -n -c /Users/GeoffC/php-7.3.26/tmp-php.ini -d output_handler= -d open_basedir= -d disable_functions= -d output_buffering=Off -d error_reporting=32767 -d display_errors=1 -d display_startup_errors=1 -d log_errors=0 -d html_errors=0 -d track_errors=0 -d report_memleaks=1 -d report_zend_debug=0 -d docref_root= -d docref_ext=.html -d error_prepend_string= -d error_append_string= -d auto_prepend_file= -d auto_append_file= -d ignore_repeated_errors=0 -d precision=14 -d memory_limit=128M -d log_errors_max_len=0 -d opcache.fast_shutdown=0 -d opcache.file_update_protection=0 -d zend.assertions=1 -d extension_dir=/Users/GeoffC/php-7.3.26/modules/ -d session.auto_start=0 -d zlib.output_compression=Off -d mbstring.func_overload=0 -f /Users/GeoffC/php-7.3.26/sapi/cli/tests/cli_process_title_unix.php
002- Successfully set title
003- Successfully verified title using ps
004- Successfully verified title using get
005+
006+ Warning: cli_get_process_title(): cli_get_process_title had an error: Not initialized correctly in /Users/GeoffC/php-7.3.26/sapi/cli/tests/cli_process_title_unix.php on line 35
007+ Actually loaded from get:
================================================================================
================================================================================
/Users/GeoffC/php-7.3.26/sapi/cli/tests/cli_set_process_title_basic.phpt
================================================================================
Warning: cli_set_process_title(): cli_set_process_title had an error: Not initialized correctly in /Users/GeoffC/php-7.3.26/sapi/cli/tests/cli_set_process_title_basic.php on line 2
================================================================================
001+ Warning: cli_set_process_title(): cli_set_process_title had an error: Not initialized correctly in /Users/GeoffC/php-7.3.26/sapi/cli/tests/cli_set_process_title_basic.php on line 2
001- Successfully set title
================================================================================
================================================================================
BUILD ENVIRONMENT
================================================================================
OS:
Darwin - Darwin Ace 20.2.0 Darwin Kernel Version 20.2.0: Wed Dec 2 20:39:59 PST 2020; root:xnu-7195.60.75~1/RELEASE_X86_64 x86_64
Autoconf:
autoconf (GNU Autoconf) 2.69
Copyright (C) 2012 Free Software Foundation, Inc.
License GPLv3+/Autoconf: GNU GPL version 3 or later
<http://gnu.org/licenses/gpl.html>, <http://gnu.org/licenses/exceptions.html>
This is free software: you are free to change and redistribute it.
There is NO WARRANTY, to the extent permitted by law.
Written by David J. MacKenzie and Akim Demaille.
Bundled Libtool:
ltmain.sh (GNU libtool) 1.5.26 (1.1220.2.492 2008/01/30 06:40:56)
Copyright (C) 2008 Free Software Foundation, Inc.
This is free software; see the source for copying conditions. There is NO
warranty; not even for MERCHANTABILITY or FITNESS FOR A PARTICULAR PURPOSE.
System Libtool:
Compiler:
Apple clang version 12.0.0 (clang-1200.0.32.28)
Target: x86_64-apple-darwin20.2.0
Thread model: posix
InstalledDir: /Applications/Xcode.app/Contents/Developer/Toolchains/XcodeDefault.xctoolchain/usr/bin
Bison:
bison (GNU Bison) 3.6.4
'Ecrit par Robert Corbett et Richard Stallman.
Copyright (c) 2020 Free Software Foundation, Inc.
Ce logiciel est libre; voir les sources pour les conditions de
reproduction. AUCUNE garantie n'est donn'ee; tant pour des raisons
COMMERCIALES que pour R'EPONDRE `A UN BESOIN PARTICULIER.
Libraries:
================================================================================
PHPINFO
================================================================================
phpinfo()
PHP Version => 7.3.26
System => Darwin Ace 20.2.0 Darwin Kernel Version 20.2.0: Wed Dec 2 20:39:59 PST 2020; root:xnu-7195.60.75~1/RELEASE_X86_64 x86_64
Build Date => Jan 15 2021 16:59:40
Configure Command => './configure' '--disable-cgi' '--disable-debug' '--disable-short-tags' '--enable-exif' '--enable-inline-optimization' '--enable-mbstring' '--enable-opcache=no' '--enable-pdo' '--enable-shared' '--enable-soap' '--enable-sockets' '--with-apxs2=/usr/local/apache2/bin/apxs' '--with-config-file-path=/etc' '--with-curl=/Applications/Xcode.app/Contents/Developer/Platforms/MacOSX.platform/Developer/SDKs/MacOSX.sdk/usr' '--with-gd' '--with-jpeg-dir=/Applications/Xcode.app/Contents/Developer/Platforms/MacOSX.platform/Developer/SDKs/MacOSX.sdk/usr' '--with-iconv=/opt/local' '--with-iconv-dir=/opt/local' '--with-kerberos' '--with-mhash' '--with-openssl' '--with-pear' '--with-pdo-mysql=mysqlnd' '--with-png-dir=/Applications/Xcode.app/Contents/Developer/Platforms/MacOSX.platform/Developer/SDKs/MacOSX.sdk/usr' '--with-mysqli' '--with-zlib=/Applications/Xcode.app/Contents/Developer/Platforms/MacOSX.platform/Developer/SDKs/MacOSX.sdk/usr' '--without-pdo-sqlite' '--without-sqlite3' '--without-xmlrpc'
Server API => Command Line Interface
Virtual Directory Support => enabled
Configuration File (php.ini) Path => /etc
Loaded Configuration File => /etc/php.ini
Scan this dir for additional .ini files => (none)
Additional .ini files parsed => (none)
PHP API => 20180731
PHP Extension => 20180731
Zend Extension => 320180731
Zend Extension Build => API320180731,TS
PHP Extension Build => API20180731,TS
Debug Build => no
Thread Safety => enabled
Thread API => POSIX Threads
Zend Signal Handling => enabled
Zend Memory Manager => enabled
Zend Multibyte Support => provided by mbstring
IPv6 Support => enabled
DTrace Support => disabled
Registered PHP Streams => https, ftps, compress.zlib, php, file, glob, data, http, ftp, phar
Registered Stream Socket Transports => tcp, udp, unix, udg, ssl, tls, tlsv1.0, tlsv1.1, tlsv1.2
Registered Stream Filters => zlib.*, convert.iconv.*, string.rot13, string.toupper, string.tolower, string.strip_tags, convert.*, consumed, dechunk
This program makes use of the Zend Scripting Language Engine:
Zend Engine v3.3.26, Copyright (c) 1998-2018 Zend Technologies
_______________________________________________________________________
Configuration
Core
PHP Version => 7.3.26
Directive => Local Value => Master Value
allow_url_fopen => On => On
allow_url_include => Off => Off
arg_separator.input => & => &
arg_separator.output => & => &
auto_append_file => no value => no value
auto_globals_jit => On => On
auto_prepend_file => no value => no value
browscap => /Users/GeoffC/php_full_browscap.ini => /Users/GeoffC/php_full_browscap.ini
default_charset => UTF-8 => UTF-8
default_mimetype => text/html => text/html
disable_classes => no value => no value
disable_functions => no value => no value
display_errors => STDERR => STDERR
display_startup_errors => On => On
doc_root => no value => no value
docref_ext => no value => no value
docref_root => no value => no value
enable_dl => Off => Off
enable_post_data_reading => On => On
error_append_string => no value => no value
error_log => no value => no value
error_prepend_string => no value => no value
error_reporting => 32767 => 32767
expose_php => On => On
extension_dir => /usr/local/lib/php/extensions/no-debug-zts-20180731 => /usr/local/lib/php/extensions/no-debug-zts-20180731
file_uploads => On => On
hard_timeout => 2 => 2
highlight.comment => <font style="color: #FF8000">#FF8000</font> => <font style="color: #FF8000">#FF8000</font>
highlight.default => <font style="color: #0000BB">#0000BB</font> => <font style="color: #0000BB">#0000BB</font>
highlight.html => <font style="color: #000000">#000000</font> => <font style="color: #000000">#000000</font>
highlight.keyword => <font style="color: #007700">#007700</font> => <font style="color: #007700">#007700</font>
highlight.string => <font style="color: #DD0000">#DD0000</font> => <font style="color: #DD0000">#DD0000</font>
html_errors => Off => Off
ignore_repeated_errors => Off => Off
ignore_repeated_source => Off => Off
ignore_user_abort => Off => Off
implicit_flush => On => On
include_path => .:/usr/local/lib/php => .:/usr/local/lib/php
input_encoding => no value => no value
internal_encoding => no value => no value
log_errors => Off => Off
log_errors_max_len => 1024 => 1024
mail.add_x_header => On => On
mail.force_extra_parameters => no value => no value
mail.log => no value => no value
max_execution_time => 0 => 0
max_file_uploads => 20 => 20
max_input_nesting_level => 64 => 64
max_input_time => -1 => -1
max_input_vars => 1500 => 1500
memory_limit => 128M => 128M
open_basedir => no value => no value
output_buffering => 0 => 0
output_encoding => no value => no value
output_handler => no value => no value
post_max_size => 8M => 8M
precision => 14 => 14
realpath_cache_size => 4096K => 4096K
realpath_cache_ttl => 120 => 120
register_argc_argv => On => On
report_memleaks => On => On
report_zend_debug => Off => Off
request_order => GP => GP
sendmail_from => no value => no value
sendmail_path => /usr/sbin/sendmail -t -i => /usr/sbin/sendmail -t -i
serialize_precision => 100 => 100
short_open_tag => Off => Off
SMTP => localhost => localhost
smtp_port => 25 => 25
sys_temp_dir => no value => no value
syslog.facility => LOG_USER => LOG_USER
syslog.filter => no-ctrl => no-ctrl
syslog.ident => php => php
track_errors => Off => Off
unserialize_callback_func => no value => no value
upload_max_filesize => 2M => 2M
upload_tmp_dir => no value => no value
user_dir => no value => no value
user_ini.cache_ttl => 300 => 300
user_ini.filename => .user.ini => .user.ini
variables_order => GPCS => GPCS
xmlrpc_error_number => 0 => 0
xmlrpc_errors => Off => Off
zend.assertions => 1 => 1
zend.detect_unicode => On => On
zend.enable_gc => On => On
zend.multibyte => Off => Off
zend.script_encoding => no value => no value
zend.signal_check => Off => Off
ctype
ctype functions => enabled
curl
cURL support => enabled
cURL Information => 7.64.1
Age => 4
Features
AsynchDNS => Yes
CharConv => No
Debug => No
GSS-Negotiate => No
IDN => No
IPv6 => Yes
krb4 => No
Largefile => Yes
libz => Yes
NTLM => Yes
NTLMWB => Yes
SPNEGO => Yes
SSL => Yes
SSPI => No
TLS-SRP => No
HTTP2 => Yes
GSSAPI => Yes
KERBEROS5 => Yes
UNIX_SOCKETS => Yes
PSL => No
HTTPS_PROXY => Yes
MULTI_SSL => Yes
BROTLI => No
Protocols => dict, file, ftp, ftps, gopher, http, https, imap, imaps, ldap, ldaps, pop3, pop3s, rtsp, smb, smbs, smtp, smtps, telnet, tftp
Host => x86_64-apple-darwin20.0
SSL Version => (SecureTransport) LibreSSL/2.8.3
ZLib Version => 1.2.11
Directive => Local Value => Master Value
curl.cainfo => no value => no value
date
date/time support => enabled
timelib version => 2018.04
"Olson" Timezone Database Version => 2020.4
Timezone Database => internal
Default timezone => Europe/London
Directive => Local Value => Master Value
date.default_latitude => 31.7667 => 31.7667
date.default_longitude => 35.2333 => 35.2333
date.sunrise_zenith => 90.583333 => 90.583333
date.sunset_zenith => 90.583333 => 90.583333
date.timezone => Europe/London => Europe/London
dom
DOM/XML => enabled
DOM/XML API Version => 20031129
libxml Version => 2.9.4
HTML Support => enabled
XPath Support => enabled
XPointer Support => enabled
Schema Support => enabled
RelaxNG Support => enabled
exif
EXIF Support => enabled
Supported EXIF Version => 0220
Supported filetypes => JPEG, TIFF
Multibyte decoding support using mbstring => enabled
Extended EXIF tag formats => Canon, Casio, Fujifilm, Nikon, Olympus, Samsung, Panasonic, DJI, Sony, Pentax, Minolta, Sigma, Foveon, Kyocera, Ricoh, AGFA, Epson
Directive => Local Value => Master Value
exif.decode_jis_intel => JIS => JIS
exif.decode_jis_motorola => JIS => JIS
exif.decode_unicode_intel => UCS-2LE => UCS-2LE
exif.decode_unicode_motorola => UCS-2BE => UCS-2BE
exif.encode_jis => no value => no value
exif.encode_unicode => ISO-8859-15 => ISO-8859-15
fileinfo
fileinfo support => enabled
libmagic => 533
filter
Input Validation and Filtering => enabled
Directive => Local Value => Master Value
filter.default => unsafe_raw => unsafe_raw
filter.default_flags => no value => no value
gd
GD Support => enabled
GD Version => bundled (2.1.0 compatible)
GIF Read Support => enabled
GIF Create Support => enabled
JPEG Support => enabled
libJPEG Version => 9 compatible
PNG Support => enabled
libPNG Version => 1.6.16
WBMP Support => enabled
XBM Support => enabled
Directive => Local Value => Master Value
gd.jpeg_ignore_warning => 1 => 1
hash
hash support => enabled
Hashing Engines => md2 md4 md5 sha1 sha224 sha256 sha384 sha512/224 sha512/256 sha512 sha3-224 sha3-256 sha3-384 sha3-512 ripemd128 ripemd160 ripemd256 ripemd320 whirlpool tiger128,3 tiger160,3 tiger192,3 tiger128,4 tiger160,4 tiger192,4 snefru snefru256 gost gost-crypto adler32 crc32 crc32b fnv132 fnv1a32 fnv164 fnv1a64 joaat haval128,3 haval160,3 haval192,3 haval224,3 haval256,3 haval128,4 haval160,4 haval192,4 haval224,4 haval256,4 haval128,5 haval160,5 haval192,5 haval224,5 haval256,5
MHASH support => Enabled
MHASH API Version => Emulated Support
iconv
iconv support => enabled
iconv implementation => libiconv
iconv library version => 1.16
Directive => Local Value => Master Value
iconv.input_encoding => no value => no value
iconv.internal_encoding => no value => no value
iconv.output_encoding => no value => no value
json
json support => enabled
json version => 1.7.0
libxml
libXML support => active
libXML Compiled Version => 2.9.4
libXML Loaded Version => 20904
libXML streams => enabled
mbstring
Multibyte Support => enabled
Multibyte string engine => libmbfl
HTTP input encoding translation => disabled
libmbfl version => 1.3.2
oniguruma version => 6.9.4
mbstring extension makes use of "streamable kanji code filter and converter", which is distributed under the GNU Lesser General Public License version 2.1.
Multibyte (japanese) regex support => enabled
Multibyte regex (oniguruma) backtrack check => On
Multibyte regex (oniguruma) version => 6.9.4
Directive => Local Value => Master Value
mbstring.detect_order => no value => no value
mbstring.encoding_translation => Off => Off
mbstring.func_overload => 0 => 0
mbstring.http_input => no value => no value
mbstring.http_output => no value => no value
mbstring.http_output_conv_mimetypes => ^(text/|application/xhtml\+xml) => ^(text/|application/xhtml\+xml)
mbstring.internal_encoding => no value => no value
mbstring.language => neutral => neutral
mbstring.regex_stack_limit => 100000 => 100000
mbstring.strict_detection => Off => Off
mbstring.substitute_character => no value => no value
mysqli
MysqlI Support => enabled
Client API library version => mysqlnd 5.0.12-dev - 20150407 - $Id: 7cc7cc96e675f6d72e5cf0f267f48e167c2abb23 $
Active Persistent Links => 0
Inactive Persistent Links => 0
Active Links => 0
Directive => Local Value => Master Value
mysqli.allow_local_infile => Off => Off
mysqli.allow_persistent => On => On
mysqli.default_host => no value => no value
mysqli.default_port => 3306 => 3306
mysqli.default_pw => no value => no value
mysqli.default_socket => no value => no value
mysqli.default_user => no value => no value
mysqli.max_links => Unlimited => Unlimited
mysqli.max_persistent => Unlimited => Unlimited
mysqli.reconnect => Off => Off
mysqli.rollback_on_cached_plink => Off => Off
mysqlnd
mysqlnd => enabled
Version => mysqlnd 5.0.12-dev - 20150407 - $Id: 7cc7cc96e675f6d72e5cf0f267f48e167c2abb23 $
Compression => supported
core SSL => supported
extended SSL => supported
Command buffer size => 4096
Read buffer size => 32768
Read timeout => 86400
Collecting statistics => Yes
Collecting memory statistics => No
Tracing => n/a
Loaded plugins => mysqlnd,debug_trace,auth_plugin_mysql_native_password,auth_plugin_mysql_clear_password,auth_plugin_sha256_password
API Extensions => pdo_mysql,mysqli
mysqlnd statistics =>
bytes_sent => 0
bytes_received => 0
packets_sent => 0
packets_received => 0
protocol_overhead_in => 0
protocol_overhead_out => 0
bytes_received_ok_packet => 0
bytes_received_eof_packet => 0
bytes_received_rset_header_packet => 0
bytes_received_rset_field_meta_packet => 0
bytes_received_rset_row_packet => 0
bytes_received_prepare_response_packet => 0
bytes_received_change_user_packet => 0
packets_sent_command => 0
packets_received_ok => 0
packets_received_eof => 0
packets_received_rset_header => 0
packets_received_rset_field_meta => 0
packets_received_rset_row => 0
packets_received_prepare_response => 0
packets_received_change_user => 0
result_set_queries => 0
non_result_set_queries => 0
no_index_used => 0
bad_index_used => 0
slow_queries => 0
buffered_sets => 0
unbuffered_sets => 0
ps_buffered_sets => 0
ps_unbuffered_sets => 0
flushed_normal_sets => 0
flushed_ps_sets => 0
ps_prepared_never_executed => 0
ps_prepared_once_executed => 0
rows_fetched_from_server_normal => 0
rows_fetched_from_server_ps => 0
rows_buffered_from_client_normal => 0
rows_buffered_from_client_ps => 0
rows_fetched_from_client_normal_buffered => 0
rows_fetched_from_client_normal_unbuffered => 0
rows_fetched_from_client_ps_buffered => 0
rows_fetched_from_client_ps_unbuffered => 0
rows_fetched_from_client_ps_cursor => 0
rows_affected_normal => 0
rows_affected_ps => 0
rows_skipped_normal => 0
rows_skipped_ps => 0
copy_on_write_saved => 0
copy_on_write_performed => 0
command_buffer_too_small => 0
connect_success => 0
connect_failure => 0
connection_reused => 0
reconnect => 0
pconnect_success => 0
active_connections => 0
active_persistent_connections => 0
explicit_close => 0
implicit_close => 0
disconnect_close => 0
in_middle_of_command_close => 0
explicit_free_result => 0
implicit_free_result => 0
explicit_stmt_close => 0
implicit_stmt_close => 0
mem_emalloc_count => 0
mem_emalloc_amount => 0
mem_ecalloc_count => 0
mem_ecalloc_amount => 0
mem_erealloc_count => 0
mem_erealloc_amount => 0
mem_efree_count => 0
mem_efree_amount => 0
mem_malloc_count => 0
mem_malloc_amount => 0
mem_calloc_count => 0
mem_calloc_amount => 0
mem_realloc_count => 0
mem_realloc_amount => 0
mem_free_count => 0
mem_free_amount => 0
mem_estrndup_count => 0
mem_strndup_count => 0
mem_estrdup_count => 0
mem_strdup_count => 0
mem_edupl_count => 0
mem_dupl_count => 0
proto_text_fetched_null => 0
proto_text_fetched_bit => 0
proto_text_fetched_tinyint => 0
proto_text_fetched_short => 0
proto_text_fetched_int24 => 0
proto_text_fetched_int => 0
proto_text_fetched_bigint => 0
proto_text_fetched_decimal => 0
proto_text_fetched_float => 0
proto_text_fetched_double => 0
proto_text_fetched_date => 0
proto_text_fetched_year => 0
proto_text_fetched_time => 0
proto_text_fetched_datetime => 0
proto_text_fetched_timestamp => 0
proto_text_fetched_string => 0
proto_text_fetched_blob => 0
proto_text_fetched_enum => 0
proto_text_fetched_set => 0
proto_text_fetched_geometry => 0
proto_text_fetched_other => 0
proto_binary_fetched_null => 0
proto_binary_fetched_bit => 0
proto_binary_fetched_tinyint => 0
proto_binary_fetched_short => 0
proto_binary_fetched_int24 => 0
proto_binary_fetched_int => 0
proto_binary_fetched_bigint => 0
proto_binary_fetched_decimal => 0
proto_binary_fetched_float => 0
proto_binary_fetched_double => 0
proto_binary_fetched_date => 0
proto_binary_fetched_year => 0
proto_binary_fetched_time => 0
proto_binary_fetched_datetime => 0
proto_binary_fetched_timestamp => 0
proto_binary_fetched_string => 0
proto_binary_fetched_json => 0
proto_binary_fetched_blob => 0
proto_binary_fetched_enum => 0
proto_binary_fetched_set => 0
proto_binary_fetched_geometry => 0
proto_binary_fetched_other => 0
init_command_executed_count => 0
init_command_failed_count => 0
com_quit => 0
com_init_db => 0
com_query => 0
com_field_list => 0
com_create_db => 0
com_drop_db => 0
com_refresh => 0
com_shutdown => 0
com_statistics => 0
com_process_info => 0
com_connect => 0
com_process_kill => 0
com_debug => 0
com_ping => 0
com_time => 0
com_delayed_insert => 0
com_change_user => 0
com_binlog_dump => 0
com_table_dump => 0
com_connect_out => 0
com_register_slave => 0
com_stmt_prepare => 0
com_stmt_execute => 0
com_stmt_send_long_data => 0
com_stmt_close => 0
com_stmt_reset => 0
com_stmt_set_option => 0
com_stmt_fetch => 0
com_deamon => 0
bytes_received_real_data_normal => 0
bytes_received_real_data_ps => 0
openssl
OpenSSL support => enabled
OpenSSL Library Version => OpenSSL 1.1.1d 10 Sep 2019
OpenSSL Header Version => OpenSSL 1.1.1d 10 Sep 2019
Openssl default config => /usr/local/ssl/openssl.cnf
Directive => Local Value => Master Value
openssl.cafile => no value => no value
openssl.capath => no value => no value
pcre
PCRE (Perl Compatible Regular Expressions) Support => enabled
PCRE Library Version => 10.32 2018-09-10
PCRE Unicode Version => 11.0.0
PCRE JIT Support => enabled
PCRE JIT Target => x86 64bit (little endian + unaligned)
Directive => Local Value => Master Value
pcre.backtrack_limit => 1000000 => 1000000
pcre.jit => 1 => 1
pcre.recursion_limit => 100000 => 100000
PDO
PDO support => enabled
PDO drivers => mysql
pdo_mysql
PDO Driver for MySQL => enabled
Client API version => mysqlnd 5.0.12-dev - 20150407 - $Id: 7cc7cc96e675f6d72e5cf0f267f48e167c2abb23 $
Directive => Local Value => Master Value
pdo_mysql.default_socket => /tmp/mysql.sock => /tmp/mysql.sock
Phar
Phar: PHP Archive support => enabled
Phar API version => 1.1.1
Phar-based phar archives => enabled
Tar-based phar archives => enabled
ZIP-based phar archives => enabled
gzip compression => enabled
bzip2 compression => disabled (install ext/bz2)
Native OpenSSL support => enabled
Phar based on pear/PHP_Archive, original concept by Davey Shafik.
Phar fully realized by Gregory Beaver and Marcus Boerger.
Portions of tar implementation Copyright (c) 2003-2009 Tim Kientzle.
Directive => Local Value => Master Value
phar.cache_list => no value => no value
phar.readonly => On => On
phar.require_hash => On => On
posix
POSIX support => enabled
Reflection
Reflection => enabled
session
Session Support => enabled
Registered save handlers => files user
Registered serializer handlers => php_serialize php php_binary
Directive => Local Value => Master Value
session.auto_start => Off => Off
session.cache_expire => 180 => 180
session.cache_limiter => nocache => nocache
session.cookie_domain => no value => no value
session.cookie_httponly => no value => no value
session.cookie_lifetime => 0 => 0
session.cookie_path => / => /
session.cookie_samesite => no value => no value
session.cookie_secure => 0 => 0
session.gc_divisor => 1000 => 1000
session.gc_maxlifetime => 1440 => 1440
session.gc_probability => 1 => 1
session.lazy_write => On => On
session.name => PHPSESSID => PHPSESSID
session.referer_check => no value => no value
session.save_handler => files => files
session.save_path => no value => no value
session.serialize_handler => php => php
session.sid_bits_per_character => 4 => 4
session.sid_length => 32 => 32
session.upload_progress.cleanup => On => On
session.upload_progress.enabled => On => On
session.upload_progress.freq => 1% => 1%
session.upload_progress.min_freq => 1 => 1
session.upload_progress.name => PHP_SESSION_UPLOAD_PROGRESS => PHP_SESSION_UPLOAD_PROGRESS
session.upload_progress.prefix => upload_progress_ => upload_progress_
session.use_cookies => 1 => 1
session.use_only_cookies => 1 => 1
session.use_strict_mode => 0 => 0
session.use_trans_sid => 0 => 0
SimpleXML
SimpleXML support => enabled
Schema support => enabled
soap
Soap Client => enabled
Soap Server => enabled
Directive => Local Value => Master Value
soap.wsdl_cache => 2 => 2
soap.wsdl_cache_dir => /tmp => /tmp
soap.wsdl_cache_enabled => 1 => 1
soap.wsdl_cache_limit => 5 => 5
soap.wsdl_cache_ttl => 86400 => 86400
sockets
Sockets Support => enabled
SPL
SPL support => enabled
Interfaces => OuterIterator, RecursiveIterator, SeekableIterator, SplObserver, SplSubject
Classes => AppendIterator, ArrayIterator, ArrayObject, BadFunctionCallException, BadMethodCallException, CachingIterator, CallbackFilterIterator, DirectoryIterator, DomainException, EmptyIterator, FilesystemIterator, FilterIterator, GlobIterator, InfiniteIterator, InvalidArgumentException, IteratorIterator, LengthException, LimitIterator, LogicException, MultipleIterator, NoRewindIterator, OutOfBoundsException, OutOfRangeException, OverflowException, ParentIterator, RangeException, RecursiveArrayIterator, RecursiveCachingIterator, RecursiveCallbackFilterIterator, RecursiveDirectoryIterator, RecursiveFilterIterator, RecursiveIteratorIterator, RecursiveRegexIterator, RecursiveTreeIterator, RegexIterator, RuntimeException, SplDoublyLinkedList, SplFileInfo, SplFileObject, SplFixedArray, SplHeap, SplMinHeap, SplMaxHeap, SplObjectStorage, SplPriorityQueue, SplQueue, SplStack, SplTempFileObject, UnderflowException, UnexpectedValueException
standard
Dynamic Library Support => enabled
Path to sendmail => /usr/sbin/sendmail -t -i
Directive => Local Value => Master Value
assert.active => 1 => 1
assert.bail => 0 => 0
assert.callback => no value => no value
assert.exception => 0 => 0
assert.quiet_eval => 0 => 0
assert.warning => 1 => 1
auto_detect_line_endings => 0 => 0
default_socket_timeout => 60 => 60
from => no value => no value
session.trans_sid_hosts => no value => no value
session.trans_sid_tags => a=href,area=href,frame=src,form= => a=href,area=href,frame=src,form=
url_rewriter.hosts => no value => no value
url_rewriter.tags => a=href,area=href,frame=src,input=src,form=fakeentry => a=href,area=href,frame=src,input=src,form=fakeentry
user_agent => no value => no value
tokenizer
Tokenizer Support => enabled
xml
XML Support => active
XML Namespace Support => active
libxml2 Version => 2.9.4
xmlreader
XMLReader => enabled
xmlwriter
XMLWriter => enabled
zlib
ZLib Support => enabled
Stream Wrapper => compress.zlib://
Stream Filter => zlib.inflate, zlib.deflate
Compiled Version => 1.2.11
Linked Version => 1.2.11
Directive => Local Value => Master Value
zlib.output_compression => Off => Off
zlib.output_compression_level => -1 => -1
zlib.output_handler => no value => no value
Additional Modules
Module Name
Environment
Variable => Value
TERM_PROGRAM => Apple_Terminal
TEST_PHP_SRCDIR => /Users/GeoffC/php-7.3.26
SHELL => /bin/zsh
TERM => xterm-256color
MAKEFLAGS =>
HISTSIZE => 1000
SSH_CLIENT => deleted
TMPDIR => /var/folders/lf/cw4qnlbd06378jvw1kvf9lcr0000gn/T/
TEST_PHPDBG_EXECUTABLE => /Users/GeoffC/php-7.3.26/sapi/phpdbg/phpdbg
TERM_PROGRAM_VERSION => 440
OLDPWD => /Users/GeoffC/php-7.3.26
TERM_SESSION_ID => 2991DFBA-89CB-41D9-8E73-0A51E6B9D27D
SSH_TTY => deleted
HISTFILESIZE => 1000
USER => GeoffC
SSH_AUTH_SOCK => deleted
__CF_USER_TEXT_ENCODING => 0x1F5:0x0:0x1
MAKELEVEL => 1
MFLAGS =>
PATH => /opt/local/bin:/usr/local/bin:/usr/bin:/bin:/usr/sbin:/sbin:/opt/X11/bin:/Library/Apple/usr/bin
__CFBundleIdentifier => com.apple.Terminal
PWD => /Users/GeoffC/php-7.3.26
TEST_PHP_EXECUTABLE => /Users/GeoffC/php-7.3.26/sapi/cli/php
XPC_FLAGS => 0x0
XPC_SERVICE_NAME => 0
HOME => /Users/GeoffC
SHLVL => 3
LOGNAME => GeoffC
SSH_CONNECTION => deleted
LC_CTYPE => UTF-8
DISPLAY => /private/tmp/com.apple.launchd.z2pwYtjcnY/org.macosforge.xquartz:0
CC => cc
_ => /Users/GeoffC/php-7.3.26/sapi/cli/php
PHP Variables
Variable => Value
$_SERVER['TERM_PROGRAM'] => Apple_Terminal
$_SERVER['TEST_PHP_SRCDIR'] => /Users/GeoffC/php-7.3.26
$_SERVER['SHELL'] => /bin/zsh
$_SERVER['TERM'] => xterm-256color
$_SERVER['MAKEFLAGS'] =>
$_SERVER['HISTSIZE'] => 1000
$_SERVER['SSH_CLIENT'] => deleted
$_SERVER['TMPDIR'] => /var/folders/lf/cw4qnlbd06378jvw1kvf9lcr0000gn/T/
$_SERVER['TEST_PHPDBG_EXECUTABLE'] => /Users/GeoffC/php-7.3.26/sapi/phpdbg/phpdbg
$_SERVER['TERM_PROGRAM_VERSION'] => 440
$_SERVER['OLDPWD'] => /Users/GeoffC/php-7.3.26
$_SERVER['TERM_SESSION_ID'] => 2991DFBA-89CB-41D9-8E73-0A51E6B9D27D
$_SERVER['SSH_TTY'] => deleted
$_SERVER['HISTFILESIZE'] => 1000
$_SERVER['USER'] => GeoffC
$_SERVER['SSH_AUTH_SOCK'] => deleted
$_SERVER['__CF_USER_TEXT_ENCODING'] => 0x1F5:0x0:0x1
$_SERVER['MAKELEVEL'] => 1
$_SERVER['MFLAGS'] =>
$_SERVER['PATH'] => /opt/local/bin:/usr/local/bin:/usr/bin:/bin:/usr/sbin:/sbin:/opt/X11/bin:/Library/Apple/usr/bin
$_SERVER['__CFBundleIdentifier'] => com.apple.Terminal
$_SERVER['PWD'] => /Users/GeoffC/php-7.3.26
$_SERVER['TEST_PHP_EXECUTABLE'] => /Users/GeoffC/php-7.3.26/sapi/cli/php
$_SERVER['XPC_FLAGS'] => 0x0
$_SERVER['XPC_SERVICE_NAME'] => 0
$_SERVER['HOME'] => /Users/GeoffC
$_SERVER['SHLVL'] => 3
$_SERVER['LOGNAME'] => GeoffC
$_SERVER['SSH_CONNECTION'] => deleted
$_SERVER['LC_CTYPE'] => UTF-8
$_SERVER['DISPLAY'] => /private/tmp/com.apple.launchd.z2pwYtjcnY/org.macosforge.xquartz:0
$_SERVER['CC'] => cc
$_SERVER['_'] => /Users/GeoffC/php-7.3.26/sapi/cli/php
$_SERVER['PHP_SELF'] =>
$_SERVER['SCRIPT_NAME'] =>
$_SERVER['SCRIPT_FILENAME'] =>
$_SERVER['PATH_TRANSLATED'] =>
$_SERVER['DOCUMENT_ROOT'] =>
$_SERVER['REQUEST_TIME_FLOAT'] => 1610810039.4281
$_SERVER['REQUEST_TIME'] => 1610810039
$_SERVER['argv'] => Array
(
)
$_SERVER['argc'] => 0
PHP License
This program is free software; you can redistribute it and/or modify
it under the terms of the PHP License as published by the PHP Group
and included in the distribution in the file: LICENSE
This program is distributed in the hope that it will be useful,
but WITHOUT ANY WARRANTY; without even the implied warranty of
MERCHANTABILITY or FITNESS FOR A PARTICULAR PURPOSE.
If you did not receive a copy of the PHP license, or have any
questions about PHP licensing, please contact license@php.net.