Test results [failed]

From: Date: Fri, 14 Mar 2003 15:13:46 +0000
Subject: Test results [failed]
Groups: php.qa 
Request: Send a blank email to php-qa+get-10068@lists.php.net to get a copy of this message
===================================================================== FAILED TEST SUMMARY --------------------------------------------------------------------- Error message handling (without ZendOptimizer) [tests/run-test/test005.phpt] Testing register_shutdown_function() with timeout. (Bug: #21513) [tests/func/005a.phpt] Bug #22367 (weird zval allocation problem) [tests/lang/bug22367.phpt] Bug #22510 (segfault among complex references) [tests/lang/bug22510.phpt] implode() function [ext/standard/tests/strings/implode.phpt] ===================================================================== ===================================================================== TEST RESULT SUMMARY --------------------------------------------------------------------- Exts skipped : 53 Exts tested : 36 --------------------------------------------------------------------- Number of tests : 470 Tests skipped : 134 (28.5%) Tests failed : 5 ( 1.1%) Tests passed : 331 (70.4%) --------------------------------------------------------------------- Time taken : 188 seconds ===================================================================== ================================================================================ /dat/dev/php/php-4.3.2RC1/tests/run-test/test005.phpt ================================================================================ ---- EXPECTED OUTPUT string(1) "1" string(4) "2047" string(1) "0" string(1) "1" string(1) "0" NULL string(%d) "%sivision by zer%s" ---- ACTUAL OUTPUT string(1) "1" string(4) "2047" string(1) "0" string(1) "1" string(1) "0" Notice: Undefined variable: php_errormsg in /dat/dev/php/php-4.3.2RC1/tests/run-test/test005.php on line 14 Call Stack: 0.0000 20336 1. {main}() /dat/dev/php/php-4.3.2RC1/tests/run-test/test005.php:0 NULL Warning: Division by zero in /dat/dev/php/php-4.3.2RC1/tests/run-test/test005.php on line 15 Call Stack: 0.0000 20336 1. {main}() /dat/dev/php/php-4.3.2RC1/tests/run-test/test005.php:0 Notice: Undefined variable: php_errormsg in /dat/dev/php/php-4.3.2RC1/tests/run-test/test005.php on line 16 Call Stack: 0.0000 20336 1. {main}() /dat/dev/php/php-4.3.2RC1/tests/run-test/test005.php:0 NULL ---- FAILED ================================================================================ 006- NULL 006+ 007- string(%d) "%sivision by zer%s" 007+ Notice: Undefined variable: php_errormsg in /dat/dev/php/php-4.3.2RC1/tests/run-test/test005.php on line 14 008+ 009+ Call Stack: 010+ 0.0000 20336 1. {main}() /dat/dev/php/php-4.3.2RC1/tests/run-test/test005.php:0 011+ NULL 012+ 013+ Warning: Division by zero in /dat/dev/php/php-4.3.2RC1/tests/run-test/test005.php on line 15 014+ 015+ Call Stack: 016+ 0.0000 20336 1. {main}() /dat/dev/php/php-4.3.2RC1/tests/run-test/test005.php:0 017+ 018+ Notice: Undefined variable: php_errormsg in /dat/dev/php/php-4.3.2RC1/tests/run-test/test005.php on line 16 019+ 020+ Call Stack: 021+ 0.0000 20336 1. {main}() /dat/dev/php/php-4.3.2RC1/tests/run-test/test005.php:0 022+ NULL ================================================================================ ================================================================================ /dat/dev/php/php-4.3.2RC1/tests/func/005a.phpt ================================================================================ ---- EXPECTED OUTPUT Start Shutdown ---- ACTUAL OUTPUT Start Fatal error: Maximum execution time of 1 second exceeded in /dat/dev/php/php-4.3.2RC1/tests/func/005a.php on line 18 Call Stack: 0.0000 17992 1. {main}() /dat/dev/php/php-4.3.2RC1/tests/func/005a.php:0 Shutdown ---- FAILED ================================================================================ 002- Shutdown 002+ 003+ Fatal error: Maximum execution time of 1 second exceeded in /dat/dev/php/php-4.3.2RC1/tests/func/005a.php on line 18 004+ 005+ Call Stack: 006+ 0.0000 17992 1. {main}() /dat/dev/php/php-4.3.2RC1/tests/func/005a.php:0 007+ Shutdown ================================================================================ ================================================================================ /dat/dev/php/php-4.3.2RC1/tests/lang/bug22367.phpt ================================================================================ ---- EXPECTED OUTPUT int(5) bool(false) bool(false) array(5) { [0]=> int(0) [1]=> int(1) [2]=> int(2) [3]=> int(3) [4]=> int(4) } array(5) { [0]=> int(0) [1]=> int(1) [2]=> int(2) [3]=> int(3) [4]=> int(4) } int(2) bool(true) bool(true) array(5) { [0]=> int(0) [1]=> int(1) [2]=> int(2) [3]=> int(3) [4]=> int(4) } array(5) { [0]=> int(0) [1]=> int(1) [2]=> int(2) [3]=> int(3) [4]=> int(4) } ---- ACTUAL OUTPUT int(5) bool(false) bool(false) array(5) { [0]=> int(4) [1]=> int(4) [2]=> int(4) [3]=> int(4) [4]=> int(4) } array(5) { [0]=> int(0) [1]=> int(1) [2]=> int(2) [3]=> int(3) [4]=> int(4) } int(2) bool(true) bool(true) array(5) { [0]=> int(0) [1]=> int(1) [2]=> int(2) [3]=> int(3) [4]=> int(4) } array(5) { [0]=> int(0) [1]=> int(1) [2]=> &int(2) [3]=> int(3) [4]=> int(4) } /dat/dev/php/php-4.3.2RC1/Zend/zend_execute.c(1702) : Freeing 0x083C23CC (12 bytes), script=/dat/dev/php/php-4.3.2RC1/tests/lang/bug22367.php Last leak repeated 1 time ---- FAILED ================================================================================ 006- int(0) 006+ int(4) 008- int(1) 008+ int(4) 010- int(2) 010+ int(4) 012- int(3) 012+ int(4) 049- int(2) 049+ &int(2) 055+ /dat/dev/php/php-4.3.2RC1/Zend/zend_execute.c(1702) : Freeing 0x083C23CC (12 bytes), script=/dat/dev/php/php-4.3.2RC1/tests/lang/bug22367.php 056+ Last leak repeated 1 time ================================================================================ ================================================================================ /dat/dev/php/php-4.3.2RC1/tests/lang/bug22510.phpt ================================================================================ ---- EXPECTED OUTPUT ok1 bar::run1 foo::method1 foo::method1 foo::finalize done! ok2 bar::run2 foo::method2 foo::method2 foo::finalize done! ok3 bar::run3 foo::method3 foo::method3 foo::finalize done! ouch bar::run1 foo::method1 foo::method1 foo::finalize I'm alive! ---- ACTUAL OUTPUT ok1 bar::run1 foo::method1 foo::method1 foo::finalize done! ok2 bar::run2 foo::method2 foo::method2 foo::finalize done! ok3 bar::run3 foo::method3 foo::method3 foo::finalize done! ouch bar::run1 foo::method1 foo::method1 foo::finalize [Fri Mar 14 16:10:53 2003] Script: '/dat/dev/php/php-4.3.2RC1/tests/lang/bug22510.php' --------------------------------------- /dat/dev/php/php-4.3.2RC1/Zend/zend_execute.c(271) : Block 0x082FD360 status: Beginning: Overrun (magic=0x00000000, expected=0x7312F8DC) ---- FAILED ================================================================================ 024- I'm alive! 024+ [Fri Mar 14 16:10:53 2003] Script: '/dat/dev/php/php-4.3.2RC1/tests/lang/bug22510.php' 025+ --------------------------------------- 026+ /dat/dev/php/php-4.3.2RC1/Zend/zend_execute.c(271) : Block 0x082FD360 status: 027+ Beginning: Overrun (magic=0x00000000, expected=0x7312F8DC) ================================================================================ ================================================================================ /dat/dev/php/php-4.3.2RC1/ext/standard/tests/strings/implode.phpt ================================================================================ ---- EXPECTED OUTPUT foobarbaz foo:bar:baz foo:Array:burp Array to string conversion ---- ACTUAL OUTPUT foobarbaz foo:bar:baz Notice: Array to string conversion in /dat/dev/php/php-4.3.2RC1/ext/standard/tests/strings/implode.php on line 6 Call Stack: 0.0000 19712 1. {main}() /dat/dev/php/php-4.3.2RC1/ext/standard/tests/strings/implode.php:0 0.0015 20176 2. implode(':', array (0 => 'foo', 1 => array (0 => 'bar', 1 => 'baz'), 2 => 'burp')) /dat/dev/php/php-4.3.2RC1/ext/standard/tests/strings/implode.php:6 foo:Array:burp Notice: Undefined variable: php_errormsg in /dat/dev/php/php-4.3.2RC1/ext/standard/tests/strings/implode.php on line 7 Call Stack: 0.0000 19712 1. {main}() /dat/dev/php/php-4.3.2RC1/ext/standard/tests/strings/implode.php:0 ---- FAILED ================================================================================ 003- foo:Array:burp 003+ 004- Array to string conversion 004+ Notice: Array to string conversion in /dat/dev/php/php-4.3.2RC1/ext/standard/tests/strings/implode.php on line 6 005+ 006+ Call Stack: 007+ 0.0000 19712 1. {main}() /dat/dev/php/php-4.3.2RC1/ext/standard/tests/strings/implode.php:0 008+ 0.0015 20176 2. implode(':', array (0 => 'foo', 1 => array (0 => 'bar', 1 => 'baz'), 2 => 'burp')) /dat/dev/php/php-4.3.2RC1/ext/standard/tests/strings/implode.php:6 009+ foo:Array:burp 010+ 011+ Notice: Undefined variable: php_errormsg in /dat/dev/php/php-4.3.2RC1/ext/standard/tests/strings/implode.php on line 7 012+ 013+ Call Stack: 014+ 0.0000 19712 1. {main}() /dat/dev/php/php-4.3.2RC1/ext/standard/tests/strings/implode.php:0 ================================================================================ ================================================================================ BUILD ENVIRONMENT ================================================================================ OS: Linux Automake: automake (GNU automake) 1.5 Written by Tom Tromey <tromey@cygnus.com>. Copyright 1994, 1995, 1996, 1997, 1998, 1999, 2000, 2001 Free Software Foundation, Inc. This is free software; see the source for copying conditions. There is NO warranty; not even for MERCHANTABILITY or FITNESS FOR A PARTICULAR PURPOSE. Autoconf: Autoconf version 2.13 Libtool: ltmain.sh (GNU libtool) 1.4.3 (1.922.2.110 2002/10/23 01:39:54) Compiler: Reading specs from /usr/lib/gcc-lib/i386-redhat-linux/2.96/specs gcc version 2.96 20000731 (Red Hat Linux 7.1 2.96-85) Bison: GNU Bison version 1.28 User's E-mail: ================================================================================ PHPINFO ================================================================================ phpinfo() PHP Version => 4.3.2-RC1 System => Linux kossu.office.jdimedia.nl 2.4.18 #15 Fri Jun 14 13:27:20 CEST 2002 i686 Build Date => Mar 13 2003 15:03:16 Configure Command => './configure' '--with-apache=/dat/dev/php/apache_1.3.27' '--with-gd' '--enable-dbx' '--with-ttf' '--with-mysql' '--with-pdflib=/usr' '--with-config-file-path=/etc/httpd' '--enable-track-vars' '--enable-memory-limit' '--enable-ftp' '--with-mcrypt' '--with-curl' '--enable-curl' '--with-ctype' '--with-gmp' '--with-ldap' '--with-bz2' '--enable-debug' '--with-iconv' '--with-ncurses' '--enable-exif' '--with-xmlrpc' '--enable-shmop' '--enable-sysvsem' '--enable-sysvsem' '--enable-sysvshm' '--enable-wddx' '--with-zlib' '--with-db3' '--with-zip' '--enable-zip' '--with-dom' '--with-openssl' '--enable-mbstring' '--enable-libedit' '--with-ming' '--enable-bcmath' '--with-snmp' '--with-jpeg-dir=/usr' '--with-xpm-dir=/usr' '--enable-xlst' '--with-xslt-sablot' Server API => Command Line Interface Virtual Directory Support => disabled Configuration File (php.ini) Path => /etc/httpd/php.ini PHP API => 20020918 PHP Extension => 20020429 Zend Extension => 20021010 Debug Build => yes Thread Safety => disabled Registered PHP Streams => php, http, ftp, https, ftps, compress.bzip2, compress.zlib This program makes use of the Zend Scripting Language Engine: Zend Engine v1.3.0, Copyright (c) 1998-2003 Zend Technologies<br />&nbsp;&nbsp;&nbsp;&nbsp;with eXtended Debugger (xdebug) v1.2.0dev, Copyright (c) 2002 JDI Media Solutions, by Derick Rethans<br /> _______________________________________________________________________ Configuration PHP Core Directive => Local Value => Master Value allow_call_time_pass_reference => On => On allow_url_fopen => On => On always_populate_raw_post_data => Off => Off arg_separator.input => &amp; => &amp; arg_separator.output => &amp; => &amp; asp_tags => Off => Off auto_append_file => no value => no value auto_prepend_file => no value => no value browscap => no value => no value default_charset => no value => no value default_mimetype => text/html => text/html define_syslog_variables => Off => Off disable_classes => no value => no value disable_functions => no value => no value display_errors => On => On display_startup_errors => Off => Off doc_root => no value => no value docref_ext => no value => no value docref_root => http://www.php.net/ => http://www.php.net/ enable_dl => On => On error_append_string => no value => no value error_log => /var/log/zend-errors => /var/log/zend-errors error_prepend_string => no value => no value error_reporting => 2047 => 2047 expose_php => On => On extension_dir => /usr/local/lib/php/extensions/debug-non-zts-20020429 => /usr/local/lib/php/extensions/debug-non-zts-20020429 file_uploads => On => On gpc_order => GPC => GPC highlight.bg => #FFFFFF => #FFFFFF highlight.comment => #FF8000 => #FF8000 highlight.default => #0000BB => #0000BB highlight.html => #000000 => #000000 highlight.keyword => #007700 => #007700 highlight.string => #DD0000 => #DD0000 html_errors => Off => On ignore_repeated_errors => Off => Off ignore_repeated_source => Off => Off ignore_user_abort => On => On implicit_flush => On => Off include_path => .:/usr/local/lib/php => .:/usr/local/lib/php log_errors => On => On log_errors_max_len => 1024 => 1024 magic_quotes_gpc => Off => Off magic_quotes_runtime => Off => Off magic_quotes_sybase => Off => Off max_execution_time => 0 => 0 max_input_time => -1 => -1 memory_limit => 640000000 => 640000000 open_basedir => no value => no value output_buffering => no value => no value output_handler => no value => no value post_max_size => 8M => 8M precision => 14 => 14 register_argc_argv => On => On register_globals => Off => Off report_memleaks => On => On safe_mode => Off => Off safe_mode_exec_dir => no value => no value safe_mode_gid => Off => Off safe_mode_include_dir => no value => no value sendmail_from => no value => no value sendmail_path => /usr/sbin/sendmail -t -i => /usr/sbin/sendmail -t -i short_open_tag => Off => Off SMTP => localhost => localhost smtp_port => 25 => 25 sql.safe_mode => Off => Off track_errors => Off => Off unserialize_callback_func => no value => no value upload_max_filesize => 2M => 2M upload_tmp_dir => no value => no value user_dir => no value => no value variables_order => no value => no value xmlrpc_error_number => 0 => 0 xmlrpc_errors => Off => Off y2k_compliance => On => On bcmath BCMath support => enabled bz2 BZip2 Support => Enabled BZip2 Version => 1.0.1, 23-June-2000 ctype ctype functions => enabled curl CURL support => enabled CURL Information => libcurl/7.10.2 OpenSSL/0.9.6 zlib/1.1.3 dba DBA support => enabled Supported handlers => db3 dbx dbx support => enabled dbx version => 1.0.0 supported databases => MySQL ODBC PostgreSQL Microsoft SQL Server FrontBase Oracle 8 (oci8) Sybase-CT Directive => Local Value => Master Value dbx.colnames_case => unchanged => unchanged domxml DOM/XML => enabled DOM/XML API Version => 20020814 libxml Version => 20416 HTML Support => enabled XPath Support => enabled XPointer Support => enabled exif EXIF Support => enabled EXIF Version => 1.4 $Id: exif.c,v 1.118.2.13 2002/12/31 16:34:27 sebastian Exp $ Supported EXIF Version => 0220 Supported filetypes => JPEG,TIFF ftp FTP support => enabled gd GD Support => enabled GD Version => bundled (2.0.11 compatible) FreeType Support => enabled FreeType Linkage => with TTF library GIF Read Support => enabled JPG Support => enabled PNG Support => enabled WBMP Support => enabled XBM Support => enabled gmp gmp support => enabled iconv iconv support => enabled iconv implementation => glibc iconv library version => 2.2.4 Directive => Local Value => Master Value iconv.input_encoding => ISO-8859-1 => ISO-8859-1 iconv.internal_encoding => ISO-8859-1 => ISO-8859-1 iconv.output_encoding => ISO-8859-1 => ISO-8859-1 ldap LDAP Support => enabled RCS Version => $Id: ldap.c,v 1.130.2.3 2003/03/07 14:08:06 iliaa Exp $ Total Links => 0/unlimited API Version => 2004 Vendor Name => OpenLDAP Vendor Version => 20021 mbstring Multibyte Support => enabled Japanese support => enabled Directive => Local Value => Master Value mbstring.detect_order => no value => no value mbstring.encoding_translation => Off => Off mbstring.func_overload => 0 => 0 mbstring.http_input => pass => pass mbstring.http_output => pass => pass mbstring.internal_encoding => none => none mbstring.language => neutral => neutral mbstring.substitute_character => no value => no value mcrypt mcrypt support => enabled version => >= 2.4.x Supported ciphers => cast-128 gost rijndael-128 twofish arcfour cast-256 loki97 rijndael-192 saferplus wake blowfish-compat des rijndael-256 serpent xtea blowfish enigma rc2 tripledes Supported modes => cbc cfb ctr ecb ncfb nofb ofb stream Directive => Local Value => Master Value mcrypt.algorithms_dir => no value => no value mcrypt.modes_dir => no value => no value ming Ming SWF output library => enabled Version => 0.2a mysql MySQL Support => enabled Active Persistent Links => 0 Active Links => 0 Client API version => 3.23.49 MYSQL_MODULE_TYPE => builtin MYSQL_SOCKET => /var/lib/mysql/mysql.sock MYSQL_INCLUDE => MYSQL_LIBS => Directive => Local Value => Master Value mysql.allow_persistent => On => On mysql.connect_timeout => -1 => -1 mysql.default_host => no value => no value mysql.default_password => no value => no value mysql.default_port => no value => no value mysql.default_socket => /var/lib/mysql/mysql.sock => /var/lib/mysql/mysql.sock mysql.default_user => no value => no value mysql.max_links => Unlimited => Unlimited mysql.max_persistent => Unlimited => Unlimited mysql.trace_mode => On => On ncurses ncurses support => enabled ncurses library version => 5.2 color support => yes openssl OpenSSL support => enabled OpenSSL Version => OpenSSL 0.9.6 24 Sep 2000 overload User-Space Object Overloading Support => enabled pcre PCRE (Perl Compatible Regular Expressions) Support => enabled PCRE Library Version => 3.92 11-Sep-2002 pdf PDF Support => enabled PDFlib GmbH Version => 4.0.1 Revision => $Revision: 1.112.2.4 $ posix Revision => $Revision: 1.51.2.2 $ session Session Support => enabled Registered save handlers => files user Directive => Local Value => Master Value session.auto_start => Off => Off session.bug_compat_42 => On => On session.bug_compat_warn => On => On session.cache_expire => 180 => 180 session.cache_limiter => nocache => nocache session.cookie_domain => no value => no value session.cookie_lifetime => 0 => 0 session.cookie_path => / => / session.cookie_secure => Off => Off session.entropy_file => no value => no value session.entropy_length => 0 => 0 session.gc_dividend => 100 => 100 session.gc_maxlifetime => 1440 => 1440 session.gc_probability => 1 => 1 session.name => PHPSESSID => PHPSESSID session.referer_check => no value => no value session.save_handler => files => files session.save_path => /tmp => /tmp session.serialize_handler => php => php session.use_cookies => On => On session.use_only_cookies => Off => Off session.use_trans_sid => Off => Off shmop shmop support => enabled snmp UCD-SNMP Support => enabled UCD-SNMP Version => 4.2.5 standard Regex Library => Bundled library enabled Dynamic Library Support => enabled Path to sendmail => /usr/sbin/sendmail -t -i Directive => Local Value => Master Value assert.active => 1 => 1 assert.bail => 0 => 0 assert.callback => no value => no value assert.quiet_eval => 0 => 0 assert.warning => 1 => 1 auto_detect_line_endings => 0 => 0 default_socket_timeout => 60 => 60 safe_mode_allowed_env_vars => PHP_ => PHP_ safe_mode_protected_env_vars => LD_LIBRARY_PATH => LD_LIBRARY_PATH url_rewriter.tags => a=href,area=href,frame=src,form=,fieldset= => a=href,area=href,frame=src,form=,fieldset= user_agent => no value => no value tokenizer Tokenizer Support => enabled wddx WDDX Support => enabled WDDX Session Serializer => enabled xdebug xdebug support => enabled Version => 1.2.0dev Stacktraces support => enabled Function nesting protection support => enabled Directive => Local Value => Master Value xdebug.auto_profile => Off => Off xdebug.auto_profile_mode => 0 => 0 xdebug.auto_trace => Off => Off xdebug.collect_params => On => On xdebug.default_enable => On => On xdebug.dump.COOKIE => no value => no value xdebug.dump.ENV => no value => no value xdebug.dump.FILES => no value => no value xdebug.dump.GET => no value => no value xdebug.dump.POST => no value => no value xdebug.dump.REQUEST => no value => no value xdebug.dump.SERVER => no value => no value xdebug.dump.SESSION => no value => no value xdebug.dump_once => On => On xdebug.dump_undefined => Off => Off xdebug.manual_url => http://uk.php.net => http://uk.php.net xdebug.max_nesting_level => 2048 => 2048 xdebug.output_dir => /tmp => /tmp xdebug.remote_enable => Off => Off xdebug.remote_handler => gdb => gdb xdebug.remote_host => localhost => localhost xdebug.remote_mode => req => req xdebug.remote_port => 17869 => 17869 xml XML Support => active XML Namespace Support => active EXPAT Version => 1.95.2 xmlrpc core library version => xmlrpc-epi v. 0.51 php extension version => 0.51 author => Dan Libby homepage => http://xmlrpc-epi.sourceforge.net open sourced by => Epinions.com zip Zip support => enabled zlib ZLib Support => enabled Compiled Version => 1.1.3 Linked Version => 1.1.3 Directive => Local Value => Master Value zlib.output_compression => Off => Off zlib.output_compression_level => -1 => -1 zlib.output_handler => no value => no value Additional Modules Module Name sysvsem sysvshm Environment Variable => Value PWD => /dat/dev/php/php-4.3.2RC1 XAUTHORITY => /home/derick/.Xauthority MAKEFLAGS => WINDOWID => 81788980 SCRIPT_FILENAME => MFLAGS => HOSTNAME => kossu.office.jdimedia.nl QTDIR => /usr/lib/qt-2.3.0 LESSOPEN => |/usr/bin/lesspipe.sh %s CC => gcc SUDO_GID => 500 GNOME_SESSION_NAME => Default BROWSER => mozilla REQUEST_METHOD => LS_COLORS => no=00:fi=00:di=01;34:ln=01;36:pi=40;33:so=01;35:bd=40;33;01:cd=40;33;01:or=01;05;37;41:mi=01;05;37;41:ex=01;32:*.cmd=01;32:*.exe=01;32:*.com=01;32:*.btm=01;32:*.bat=01;32:*.sh=01;32:*.csh=01;32:*.tar=01;31:*.tgz=01;31:*.arj=01;31:*.taz=01;31:*.lzh=01;31:*.zip=01;31:*.z=01;31:*.Z=01;31:*.gz=01;31:*.bz2=01;31:*.bz=01;31:*.tz=01;31:*.rpm=01;31:*.cpio=01;31:*.jpg=01;35:*.gif=01;35:*.bmp=01;35:*.xbm=01;35:*.xpm=01;35:*.png=01;35:*.tif=01;35: USER => root MACHTYPE => i386-redhat-linux-gnu TEST_PHP_SRCDIR => /dat/dev/php/php-4.3.2RC1 MAIL => /var/spool/mail/derick INPUTRC => /etc/inputrc PATH_TRANSLATED => SUDO_UID => 500 XMODIFIERS => @im=none EDITOR => vim LANG => en_US QUERY_STRING => CONTENT_LENGTH => MAKELEVEL => 1 COLORTERM => gnome-terminal DISPLAY => :0 SHLVL => 7 SSH_AGENT_PID => 1980 LOGNAME => root REDIRECT_STATUS => _ => /dat/dev/php/php-4.3.2RC1/sapi/cli/php TEST_PHP_EXECUTABLE => /dat/dev/php/php-4.3.2RC1/sapi/cli/php SESSION_MANAGER => local/kossu.office.jdimedia.nl:/tmp/.ICE-unix/2006 SUDO_COMMAND => /bin/su SHELL => /bin/sh HOSTTYPE => i386 HISTSIZE => 1000 OSTYPE => linux-gnu TERM => xterm HOME => /root SSH_ASKPASS => /usr/libexec/openssh/gnome-ssh-askpass SSH_AUTH_SOCK => /tmp/ssh-XXnQfNfE/agent.1979 PATH => /usr/local/bin:/bin:/usr/bin:/usr/X11R6/bin:/home/derick/bin:/home/derick/cxoffice/bin SUDO_USER => derick CONTENT_TYPE => PHP Variables Variable => Value _SERVER["PWD"] => /dat/dev/php/php-4.3.2RC1 _SERVER["XAUTHORITY"] => /home/derick/.Xauthority _SERVER["MAKEFLAGS"] => _SERVER["WINDOWID"] => 81788980 _SERVER["SCRIPT_FILENAME"] => _SERVER["MFLAGS"] => _SERVER["HOSTNAME"] => kossu.office.jdimedia.nl _SERVER["QTDIR"] => /usr/lib/qt-2.3.0 _SERVER["LESSOPEN"] => |/usr/bin/lesspipe.sh %s _SERVER["CC"] => gcc _SERVER["SUDO_GID"] => 500 _SERVER["GNOME_SESSION_NAME"] => Default _SERVER["BROWSER"] => mozilla _SERVER["REQUEST_METHOD"] => _SERVER["LS_COLORS"] => no=00:fi=00:di=01;34:ln=01;36:pi=40;33:so=01;35:bd=40;33;01:cd=40;33;01:or=01;05;37;41:mi=01;05;37;41:ex=01;32:*.cmd=01;32:*.exe=01;32:*.com=01;32:*.btm=01;32:*.bat=01;32:*.sh=01;32:*.csh=01;32:*.tar=01;31:*.tgz=01;31:*.arj=01;31:*.taz=01;31:*.lzh=01;31:*.zip=01;31:*.z=01;31:*.Z=01;31:*.gz=01;31:*.bz2=01;31:*.bz=01;31:*.tz=01;31:*.rpm=01;31:*.cpio=01;31:*.jpg=01;35:*.gif=01;35:*.bmp=01;35:*.xbm=01;35:*.xpm=01;35:*.png=01;35:*.tif=01;35: _SERVER["USER"] => root _SERVER["MACHTYPE"] => i386-redhat-linux-gnu _SERVER["TEST_PHP_SRCDIR"] => /dat/dev/php/php-4.3.2RC1 _SERVER["MAIL"] => /var/spool/mail/derick _SERVER["INPUTRC"] => /etc/inputrc _SERVER["PATH_TRANSLATED"] => _SERVER["SUDO_UID"] => 500 _SERVER["XMODIFIERS"] => @im=none _SERVER["EDITOR"] => vim _SERVER["LANG"] => en_US _SERVER["QUERY_STRING"] => _SERVER["CONTENT_LENGTH"] => _SERVER["MAKELEVEL"] => 1 _SERVER["COLORTERM"] => gnome-terminal _SERVER["DISPLAY"] => :0 _SERVER["SHLVL"] => 7 _SERVER["SSH_AGENT_PID"] => 1980 _SERVER["LOGNAME"] => root _SERVER["REDIRECT_STATUS"] => _SERVER["_"] => /dat/dev/php/php-4.3.2RC1/sapi/cli/php _SERVER["TEST_PHP_EXECUTABLE"] => /dat/dev/php/php-4.3.2RC1/sapi/cli/php _SERVER["SESSION_MANAGER"] => local/kossu.office.jdimedia.nl:/tmp/.ICE-unix/2006 _SERVER["SUDO_COMMAND"] => /bin/su _SERVER["SHELL"] => /bin/sh _SERVER["HOSTTYPE"] => i386 _SERVER["HISTSIZE"] => 1000 _SERVER["OSTYPE"] => linux-gnu _SERVER["TERM"] => xterm _SERVER["HOME"] => /root _SERVER["SSH_ASKPASS"] => /usr/libexec/openssh/gnome-ssh-askpass _SERVER["SSH_AUTH_SOCK"] => /tmp/ssh-XXnQfNfE/agent.1979 _SERVER["PATH"] => /usr/local/bin:/bin:/usr/bin:/usr/X11R6/bin:/home/derick/bin:/home/derick/cxoffice/bin _SERVER["SUDO_USER"] => derick _SERVER["CONTENT_TYPE"] => _SERVER["PHP_SELF"] => _SERVER["SCRIPT_NAME"] => _SERVER["DOCUMENT_ROOT"] => _SERVER["argv"] => Array ( ) _SERVER["argc"] => 0 _ENV["PWD"] => /dat/dev/php/php-4.3.2RC1 _ENV["XAUTHORITY"] => /home/derick/.Xauthority _ENV["MAKEFLAGS"] => _ENV["WINDOWID"] => 81788980 _ENV["SCRIPT_FILENAME"] => _ENV["MFLAGS"] => _ENV["HOSTNAME"] => kossu.office.jdimedia.nl _ENV["QTDIR"] => /usr/lib/qt-2.3.0 _ENV["LESSOPEN"] => |/usr/bin/lesspipe.sh %s _ENV["CC"] => gcc _ENV["SUDO_GID"] => 500 _ENV["GNOME_SESSION_NAME"] => Default _ENV["BROWSER"] => mozilla _ENV["REQUEST_METHOD"] => _ENV["LS_COLORS"] => no=00:fi=00:di=01;34:ln=01;36:pi=40;33:so=01;35:bd=40;33;01:cd=40;33;01:or=01;05;37;41:mi=01;05;37;41:ex=01;32:*.cmd=01;32:*.exe=01;32:*.com=01;32:*.btm=01;32:*.bat=01;32:*.sh=01;32:*.csh=01;32:*.tar=01;31:*.tgz=01;31:*.arj=01;31:*.taz=01;31:*.lzh=01;31:*.zip=01;31:*.z=01;31:*.Z=01;31:*.gz=01;31:*.bz2=01;31:*.bz=01;31:*.tz=01;31:*.rpm=01;31:*.cpio=01;31:*.jpg=01;35:*.gif=01;35:*.bmp=01;35:*.xbm=01;35:*.xpm=01;35:*.png=01;35:*.tif=01;35: _ENV["USER"] => root _ENV["MACHTYPE"] => i386-redhat-linux-gnu _ENV["TEST_PHP_SRCDIR"] => /dat/dev/php/php-4.3.2RC1 _ENV["MAIL"] => /var/spool/mail/derick _ENV["INPUTRC"] => /etc/inputrc _ENV["PATH_TRANSLATED"] => _ENV["SUDO_UID"] => 500 _ENV["XMODIFIERS"] => @im=none _ENV["EDITOR"] => vim _ENV["LANG"] => en_US _ENV["QUERY_STRING"] => _ENV["CONTENT_LENGTH"] => _ENV["MAKELEVEL"] => 1 _ENV["COLORTERM"] => gnome-terminal _ENV["DISPLAY"] => :0 _ENV["SHLVL"] => 7 _ENV["SSH_AGENT_PID"] => 1980 _ENV["LOGNAME"] => root _ENV["REDIRECT_STATUS"] => _ENV["_"] => /dat/dev/php/php-4.3.2RC1/sapi/cli/php _ENV["TEST_PHP_EXECUTABLE"] => /dat/dev/php/php-4.3.2RC1/sapi/cli/php _ENV["SESSION_MANAGER"] => local/kossu.office.jdimedia.nl:/tmp/.ICE-unix/2006 _ENV["SUDO_COMMAND"] => /bin/su _ENV["SHELL"] => /bin/sh _ENV["HOSTTYPE"] => i386 _ENV["HISTSIZE"] => 1000 _ENV["OSTYPE"] => linux-gnu _ENV["TERM"] => xterm _ENV["HOME"] => /root _ENV["SSH_ASKPASS"] => /usr/libexec/openssh/gnome-ssh-askpass _ENV["SSH_AUTH_SOCK"] => /tmp/ssh-XXnQfNfE/agent.1979 _ENV["PATH"] => /usr/local/bin:/bin:/usr/bin:/usr/X11R6/bin:/home/derick/bin:/home/derick/cxoffice/bin _ENV["SUDO_USER"] => derick _ENV["CONTENT_TYPE"] => PHP License This program is free software; you can redistribute it and/or modify it under the terms of the PHP License as published by the PHP Group and included in the distribution in the file: LICENSE This program is distributed in the hope that it will be useful, but WITHOUT ANY WARRANTY; without even the implied warranty of MERCHANTABILITY or FITNESS FOR A PARTICULAR PURPOSE. If you did not receive a copy of the PHP license, or have any questions about PHP licensing, please contact license@php.net.

« previous php.qa (#10068) next »