Test results [failed]

From: Date: Fri, 14 Mar 2003 15:52:23 +0000
Subject: Test results [failed]
Groups: php.qa 
Request: Send a blank email to php-qa+get-10072@lists.php.net to get a copy of this message
===================================================================== FAILED TEST SUMMARY --------------------------------------------------------------------- Bug #21094 (set_error_handler not accepting methods) [tests/lang/bug21094.phpt] Bug #21800 (Segfault under interactive mode) [tests/lang/bug21800.phpt] Bug #22367 (weird zval allocation problem) [tests/lang/bug22367.phpt] session object deserialization [ext/session/tests/003.phpt] session_set_save_handler test [ext/session/tests/004.phpt] custom save handler, multiple session_start()s, complex data structure test. [ext/session/tests/005.phpt] aggregating everything [ext/standard/tests/aggregation/aggregate.phpt] aggregating all methods [ext/standard/tests/aggregation/aggregate_methods.phpt] aggregating methods specified in the list [ext/standard/tests/aggregation/aggregate_methods_by_list.phpt] aggregating methods matching regular expression [ext/standard/tests/aggregation/aggregate_methods_by_regexp.phpt] User-space filters [ext/standard/tests/file/userfilters.phpt] date_sunrise() and date_sunset() functions [ext/standard/tests/general_functions/sunfuncts.phpt] serialize()/unserialize()/var_dump() [ext/standard/tests/serialize/001.phpt] ===================================================================== ===================================================================== TEST RESULT SUMMARY --------------------------------------------------------------------- Exts skipped : 77 Exts tested : 9 --------------------------------------------------------------------- Number of tests : 611 Tests skipped : 303 (49.6%) Tests failed : 13 ( 2.1%) Tests passed : 295 (48.3%) --------------------------------------------------------------------- Time taken : 21 seconds ===================================================================== ===================================================================== FAILED TEST SUMMARY --------------------------------------------------------------------- Bug #21094 (set_error_handler not accepting methods) [tests/lang/bug21094.phpt] Bug #21800 (Segfault under interactive mode) [tests/lang/bug21800.phpt] Bug #22367 (weird zval allocation problem) [tests/lang/bug22367.phpt] session object deserialization [ext/session/tests/003.phpt] session_set_save_handler test [ext/session/tests/004.phpt] custom save handler, multiple session_start()s, complex data structure test. [ext/session/tests/005.phpt] aggregating everything [ext/standard/tests/aggregation/aggregate.phpt] aggregating all methods [ext/standard/tests/aggregation/aggregate_methods.phpt] aggregating methods specified in the list [ext/standard/tests/aggregation/aggregate_methods_by_list.phpt] aggregating methods matching regular expression [ext/standard/tests/aggregation/aggregate_methods_by_regexp.phpt] User-space filters [ext/standard/tests/file/userfilters.phpt] date_sunrise() and date_sunset() functions [ext/standard/tests/general_functions/sunfuncts.phpt] serialize()/unserialize()/var_dump() [ext/standard/tests/serialize/001.phpt] ===================================================================== ================================================================================ /root/php5/tests/lang/bug21094.phpt ================================================================================ ---- EXPECTED OUTPUT [1024] errstr: test, errfile: %s, errline: %d ---- ACTUAL OUTPUT Notice: Array to string conversion in /root/php5/tests/lang/bug21094.php on line 8 Notice: test in /root/php5/tests/lang/bug21094.php on line 10 ---- FAILED ================================================================================ 001- [1024] errstr: test, errfile: %s, errline: %d 001+ Notice: Array to string conversion in /root/php5/tests/lang/bug21094.php on line 8 002+ 003+ Notice: test in /root/php5/tests/lang/bug21094.php on line 10 ================================================================================ ================================================================================ /root/php5/tests/lang/bug21800.phpt ================================================================================ ---- EXPECTED OUTPUT Interactive mode enabled :test: ---- ACTUAL OUTPUT ---- FAILED ================================================================================ 001- Interactive mode enabled 001+ 002- 003- :test: ================================================================================ ================================================================================ /root/php5/tests/lang/bug22367.phpt ================================================================================ ---- EXPECTED OUTPUT int(5) bool(false) bool(false) array(5) { [0]=> int(0) [1]=> int(1) [2]=> int(2) [3]=> int(3) [4]=> int(4) } array(5) { [0]=> int(0) [1]=> int(1) [2]=> int(2) [3]=> int(3) [4]=> int(4) } int(2) bool(true) bool(true) array(5) { [0]=> int(0) [1]=> int(1) [2]=> int(2) [3]=> int(3) [4]=> int(4) } array(5) { [0]=> int(0) [1]=> int(1) [2]=> int(2) [3]=> int(3) [4]=> int(4) } ---- ACTUAL OUTPUT int(5) bool(false) bool(false) array(5) { [0]=> int(4) [1]=> int(4) [2]=> int(4) [3]=> int(4) [4]=> int(4) } array(5) { [0]=> int(0) [1]=> int(1) [2]=> int(2) [3]=> int(3) [4]=> int(4) } int(2) bool(true) bool(true) array(5) { [0]=> int(0) [1]=> int(1) [2]=> int(2) [3]=> int(3) [4]=> int(4) } array(5) { [0]=> int(0) [1]=> int(1) [2]=> &int(2) [3]=> int(3) [4]=> int(4) } ---- FAILED ================================================================================ 006- int(0) 006+ int(4) 008- int(1) 008+ int(4) 010- int(2) 010+ int(4) 012- int(3) 012+ int(4) 049- int(2) 049+ &int(2) ================================================================================ ================================================================================ /root/php5/ext/session/tests/003.phpt ================================================================================ ---- EXPECTED OUTPUT object(foo)(2) { ["bar"]=> string(2) "ok" ["yes"]=> int(2) } array(1) { [3]=> &object(foo)(2) { ["bar"]=> string(2) "ok" ["yes"]=> int(2) } } ---- ACTUAL OUTPUT object(foo)(2) { ["bar"]=> string(2) "ok" ["yes"]=> int(2) } array(1) { [3]=> object(foo)(2) { ["bar"]=> string(2) "ok" ["yes"]=> int(2) } } ---- FAILED ================================================================================ 009- &object(foo)(2) { 009+ object(foo)(2) { ================================================================================ ================================================================================ /root/php5/ext/session/tests/004.phpt ================================================================================ ---- EXPECTED OUTPUT OPEN: PHPSESSID READ: abtest object(foo)(2) { ["bar"]=> string(2) "ok" ["yes"]=> int(2) } array(1) { [3]=> &object(foo)(2) { ["bar"]=> string(2) "ok" ["yes"]=> int(2) } } WRITE: abtest, baz|O:3:"foo":2:{s:3:"bar";s:2:"ok";s:3:"yes";i:2;}arr|a:1:{i:3;O:3:"foo":2:{s:3:"bar";s:2:"ok";s:3:"yes";i:2;}} OPEN: PHPSESSID READ: abtest object(foo)(2) { ["bar"]=> string(2) "ok" ["yes"]=> int(2) } array(1) { [3]=> object(foo)(2) { ["bar"]=> string(2) "ok" ["yes"]=> int(2) } } DESTROY: abtest ---- ACTUAL OUTPUT OPEN: PHPSESSID READ: abtest object(foo)(2) { ["bar"]=> string(2) "ok" ["yes"]=> int(2) } array(1) { [3]=> object(foo)(2) { ["bar"]=> string(2) "ok" ["yes"]=> int(2) } } WRITE: abtest, baz|O:3:"foo":2:{s:3:"bar";s:2:"ok";s:3:"yes";i:2;}arr|a:1:{i:3;O:3:"foo":2:{s:3:"bar";s:2:"ok";s:3:"yes";i:2;}} OPEN: PHPSESSID READ: abtest object(foo)(2) { ["bar"]=> string(2) "ok" ["yes"]=> int(2) } array(1) { [3]=> object(foo)(2) { ["bar"]=> string(2) "ok" ["yes"]=> int(2) } } DESTROY: abtest ---- FAILED ================================================================================ 011- &object(foo)(2) { 011+ object(foo)(2) { ================================================================================ ================================================================================ /root/php5/ext/session/tests/005.phpt ================================================================================ ---- EXPECTED OUTPUT OPEN: PHPSESSID READ: abtest object(foo)(2) { ["bar"]=> string(2) "ok" ["yes"]=> int(2) } array(1) { [3]=> &object(foo)(2) { ["bar"]=> string(2) "ok" ["yes"]=> int(2) } } WRITE: abtest, baz|O:3:"foo":2:{s:3:"bar";s:2:"ok";s:3:"yes";i:2;}arr|a:1:{i:3;O:3:"foo":2:{s:3:"bar";s:2:"ok";s:3:"yes";i:2;}} CLOSE OPEN: PHPSESSID READ: abtest object(foo)(2) { ["bar"]=> string(2) "ok" ["yes"]=> int(3) } array(1) { [3]=> &object(foo)(2) { ["bar"]=> string(2) "ok" ["yes"]=> int(3) } } int(123) WRITE: abtest, baz|O:3:"foo":2:{s:3:"bar";s:2:"ok";s:3:"yes";i:3;}arr|a:1:{i:3;O:3:"foo":2:{s:3:"bar";s:2:"ok";s:3:"yes";i:3;}}c|i:123; CLOSE OPEN: PHPSESSID READ: abtest object(foo)(2) { ["bar"]=> string(2) "ok" ["yes"]=> int(3) } array(1) { [3]=> object(foo)(2) { ["bar"]=> string(2) "ok" ["yes"]=> int(3) } } int(123) DESTROY: abtest CLOSE ---- ACTUAL OUTPUT OPEN: PHPSESSID READ: abtest object(foo)(2) { ["bar"]=> string(2) "ok" ["yes"]=> int(2) } array(1) { [3]=> object(foo)(2) { ["bar"]=> string(2) "ok" ["yes"]=> int(2) } } WRITE: abtest, baz|O:3:"foo":2:{s:3:"bar";s:2:"ok";s:3:"yes";i:2;}arr|a:1:{i:3;O:3:"foo":2:{s:3:"bar";s:2:"ok";s:3:"yes";i:2;}} CLOSE OPEN: PHPSESSID READ: abtest object(foo)(2) { ["bar"]=> string(2) "ok" ["yes"]=> int(3) } array(1) { [3]=> object(foo)(2) { ["bar"]=> string(2) "ok" ["yes"]=> int(3) } } int(123) WRITE: abtest, baz|O:3:"foo":2:{s:3:"bar";s:2:"ok";s:3:"yes";i:3;}arr|a:1:{i:3;O:3:"foo":2:{s:3:"bar";s:2:"ok";s:3:"yes";i:3;}}c|i:123; CLOSE OPEN: PHPSESSID READ: abtest object(foo)(2) { ["bar"]=> string(2) "ok" ["yes"]=> int(3) } array(1) { [3]=> object(foo)(2) { ["bar"]=> string(2) "ok" ["yes"]=> int(3) } } int(123) DESTROY: abtest CLOSE ---- FAILED ================================================================================ 011- &object(foo)(2) { 011+ object(foo)(2) { 030- &object(foo)(2) { 030+ object(foo)(2) { ================================================================================ ================================================================================ /root/php5/ext/standard/tests/aggregation/aggregate.phpt ================================================================================ ---- EXPECTED OUTPUT I'm alive! I'm helping! I'm aggregating! **** ---- ACTUAL OUTPUT I'm alive! Fatal error: Call to undefined method simple::do_this() in /root/php5/ext/standard/tests/aggregation/aggregate.php on line 7 ---- FAILED ================================================================================ 002- I'm helping! 002+ 003- I'm aggregating! 003+ Fatal error: Call to undefined method simple::do_this() in /root/php5/ext/standard/tests/aggregation/aggregate.php on line 7 004- **** ================================================================================ ================================================================================ /root/php5/ext/standard/tests/aggregation/aggregate_methods.phpt ================================================================================ ---- EXPECTED OUTPUT I'm alive! mixing 100 simple,mix_it simple_prop mixing ---- ACTUAL OUTPUT I'm alive! Fatal error: Call to undefined method simple::mix_it() in /root/php5/ext/standard/tests/aggregation/aggregate_methods.php on line 6 ---- FAILED ================================================================================ 002- mixing 002+ 003- 100 003+ Fatal error: Call to undefined method simple::mix_it() in /root/php5/ext/standard/tests/aggregation/aggregate_methods.php on line 6 004- simple,mix_it 005- simple_prop 006- mixing ================================================================================ ================================================================================ /root/php5/ext/standard/tests/aggregation/aggregate_methods_by_list.phpt ================================================================================ ---- EXPECTED OUTPUT I'm alive! simple,just_another_method I'm alive! simple,do_this,do_that yep, that's me ---- ACTUAL OUTPUT I'm alive! simple I'm alive! simple Fatal error: Call to undefined method simple::just_another_method() in /root/php5/ext/standard/tests/aggregation/aggregate_methods_by_list.php on line 10 ---- FAILED ================================================================================ 002- simple,just_another_method 002+ simple 004- simple,do_this,do_that 004+ simple 005- yep, that's me 005+ 006+ Fatal error: Call to undefined method simple::just_another_method() in /root/php5/ext/standard/tests/aggregation/aggregate_methods_by_list.php on line 10 ================================================================================ ================================================================================ /root/php5/ext/standard/tests/aggregation/aggregate_methods_by_regexp.phpt ================================================================================ ---- EXPECTED OUTPUT I'm alive! simple,do_this,do_that I'm alive! simple,just_another_method ---- ACTUAL OUTPUT I'm alive! simple I'm alive! simple ---- FAILED ================================================================================ 002- simple,do_this,do_that 002+ simple 004- simple,just_another_method 004+ simple ================================================================================ ================================================================================ /root/php5/ext/standard/tests/file/userfilters.phpt ================================================================================ ---- EXPECTED OUTPUT bool(true) oncreate: string(16) "string.uppercase" NULL bool(true) read: read: string(11) "HELLO THERE" flush: onclose: ---- ACTUAL OUTPUT bool(true) oncreate: string(16) "string.uppercase" NULL oncreate: string(16) "string.uppercase" NULL bool(true) bool(false) onclose: onclose: ---- FAILED ================================================================================ 005- bool(true) 005+ oncreate: 006- read: 006+ string(16) "string.uppercase" 007- read: 007+ NULL 008- string(11) "HELLO THERE" 008+ bool(true) 009- flush: 009+ bool(false) 011+ onclose: ================================================================================ ================================================================================ /root/php5/ext/standard/tests/general_functions/sunfuncts.phpt ================================================================================ ---- EXPECTED OUTPUT 1041293199 06:39 6.6524557618962 1041293806 16:46 16.769374867459 1043971592 06:32 6.5453702926602 1043972233 17:13 17.217524708736 1046390766 06:06 6.1156526756851 1046391456 17:36 17.6108549623 1049069128 05:28 5.4727420290691 1049069878 17:58 17.972552584375 1051661094 04:54 4.9012299828593 1051661898 18:18 18.313688769483 1054339474 04:34 4.5744292894498 1054340319 18:39 18.656400943241 1056931476 04:36 4.6161204505189 1056932328 18:48 18.808871657766 1059609894 04:54 4.9068825098365 1059610715 18:35 18.599286002028 1062288314 05:14 5.2368895570738 1062289083 18:03 18.060541787879 1064880332 05:32 5.542366581139 1064881044 17:24 17.411505614917 1067558754 05:54 5.9162088420581 1067559410 16:50 16.833698570628 1070150780 06:20 6.3462215520697 1070151395 16:35 16.583589055537 ---- ACTUAL OUTPUT 1041293199 06:39 6.6524557618962 1041293806 16:46 16.769374867459 1043971592 06:32 6.5453702926602 1043972233 17:13 17.217524708736 1046390766 06:06 6.1156526756851 1046391456 17:36 17.6108549623 1049069128 05:28 5.4727420290691 1049069878 17:58 17.972552584375 1051661094 04:54 4.9012299828593 1051661898 18:18 18.313688769483 1054339474 04:34 4.5744292894498 1054340319 18:39 18.656400943241 1056931476 04:36 4.6161204505189 1056932328 18:48 18.808871657766 1059609894 04:54 4.9068825098364 1059610715 18:35 18.599286002028 1062288314 05:14 5.2368895570738 1062289083 18:03 18.060541787879 1064880332 05:32 5.542366581139 1064881044 17:24 17.411505614917 1067558754 05:54 5.9162088420581 1067559410 16:50 16.833698570628 1070150780 06:20 6.3462215520697 1070151395 16:35 16.583589055537 ---- FAILED ================================================================================ 015- 1059609894 04:54 4.9068825098365 015+ 1059609894 04:54 4.9068825098364 ================================================================================ ================================================================================ /root/php5/ext/standard/tests/serialize/001.phpt ================================================================================ ---- EXPECTED OUTPUT N; b:1; b:0; i:1; i:0; i:-1; i:2147483647; i:-2147483647; d:1.123456789; d:1; d:0; d:-1; d:-1.123456789; s:5:"hallo"; a:6:{i:0;i:1;i:1;d:1.1;i:2;s:5:"hallo";i:3;N;i:4;b:1;i:5;a:0:{}} O:1:"t":1:{s:1:"a";s:5:"hallo";} object(t)(1) { ["a"]=> string(5) "hallo" } __sleep called O:1:"s":2:{s:1:"a";s:5:"hallo";s:1:"c";s:5:"world";} __wakeup called object(s)(2) { ["a"]=> string(5) "hallo" ["c"]=> string(5) "world" } array(2) { ["a"]=> &string(4) "test" ["b"]=> &string(4) "test" } a:2:{s:1:"a";s:4:"test";s:1:"b";R:2;} array(2) { ["a"]=> &string(4) "test" ["b"]=> &string(4) "test" } ---- ACTUAL OUTPUT N; b:1; b:0; i:1; i:0; i:-1; i:2147483647; i:-2147483647; d:1.123456789; d:1; d:0; d:-1; d:-1.123456789; s:5:"hallo"; a:6:{i:0;i:1;i:1;d:1.1;i:2;s:5:"hallo";i:3;N;i:4;b:1;i:5;a:0:{}} O:1:"t":1:{s:1:"a";s:5:"hallo";} object(t)(1) { ["a"]=> string(5) "hallo" } __sleep called O:1:"s":2:{s:1:"a";s:5:"hallo";s:1:"c";s:5:"world";} __wakeup called object(s)(3) { ["a"]=> string(5) "hallo" ["b"]=> NULL ["c"]=> string(5) "world" } array(2) { ["a"]=> &string(4) "test" ["b"]=> &string(4) "test" } a:2:{s:1:"a";s:4:"test";s:1:"b";R:2;} array(2) { ["a"]=> &string(4) "test" ["b"]=> &string(4) "test" } ---- FAILED ================================================================================ 024- object(s)(2) { 024+ object(s)(3) { 027- ["c"]=> 027+ ["b"]=> 028- string(5) "world" 028+ NULL 029- } 029+ ["c"]=> 030- array(2) { 030+ string(5) "world" 031- ["a"]=> 031+ } 032- &string(4) "test" 032+ array(2) { 033- ["b"]=> 033+ ["a"]=> 035- } 035+ ["b"]=> 036- a:2:{s:1:"a";s:4:"test";s:1:"b";R:2;} 036+ &string(4) "test" 037- array(2) { 037+ } 038- ["a"]=> 038+ a:2:{s:1:"a";s:4:"test";s:1:"b";R:2;} 039- &string(4) "test" 039+ array(2) { 040- ["b"]=> 040+ ["a"]=> 042- } 042+ ["b"]=> 043+ &string(4) "test" 044+ } ================================================================================ ================================================================================ BUILD ENVIRONMENT ================================================================================ OS: Linux Automake: automake (GNU automake) 1.6.3 Written by Tom Tromey <tromey@redhat.com>. Copyright 2002 Free Software Foundation, Inc. This is free software; see the source for copying conditions. There is NO warranty; not even for MERCHANTABILITY or FITNESS FOR A PARTICULAR PURPOSE. Autoconf: autoconf (GNU Autoconf) 2.53 Written by David J. MacKenzie and Akim Demaille. Copyright 2002 Free Software Foundation, Inc. This is free software; see the source for copying conditions. There is NO warranty; not even for MERCHANTABILITY or FITNESS FOR A PARTICULAR PURPOSE. Libtool: ltmain.sh (GNU libtool) 1.4.3 (1.922.2.110 2002/10/23 01:39:54) Compiler: Reading specs from /usr/lib/gcc-lib/i386-redhat-linux/3.2/specs Configured with: ../configure --prefix=/usr --mandir=/usr/share/man --infodir=/usr/share/info --enable-shared --enable-threads=posix --disable-checking --host=i386-redhat-linux --with-system-zlib --enable-__cxa_atexit Thread model: posix gcc version 3.2 20020903 (Red Hat Linux 8.0 3.2-7) Bison: bison (GNU Bison) 1.35 Copyright 1984, 1986, 1989, 1992, 2000, 2001, 2002 Free Software Foundation, Inc. This is free software; see the source for copying conditions. There is NO warranty; not even for MERCHANTABILITY or FITNESS FOR A PARTICULAR PURPOSE. User's E-mail: jorg at omnimedia dot no ================================================================================ PHPINFO ================================================================================ phpinfo() PHP Version => 5.0.0-dev System => Linux omni3.omnimedia.no 2.4.18-24.8.0 #1 Fri Jan 31 07:28:55 EST 2003 i686 Build Date => Mar 14 2003 15:51:11 Configure Command => './configure' '--with-mysql=/usr' '--with-apxs2=/usr/local/apache2/bin/apxs' '--with-curl=/usr' '--without-ctype' Server API => Command Line Interface Virtual Directory Support => disabled Configuration File (php.ini) Path => /usr/local/lib/php.ini PHP API => 20020918 PHP Extension => 20020429 Zend Extension => 90021012 Debug Build => no Thread Safety => disabled Registered PHP Streams => php, http, ftp This program makes use of the Zend Scripting Language Engine: Zend Engine v2.0.0-dev, Copyright (c) 1998-2003 Zend Technologies<br /> _______________________________________________________________________ Configuration PHP Core Directive => Local Value => Master Value allow_call_time_pass_reference => On => On allow_url_fopen => On => On always_populate_raw_post_data => Off => Off arg_separator.input => &amp; => &amp; arg_separator.output => &amp; => &amp; asp_tags => Off => Off auto_append_file => no value => no value auto_prepend_file => no value => no value browscap => no value => no value default_charset => no value => no value default_mimetype => text/html => text/html define_syslog_variables => Off => Off disable_classes => no value => no value disable_functions => no value => no value display_errors => On => On display_startup_errors => Off => Off doc_root => no value => no value docref_ext => no value => no value docref_root => http://www.php.net/ => http://www.php.net/ enable_dl => On => On error_append_string => no value => no value error_log => no value => no value error_prepend_string => no value => no value error_reporting => 2039 => 2039 expose_php => On => On extension_dir => ./ => ./ file_uploads => On => On gpc_order => GPC => GPC highlight.bg => #FFFFFF => #FFFFFF highlight.comment => #FF8000 => #FF8000 highlight.default => #0000BB => #0000BB highlight.html => #000000 => #000000 highlight.keyword => #007700 => #007700 highlight.string => #DD0000 => #DD0000 html_errors => Off => On ignore_repeated_errors => Off => Off ignore_repeated_source => Off => Off ignore_user_abort => Off => Off implicit_flush => On => Off include_path => .:/usr/local/lib/php => .:/usr/local/lib/php log_errors => Off => Off log_errors_max_len => 1024 => 1024 magic_quotes_gpc => On => On magic_quotes_runtime => Off => Off magic_quotes_sybase => Off => Off mail_force_extra_parameters => no value => no value max_execution_time => 0 => 30 max_input_time => 60 => 60 open_basedir => no value => no value output_buffering => no value => no value output_handler => no value => no value post_max_size => 8M => 8M precision => 12 => 12 register_argc_argv => On => On register_globals => On => On register_long_arrays => Off => Off report_memleaks => On => On report_zend_debug => On => On safe_mode => Off => Off safe_mode_exec_dir => no value => no value safe_mode_gid => Off => Off safe_mode_include_dir => no value => no value sendmail_from => me@localhost.com => me@localhost.com sendmail_path => /usr/sbin/sendmail -t -i => /usr/sbin/sendmail -t -i short_open_tag => On => On SMTP => localhost => localhost smtp_port => 25 => 25 sql.safe_mode => Off => Off track_errors => Off => Off unserialize_callback_func => no value => no value upload_max_filesize => 2M => 2M upload_tmp_dir => no value => no value user_dir => no value => no value variables_order => EGPCS => EGPCS xmlrpc_error_number => 0 => 0 xmlrpc_errors => Off => Off y2k_compliance => On => On zend2.implicit_clone => no value => no value ctype ctype functions => enabled curl CURL support => enabled CURL Information => libcurl/7.10.3 OpenSSL/0.9.6b zlib/1.1.4 mysql MySQL Support => enabled Active Persistent Links => 0 Active Links => 0 Client API version => 3.23.54 MYSQL_MODULE_TYPE => external MYSQL_SOCKET => /var/lib/mysql/mysql.sock MYSQL_INCLUDE => -I/usr/include/mysql MYSQL_LIBS => -L/usr/lib/mysql -lmysqlclient Directive => Local Value => Master Value mysql.allow_persistent => On => On mysql.connect_timeout => -1 => -1 mysql.default_host => no value => no value mysql.default_password => no value => no value mysql.default_port => no value => no value mysql.default_socket => no value => no value mysql.default_user => no value => no value mysql.max_links => Unlimited => Unlimited mysql.max_persistent => Unlimited => Unlimited mysql.trace_mode => Off => Off pcre PCRE (Perl Compatible Regular Expressions) Support => enabled PCRE Library Version => 3.92 11-Sep-2002 posix Revision => $Revision: 1.55 $ session Session Support => enabled Registered save handlers => files user Directive => Local Value => Master Value session.auto_start => Off => Off session.bug_compat_42 => On => On session.bug_compat_warn => On => On session.cache_expire => 180 => 180 session.cache_limiter => nocache => nocache session.cookie_domain => no value => no value session.cookie_lifetime => 0 => 0 session.cookie_path => / => / session.cookie_secure => Off => Off session.entropy_file => no value => no value session.entropy_length => 0 => 0 session.gc_dividend => 100 => 100 session.gc_maxlifetime => 1440 => 1440 session.gc_probability => 4 => 4 session.hash_bits_per_character => 4 => 4 session.hash_function => 0 => 0 session.name => PHPSESSID => PHPSESSID session.referer_check => no value => no value session.save_handler => files => files session.save_path => /tmp => /tmp session.serialize_handler => php => php session.use_cookies => On => On session.use_only_cookies => On => On session.use_trans_sid => Off => Off standard Regex Library => Bundled library enabled Dynamic Library Support => enabled Path to sendmail => /usr/sbin/sendmail -t -i Directive => Local Value => Master Value assert.active => 1 => 1 assert.bail => 0 => 0 assert.callback => no value => no value assert.quiet_eval => 0 => 0 assert.warning => 1 => 1 auto_detect_line_endings => 0 => 0 date.default_latitude => 31.7667 => 31.7667 date.default_longitude => 35.2333 => 35.2333 date.sunrise_zenith => 90.83 => 90.83 date.sunset_zenith => 90.83 => 90.83 default_socket_timeout => 60 => 60 safe_mode_allowed_env_vars => PHP_ => PHP_ safe_mode_protected_env_vars => LD_LIBRARY_PATH => LD_LIBRARY_PATH url_rewriter.tags => a=href,area=href,frame=src,input=src,form=,fieldset= => a=href,area=href,frame=src,input=src,form=,fieldset= user_agent => no value => no value tokenizer Tokenizer Support => enabled xml XML Support => active XML Namespace Support => active EXPAT Version => 1.95.5 Additional Modules Module Name Environment Variable => Value HOSTNAME => omni3.omnimedia.no TEST_PHP_SRCDIR => /root/php5 TERM => xterm SHELL => /bin/sh HISTSIZE => 1000 MAKEFLAGS => SSH_CLIENT => deleted SSH_TTY => deleted USER => root LS_COLORS => no=00:fi=00:di=00;34:ln=00;36:pi=40;33:so=00;35:bd=40;33;01:cd=40;33;01:or=01;05;37;41:mi=01;05;37;41:ex=00;32:*.cmd=00;32:*.exe=00;32:*.com=00;32:*.btm=00;32:*.bat=00;32:*.sh=00;32:*.csh=00;32:*.tar=00;31:*.tgz=00;31:*.arj=00;31:*.taz=00;31:*.lzh=00;31:*.zip=00;31:*.z=00;31:*.Z=00;31:*.gz=00;31:*.bz2=00;31:*.bz=00;31:*.tz=00;31:*.rpm=00;31:*.cpio=00;31:*.jpg=00;35:*.gif=00;35:*.bmp=00;35:*.xbm=00;35:*.xpm=00;35:*.png=00;35:*.tif=00;35: SCRIPT_FILENAME => SSH_AUTH_SOCK => deleted USERNAME => root MAKELEVEL => 1 MFLAGS => PATH => /bin:/sbin:/usr/bin:/usr/sbin:/usr/local/bin:/usr/local/sbin:/usr/bin/X11:/usr/X11R6/bin:/root/bin MAIL => /var/spool/mail/root _ => /root/php5/sapi/cli/php PWD => /root/php5 INPUTRC => /etc/inputrc LANG => en_US.UTF-8 TEST_PHP_EXECUTABLE => /root/php5/sapi/cli/php REDIRECT_STATUS => PATH_TRANSLATED => HOME => /root SHLVL => 3 CONTENT_LENGTH => BASH_ENV => /root/.bashrc LOGNAME => root QUERY_STRING => LESSOPEN => |/usr/bin/lesspipe.sh %s CONTENT_TYPE => CC => gcc REQUEST_METHOD => G_BROKEN_FILENAMES => 1 PHP Variables Variable => Value PHP_SELF => _SERVER["HOSTNAME"] => omni3.omnimedia.no _SERVER["TEST_PHP_SRCDIR"] => /root/php5 _SERVER["TERM"] => xterm _SERVER["SHELL"] => /bin/sh _SERVER["HISTSIZE"] => 1000 _SERVER["MAKEFLAGS"] => _SERVER["SSH_CLIENT"] => deleted _SERVER["SSH_TTY"] => deleted _SERVER["USER"] => root _SERVER["LS_COLORS"] => no=00:fi=00:di=00;34:ln=00;36:pi=40;33:so=00;35:bd=40;33;01:cd=40;33;01:or=01;05;37;41:mi=01;05;37;41:ex=00;32:*.cmd=00;32:*.exe=00;32:*.com=00;32:*.btm=00;32:*.bat=00;32:*.sh=00;32:*.csh=00;32:*.tar=00;31:*.tgz=00;31:*.arj=00;31:*.taz=00;31:*.lzh=00;31:*.zip=00;31:*.z=00;31:*.Z=00;31:*.gz=00;31:*.bz2=00;31:*.bz=00;31:*.tz=00;31:*.rpm=00;31:*.cpio=00;31:*.jpg=00;35:*.gif=00;35:*.bmp=00;35:*.xbm=00;35:*.xpm=00;35:*.png=00;35:*.tif=00;35: _SERVER["SCRIPT_FILENAME"] => _SERVER["SSH_AUTH_SOCK"] => deleted _SERVER["USERNAME"] => root _SERVER["MAKELEVEL"] => 1 _SERVER["MFLAGS"] => _SERVER["PATH"] => /bin:/sbin:/usr/bin:/usr/sbin:/usr/local/bin:/usr/local/sbin:/usr/bin/X11:/usr/X11R6/bin:/root/bin _SERVER["MAIL"] => /var/spool/mail/root _SERVER["_"] => /root/php5/sapi/cli/php _SERVER["PWD"] => /root/php5 _SERVER["INPUTRC"] => /etc/inputrc _SERVER["LANG"] => en_US.UTF-8 _SERVER["TEST_PHP_EXECUTABLE"] => /root/php5/sapi/cli/php _SERVER["REDIRECT_STATUS"] => _SERVER["PATH_TRANSLATED"] => _SERVER["HOME"] => /root _SERVER["SHLVL"] => 3 _SERVER["CONTENT_LENGTH"] => _SERVER["BASH_ENV"] => /root/.bashrc _SERVER["LOGNAME"] => root _SERVER["QUERY_STRING"] => _SERVER["LESSOPEN"] => |/usr/bin/lesspipe.sh %s _SERVER["CONTENT_TYPE"] => _SERVER["CC"] => gcc _SERVER["REQUEST_METHOD"] => _SERVER["G_BROKEN_FILENAMES"] => 1 _SERVER["PHP_SELF"] => _SERVER["SCRIPT_NAME"] => _SERVER["DOCUMENT_ROOT"] => _SERVER["argv"] => Array ( ) _SERVER["argc"] => 0 _ENV["HOSTNAME"] => omni3.omnimedia.no _ENV["TEST_PHP_SRCDIR"] => /root/php5 _ENV["TERM"] => xterm _ENV["SHELL"] => /bin/sh _ENV["HISTSIZE"] => 1000 _ENV["MAKEFLAGS"] => _ENV["SSH_CLIENT"] => deleted _ENV["SSH_TTY"] => deleted _ENV["USER"] => root _ENV["LS_COLORS"] => no=00:fi=00:di=00;34:ln=00;36:pi=40;33:so=00;35:bd=40;33;01:cd=40;33;01:or=01;05;37;41:mi=01;05;37;41:ex=00;32:*.cmd=00;32:*.exe=00;32:*.com=00;32:*.btm=00;32:*.bat=00;32:*.sh=00;32:*.csh=00;32:*.tar=00;31:*.tgz=00;31:*.arj=00;31:*.taz=00;31:*.lzh=00;31:*.zip=00;31:*.z=00;31:*.Z=00;31:*.gz=00;31:*.bz2=00;31:*.bz=00;31:*.tz=00;31:*.rpm=00;31:*.cpio=00;31:*.jpg=00;35:*.gif=00;35:*.bmp=00;35:*.xbm=00;35:*.xpm=00;35:*.png=00;35:*.tif=00;35: _ENV["SCRIPT_FILENAME"] => _ENV["SSH_AUTH_SOCK"] => deleted _ENV["USERNAME"] => root _ENV["MAKELEVEL"] => 1 _ENV["MFLAGS"] => _ENV["PATH"] => /bin:/sbin:/usr/bin:/usr/sbin:/usr/local/bin:/usr/local/sbin:/usr/bin/X11:/usr/X11R6/bin:/root/bin _ENV["MAIL"] => /var/spool/mail/root _ENV["_"] => /root/php5/sapi/cli/php _ENV["PWD"] => /root/php5 _ENV["INPUTRC"] => /etc/inputrc _ENV["LANG"] => en_US.UTF-8 _ENV["TEST_PHP_EXECUTABLE"] => /root/php5/sapi/cli/php _ENV["REDIRECT_STATUS"] => _ENV["PATH_TRANSLATED"] => _ENV["HOME"] => /root _ENV["SHLVL"] => 3 _ENV["CONTENT_LENGTH"] => _ENV["BASH_ENV"] => /root/.bashrc _ENV["LOGNAME"] => root _ENV["QUERY_STRING"] => _ENV["LESSOPEN"] => |/usr/bin/lesspipe.sh %s _ENV["CONTENT_TYPE"] => _ENV["CC"] => gcc _ENV["REQUEST_METHOD"] => _ENV["G_BROKEN_FILENAMES"] => 1 PHP License This program is free software; you can redistribute it and/or modify it under the terms of the PHP License as published by the PHP Group and included in the distribution in the file: LICENSE This program is distributed in the hope that it will be useful, but WITHOUT ANY WARRANTY; without even the implied warranty of MERCHANTABILITY or FITNESS FOR A PARTICULAR PURPOSE. If you did not receive a copy of the PHP license, or have any questions about PHP licensing, please contact license@php.net.

« previous php.qa (#10072) next »