Test results for unknown [failed]

From: Date: Mon, 31 Mar 2003 13:29:24 +0000
Subject: Test results for unknown [failed]
Groups: php.qa 
Request: Send a blank email to php-qa+get-10726@lists.php.net to get a copy of this message
===================================================================== FAILED TEST SUMMARY --------------------------------------------------------------------- Bug #22367 (weird zval allocation problem) [tests/lang/bug22367.phpt] Bug #22510 (segfault among complex references) [tests/lang/bug22510.phpt] ctype on integers [ext/ctype/tests/001.phpt] mktime() [ext/standard/tests/time/mktime.phpt] ===================================================================== ===================================================================== TEST RESULT SUMMARY --------------------------------------------------------------------- Exts skipped : 77 Exts tested : 10 --------------------------------------------------------------------- Number of tests : 469 Tests skipped : 238 (50.7%) Tests failed : 4 ( 0.9%) Tests passed : 227 (48.4%) --------------------------------------------------------------------- Time taken : 40 seconds ===================================================================== ================================================================================ /home/jmullan/src/php-4.3.2RC1/tests/lang/bug22367.phpt ================================================================================ ---- EXPECTED OUTPUT int(5) bool(false) bool(false) array(5) { [0]=> int(0) [1]=> int(1) [2]=> int(2) [3]=> int(3) [4]=> int(4) } array(5) { [0]=> int(0) [1]=> int(1) [2]=> int(2) [3]=> int(3) [4]=> int(4) } int(2) bool(true) bool(true) array(5) { [0]=> int(0) [1]=> int(1) [2]=> int(2) [3]=> int(3) [4]=> int(4) } array(5) { [0]=> int(0) [1]=> int(1) [2]=> int(2) [3]=> int(3) [4]=> int(4) } ---- ACTUAL OUTPUT int(5) bool(false) bool(false) array(5) { [0]=> int(4) [1]=> int(4) [2]=> int(4) [3]=> int(4) [4]=> int(4) } array(5) { [0]=> int(0) [1]=> int(1) [2]=> int(2) [3]=> int(3) [4]=> int(4) } int(2) bool(true) bool(true) array(5) { [0]=> int(0) [1]=> int(1) [2]=> int(2) [3]=> int(3) [4]=> int(4) } array(5) { [0]=> int(0) [1]=> int(1) [2]=> &int(2) [3]=> int(3) [4]=> int(4) } ---- FAILED ================================================================================ 006- int(0) 006+ int(4) 008- int(1) 008+ int(4) 010- int(2) 010+ int(4) 012- int(3) 012+ int(4) 049- int(2) 049+ &int(2) ================================================================================ ================================================================================ /home/jmullan/src/php-4.3.2RC1/tests/lang/bug22510.phpt ================================================================================ ---- EXPECTED OUTPUT ok1 bar::run1 foo::method1 foo::method1 foo::finalize done! ok2 bar::run2 foo::method2 foo::method2 foo::finalize done! ok3 bar::run3 foo::method3 foo::method3 foo::finalize done! ouch bar::run1 foo::method1 foo::method1 foo::finalize I'm alive! ---- ACTUAL OUTPUT ok1 bar::run1 foo::method1 foo::method1 foo::finalize done! ok2 bar::run2 foo::method2 foo::method2 foo::finalize done! ok3 bar::run3 foo::method3 foo::method3 foo::finalize done! ouch bar::run1 foo::method1 foo::method1 foo::finalize Memory fault (core dumped) ---- FAILED ================================================================================ 024- I'm alive! 024+ Memory fault (core dumped) ================================================================================ ================================================================================ /home/jmullan/src/php-4.3.2RC1/ext/ctype/tests/001.phpt ================================================================================ ---- EXPECTED OUTPUT ctype_lower 26 ctype_upper 26 ctype_alpha 52 ctype_digit 10 ctype_alnum 62 ctype_cntrl 33 ctype_graph 94 ctype_print 95 ctype_punct 32 ctype_space 6 ctype_xdigit 22 ---- ACTUAL OUTPUT ctype_lower 26 ctype_upper 26 ctype_alpha 52 ctype_digit 10 ctype_alnum 62 ctype_cntrl 65 ctype_graph 189 ctype_print 191 ctype_punct 127 ctype_space 12 ctype_xdigit 22 ---- FAILED ================================================================================ 006- ctype_cntrl 33 006+ ctype_cntrl 65 007- ctype_graph 94 007+ ctype_graph 189 008- ctype_print 95 008+ ctype_print 191 009- ctype_punct 32 009+ ctype_punct 127 010- ctype_space 6 010+ ctype_space 12 ================================================================================ ================================================================================ /home/jmullan/src/php-4.3.2RC1/ext/standard/tests/time/mktime.phpt ================================================================================ ---- EXPECTED OUTPUT int(1009843200) int(1009843200) int(1009843200) int(1009843200) int(1025481600) int(1025481600) int(1025481600) int(1025481600) int(1009839600) int(1009839600) int(1009839600) int(1009836000) int(1025474400) int(1025474400) int(1025478000) int(1025474400) ---- ACTUAL OUTPUT int(1009843200) int(1009843200) int(1009843200) int(-3662) int(1025481600) int(1025481600) int(1025481600) int(-3662) int(1009839600) int(1009839600) int(1009839600) int(1009836000) int(1025474400) int(1025474400) int(1025478000) int(1025474400) ---- FAILED ================================================================================ 004- int(1009843200) 004+ int(-3662) 008- int(1025481600) 008+ int(-3662) ================================================================================ ================================================================================ BUILD ENVIRONMENT ================================================================================ OS: OpenBSD Automake: Autoconf: autoconf (GNU Autoconf) 2.57 Written by David J. MacKenzie and Akim Demaille. Copyright 2002 Free Software Foundation, Inc. This is free software; see the source for copying conditions. There is NO warranty; not even for MERCHANTABILITY or FITNESS FOR A PARTICULAR PURPOSE. Libtool: ltmain.sh (GNU libtool) 1.4.3 (1.922.2.110 2002/10/23 01:39:54) Compiler: Reading specs from /usr/lib/gcc-lib/i386-unknown-openbsd2.9/2.95.3/specs gcc version 2.95.3 20010125 (prerelease) Bison: bison (GNU Bison) 1.29 Copyright 1984, 1986, 1989, 1992, 2000, 2001 Free Software Foundation, Inc. This is free software; see the source for copying conditions. There is NO warranty; not even for MERCHANTABILITY or FITNESS FOR A PARTICULAR PURPOSE. User's E-mail: jmullan at vis dot com ================================================================================ PHPINFO ================================================================================ phpinfo() PHP Version => 4.3.2-RC1 System => OpenBSD host220 2.9 GENERIC#653 i386 Build Date => Mar 31 2003 07:25:34 Configure Command => './configure' '--with-mysql' '--with-apxs' '--with-gettext' Server API => Command Line Interface Virtual Directory Support => disabled Configuration File (php.ini) Path => /usr/local/lib/php.ini PHP API => 20020918 PHP Extension => 20020429 Zend Extension => 20021010 Debug Build => no Thread Safety => disabled Registered PHP Streams => php, http, ftp This program makes use of the Zend Scripting Language Engine: Zend Engine v1.3.0, Copyright (c) 1998-2003 Zend Technologies<br /> _______________________________________________________________________ Configuration PHP Core Directive => Local Value => Master Value allow_call_time_pass_reference => On => On allow_url_fopen => On => On always_populate_raw_post_data => Off => Off arg_separator.input => &amp; => &amp; arg_separator.output => &amp; => &amp; asp_tags => Off => Off auto_append_file => no value => no value auto_prepend_file => no value => no value browscap => no value => no value default_charset => no value => no value default_mimetype => text/html => text/html define_syslog_variables => Off => Off disable_classes => no value => no value disable_functions => no value => no value display_errors => On => On display_startup_errors => Off => Off doc_root => no value => no value docref_ext => no value => no value docref_root => http://www.php.net/ => http://www.php.net/ enable_dl => On => On error_append_string => no value => no value error_log => no value => no value error_prepend_string => no value => no value error_reporting => 2039 => 2039 expose_php => On => On extension_dir => ./ => ./ file_uploads => On => On gpc_order => GPC => GPC highlight.bg => #FFFFFF => #FFFFFF highlight.comment => #FF9900 => #FF9900 highlight.default => #0000CC => #0000CC highlight.html => #000000 => #000000 highlight.keyword => #006600 => #006600 highlight.string => #CC0000 => #CC0000 html_errors => Off => On ignore_repeated_errors => Off => Off ignore_repeated_source => Off => Off ignore_user_abort => Off => Off implicit_flush => On => Off include_path => .:/usr/local/lib/php => .:/usr/local/lib/php log_errors => Off => Off log_errors_max_len => 1024 => 1024 magic_quotes_gpc => On => On magic_quotes_runtime => Off => Off magic_quotes_sybase => Off => Off max_execution_time => 0 => 30 max_input_time => -1 => -1 open_basedir => no value => no value output_buffering => no value => no value output_handler => no value => no value post_max_size => 8M => 8M precision => 14 => 14 register_argc_argv => On => On register_globals => On => On report_memleaks => On => On safe_mode => Off => Off safe_mode_exec_dir => no value => no value safe_mode_gid => Off => Off safe_mode_include_dir => no value => no value sendmail_from => me@localhost.com => me@localhost.com sendmail_path => sendmail -t -i => sendmail -t -i short_open_tag => On => On SMTP => localhost => localhost smtp_port => 25 => 25 sql.safe_mode => Off => Off track_errors => Off => Off unserialize_callback_func => no value => no value upload_max_filesize => 20M => 20M upload_tmp_dir => no value => no value user_dir => no value => no value variables_order => EGPCS => EGPCS xmlrpc_error_number => 0 => 0 xmlrpc_errors => Off => Off y2k_compliance => Off => Off ctype ctype functions => enabled gettext GetText Support => enabled mysql MySQL Support => enabled Active Persistent Links => 0 Active Links => 0 Client API version => 3.23.49 MYSQL_MODULE_TYPE => builtin MYSQL_SOCKET => /tmp/mysql.sock MYSQL_INCLUDE => MYSQL_LIBS => Directive => Local Value => Master Value mysql.allow_persistent => On => On mysql.connect_timeout => -1 => -1 mysql.default_host => no value => no value mysql.default_password => no value => no value mysql.default_port => no value => no value mysql.default_socket => no value => no value mysql.default_user => no value => no value mysql.max_links => Unlimited => Unlimited mysql.max_persistent => Unlimited => Unlimited mysql.trace_mode => Off => Off overload User-Space Object Overloading Support => enabled pcre PCRE (Perl Compatible Regular Expressions) Support => enabled PCRE Library Version => 3.92 11-Sep-2002 posix Revision => $Revision: 1.51.2.2 $ session Session Support => enabled Registered save handlers => files user Directive => Local Value => Master Value session.auto_start => Off => Off session.bug_compat_42 => On => On session.bug_compat_warn => On => On session.cache_expire => 180 => 180 session.cache_limiter => nocache => nocache session.cookie_domain => no value => no value session.cookie_lifetime => 0 => 0 session.cookie_path => / => / session.cookie_secure => Off => Off session.entropy_file => no value => no value session.entropy_length => 0 => 0 session.gc_dividend => 100 => 100 session.gc_maxlifetime => 1440 => 1440 session.gc_probability => 1 => 1 session.name => PHPSESSID => PHPSESSID session.referer_check => no value => no value session.save_handler => files => files session.save_path => /tmp => /tmp session.serialize_handler => php => php session.use_cookies => On => On session.use_only_cookies => Off => Off session.use_trans_sid => On => On standard Regex Library => Bundled library enabled Dynamic Library Support => enabled Path to sendmail => sendmail -t -i Directive => Local Value => Master Value assert.active => 1 => 1 assert.bail => 0 => 0 assert.callback => no value => no value assert.quiet_eval => 0 => 0 assert.warning => 1 => 1 auto_detect_line_endings => 0 => 0 default_socket_timeout => 60 => 60 safe_mode_allowed_env_vars => PHP_ => PHP_ safe_mode_protected_env_vars => LD_LIBRARY_PATH => LD_LIBRARY_PATH url_rewriter.tags => a=href,area=href,frame=src,input=src,form=fakeentry => a=href,area=href,frame=src,input=src,form=fakeentry user_agent => no value => no value tokenizer Tokenizer Support => enabled xml XML Support => active XML Namespace Support => active EXPAT Version => 1.95.2 Additional Modules Module Name Environment Variable => Value PATH => /home/jmullan/bin:/bin:/sbin:/usr/bin:/usr/sbin:/usr/local/bin:/usr/local/sbin SHELL => /bin/ksh MAKEFLAGS => USER => jmullan MAIL => /var/mail/jmullan HOME => /home/jmullan PWD => /home/jmullan/src/php-4.3.2RC1 SSH_CLIENT => 209.98.212.218 4038 22 CC => gcc QUERY_STRING => TERM => vt100 _ => /usr/bin/make CONTENT_TYPE => TEST_PHP_EXECUTABLE => /home/jmullan/src/php-4.3.2RC1/sapi/cli/php LOGNAME => jmullan REDIRECT_STATUS => REQUEST_METHOD => TEST_PHP_SRCDIR => /home/jmullan/src/php-4.3.2RC1 CONTENT_LENGTH => SSH_TTY => /dev/ttyp0 PATH_TRANSLATED => SCRIPT_FILENAME => PHP Variables Variable => Value PHP_SELF => _SERVER["PATH"] => /home/jmullan/bin:/bin:/sbin:/usr/bin:/usr/sbin:/usr/local/bin:/usr/local/sbin _SERVER["SHELL"] => /bin/ksh _SERVER["MAKEFLAGS"] => _SERVER["USER"] => jmullan _SERVER["MAIL"] => /var/mail/jmullan _SERVER["HOME"] => /home/jmullan _SERVER["PWD"] => /home/jmullan/src/php-4.3.2RC1 _SERVER["SSH_CLIENT"] => 209.98.212.218 4038 22 _SERVER["CC"] => gcc _SERVER["QUERY_STRING"] => _SERVER["TERM"] => vt100 _SERVER["_"] => /usr/bin/make _SERVER["CONTENT_TYPE"] => _SERVER["TEST_PHP_EXECUTABLE"] => /home/jmullan/src/php-4.3.2RC1/sapi/cli/php _SERVER["LOGNAME"] => jmullan _SERVER["REDIRECT_STATUS"] => _SERVER["REQUEST_METHOD"] => _SERVER["TEST_PHP_SRCDIR"] => /home/jmullan/src/php-4.3.2RC1 _SERVER["CONTENT_LENGTH"] => _SERVER["SSH_TTY"] => /dev/ttyp0 _SERVER["PATH_TRANSLATED"] => _SERVER["SCRIPT_FILENAME"] => _SERVER["PHP_SELF"] => _SERVER["SCRIPT_NAME"] => _SERVER["DOCUMENT_ROOT"] => _SERVER["argv"] => Array ( ) _SERVER["argc"] => 0 _ENV["PATH"] => /home/jmullan/bin:/bin:/sbin:/usr/bin:/usr/sbin:/usr/local/bin:/usr/local/sbin _ENV["SHELL"] => /bin/ksh _ENV["MAKEFLAGS"] => _ENV["USER"] => jmullan _ENV["MAIL"] => /var/mail/jmullan _ENV["HOME"] => /home/jmullan _ENV["PWD"] => /home/jmullan/src/php-4.3.2RC1 _ENV["SSH_CLIENT"] => 209.98.212.218 4038 22 _ENV["CC"] => gcc _ENV["QUERY_STRING"] => _ENV["TERM"] => vt100 _ENV["_"] => /usr/bin/make _ENV["CONTENT_TYPE"] => _ENV["TEST_PHP_EXECUTABLE"] => /home/jmullan/src/php-4.3.2RC1/sapi/cli/php _ENV["LOGNAME"] => jmullan _ENV["REDIRECT_STATUS"] => _ENV["REQUEST_METHOD"] => _ENV["TEST_PHP_SRCDIR"] => /home/jmullan/src/php-4.3.2RC1 _ENV["CONTENT_LENGTH"] => _ENV["SSH_TTY"] => /dev/ttyp0 _ENV["PATH_TRANSLATED"] => _ENV["SCRIPT_FILENAME"] => PHP License This program is free software; you can redistribute it and/or modify it under the terms of the PHP License as published by the PHP Group and included in the distribution in the file: LICENSE This program is distributed in the hope that it will be useful, but WITHOUT ANY WARRANTY; without even the implied warranty of MERCHANTABILITY or FITNESS FOR A PARTICULAR PURPOSE. If you did not receive a copy of the PHP license, or have any questions about PHP licensing, please contact license@php.net.

« previous php.qa (#10726) next »