Test results for unknown [failed]

From: Date: Tue, 01 Apr 2003 22:06:20 +0000
Subject: Test results for unknown [failed]
Groups: php.qa 
Request: Send a blank email to php-qa+get-10785@lists.php.net to get a copy of this message
===================================================================== FAILED TEST SUMMARY --------------------------------------------------------------------- OpenSSL private key functions [ext/openssl/tests/001.phpt] Bug #21131: fopen($filename, "a+") has broken position [ext/standard/tests/file/bug21131.phpt] ===================================================================== ===================================================================== TEST RESULT SUMMARY --------------------------------------------------------------------- Exts skipped : 77 Exts tested : 11 --------------------------------------------------------------------- Number of tests : 443 Tests skipped : 231 (52.1%) Tests failed : 2 ( 0.5%) Tests passed : 210 (47.4%) --------------------------------------------------------------------- Time taken : 105 seconds ===================================================================== ================================================================================ /opt/src/php-4.3.1/ext/openssl/tests/001.phpt ================================================================================ ---- EXPECTED OUTPUT Creating private key Export key to file Load key from file - array syntax Load key using direct syntax Load key manually and use string syntax OK! ---- ACTUAL OUTPUT Creating private key Export key to file Load key from file - array syntax Load key using direct syntax Load key manually and use string syntax failed to load key using string syntax ---- FAILED ================================================================================ 006- OK! 006+ failed to load key using string syntax ================================================================================ ================================================================================ /opt/src/php-4.3.1/ext/standard/tests/file/bug21131.phpt ================================================================================ ---- EXPECTED OUTPUT int(6) int(0) foobar ---- ACTUAL OUTPUT int(0) int(0) foobar ---- FAILED ================================================================================ 001- int(6) 001+ int(0) ================================================================================ ================================================================================ BUILD ENVIRONMENT ================================================================================ OS: SunOS Automake: automake (GNU automake) 1.4 Copyright (C) 1999 Free Software Foundation, Inc. This is free software; see the source for copying conditions. There is NO warranty; not even for MERCHANTABILITY or FITNESS FOR A PARTICULAR PURPOSE. Written by Tom Tromey <tromey@cygnus.com> Autoconf: Autoconf version 2.13 Libtool: ltmain.sh (GNU libtool) 1.4.2 (1.922.2.53 2001/09/11 03:18:52) Compiler: N/A Bison: GNU Bison version 1.28 User's E-mail: bjoern dot wolff at united-pacific dot com ================================================================================ PHPINFO ================================================================================ phpinfo() PHP Version => 4.3.1 System => SunOS starfire.united-pacific.com 5.9 Generic_112233-04 sun4u Build Date => Apr 2 2003 00:03:09 Configure Command => './configure' '--prefix=/opt/php_4.3.1-fcgi' '--enable-fastcgi' '--with-oci8=/raid/vol1/app/oracle/product/9.2.0.1_32bit' '--with-mysql=/opt/mysql_4.0.12' '--with-openssl=/opt/ssl/install' Server API => Command Line Interface Virtual Directory Support => disabled Configuration File (php.ini) Path => /opt/php_4.3.1-fcgi/lib PHP API => 20020918 PHP Extension => 20020429 Zend Extension => 20021010 Debug Build => no Thread Safety => disabled Registered PHP Streams => php, http, ftp, https, ftps This program makes use of the Zend Scripting Language Engine: Zend Engine v1.3.0, Copyright (c) 1998-2002 Zend Technologies _______________________________________________________________________ Configuration PHP Core Directive => Local Value => Master Value allow_call_time_pass_reference => On => On allow_url_fopen => On => On always_populate_raw_post_data => Off => Off arg_separator.input => &amp; => &amp; arg_separator.output => &amp; => &amp; asp_tags => Off => Off auto_append_file => no value => no value auto_prepend_file => no value => no value browscap => no value => no value default_charset => no value => no value default_mimetype => text/html => text/html define_syslog_variables => Off => Off disable_functions => no value => no value display_errors => On => On display_startup_errors => Off => Off doc_root => no value => no value docref_ext => no value => no value docref_root => http://www.php.net/ => http://www.php.net/ enable_dl => On => On error_append_string => no value => no value error_log => no value => no value error_prepend_string => no value => no value error_reporting => no value => no value expose_php => On => On extension_dir => /opt/php_4.3.1-fcgi/lib/php/extensions/no-debug-non-zts-20020429 => /opt/php_4.3.1-fcgi/lib/php/extensions/no-debug-non-zts-20020429 file_uploads => On => On gpc_order => GPC => GPC highlight.bg => #FFFFFF => #FFFFFF highlight.comment => #FF8000 => #FF8000 highlight.default => #0000BB => #0000BB highlight.html => #000000 => #000000 highlight.keyword => #007700 => #007700 highlight.string => #DD0000 => #DD0000 html_errors => Off => On ignore_repeated_errors => Off => Off ignore_repeated_source => Off => Off ignore_user_abort => Off => Off implicit_flush => On => Off include_path => .:/opt/php_4.3.1-fcgi/lib/php => .:/opt/php_4.3.1-fcgi/lib/php log_errors => Off => Off log_errors_max_len => 1024 => 1024 magic_quotes_gpc => On => On magic_quotes_runtime => Off => Off magic_quotes_sybase => Off => Off max_execution_time => 0 => 30 max_input_time => -1 => -1 open_basedir => no value => no value output_buffering => 0 => 0 output_handler => no value => no value post_max_size => 8M => 8M precision => 14 => 14 register_argc_argv => On => On register_globals => Off => Off report_memleaks => On => On safe_mode => Off => Off safe_mode_exec_dir => 1 => 1 safe_mode_gid => Off => Off safe_mode_include_dir => no value => no value sendmail_from => no value => no value sendmail_path => /usr/lib/sendmail -t -i => /usr/lib/sendmail -t -i short_open_tag => On => On SMTP => localhost => localhost smtp_port => 25 => 25 sql.safe_mode => Off => Off track_errors => Off => Off unserialize_callback_func => no value => no value upload_max_filesize => 2M => 2M upload_tmp_dir => no value => no value user_dir => no value => no value variables_order => no value => no value xmlrpc_error_number => 0 => 0 xmlrpc_errors => Off => Off y2k_compliance => On => On ctype ctype functions => enabled mysql MySQL Support => enabled Active Persistent Links => 0 Active Links => 0 Client API version => 4.0.12 MYSQL_MODULE_TYPE => external MYSQL_SOCKET => /tmp/mysql.sock MYSQL_INCLUDE => -I/opt/mysql_4.0.12/include/mysql MYSQL_LIBS => -L/opt/mysql_4.0.12/lib/mysql -lmysqlclient Directive => Local Value => Master Value mysql.allow_persistent => On => On mysql.connect_timeout => -1 => -1 mysql.default_host => no value => no value mysql.default_password => no value => no value mysql.default_port => no value => no value mysql.default_socket => no value => no value mysql.default_user => no value => no value mysql.max_links => Unlimited => Unlimited mysql.max_persistent => Unlimited => Unlimited mysql.trace_mode => Off => Off oci8 OCI8 Support => enabled Revision => $Revision: 1.183 $ Oracle Version => 9.0 Compile-time ORACLE_HOME => /raid/vol1/app/oracle/product/9.2.0.1_32bit Libraries Used => openssl OpenSSL support => enabled OpenSSL Version => OpenSSL 0.9.7a Feb 19 2003 overload User-Space Object Overloading Support => enabled pcre PCRE (Perl Compatible Regular Expressions) Support => enabled PCRE Library Version => 3.92 11-Sep-2002 posix Revision => $Revision: 1.51 $ session Session Support => enabled Registered save handlers => files user Directive => Local Value => Master Value session.auto_start => Off => Off session.bug_compat_42 => On => On session.bug_compat_warn => On => On session.cache_expire => 180 => 180 session.cache_limiter => nocache => nocache session.cookie_domain => no value => no value session.cookie_lifetime => 0 => 0 session.cookie_path => / => / session.cookie_secure => Off => Off session.entropy_file => no value => no value session.entropy_length => 0 => 0 session.gc_dividend => 100 => 100 session.gc_maxlifetime => 1440 => 1440 session.gc_probability => 1 => 1 session.name => PHPSESSID => PHPSESSID session.referer_check => no value => no value session.save_handler => files => files session.save_path => /tmp => /tmp session.serialize_handler => php => php session.use_cookies => On => On session.use_only_cookies => Off => Off session.use_trans_sid => Off => Off standard Regex Library => Bundled library enabled Dynamic Library Support => enabled Path to sendmail => /usr/lib/sendmail -t -i Directive => Local Value => Master Value assert.active => 1 => 1 assert.bail => 0 => 0 assert.callback => no value => no value assert.quiet_eval => 0 => 0 assert.warning => 1 => 1 auto_detect_line_endings => 0 => 0 default_socket_timeout => 60 => 60 safe_mode_allowed_env_vars => PHP_ => PHP_ safe_mode_protected_env_vars => LD_LIBRARY_PATH => LD_LIBRARY_PATH url_rewriter.tags => a=href,area=href,frame=src,form=,fieldset= => a=href,area=href,frame=src,form=,fieldset= user_agent => no value => no value tokenizer Tokenizer Support => enabled xml XML Support => active XML Namespace Support => active EXPAT Version => 1.95.2 Additional Modules Module Name Environment Variable => Value CC => cc CLASSPATH => :/raid/vol1/app/oracle/product/9.2.0.1_32bit/jdbc/lib/nls_charset12.zip:/raid/vol1/app/oracle/product/9.2.0.1_32bit/jdbc/lib/ojdbc14.jar COMPIERE_HOME => /opt/Compiere2 CONTENT_LENGTH => CONTENT_TYPE => HOME => / HZ => JAVA_HOME => /usr/java LD_LIBRARY_PATH => /usr/local/lib:/opt/sfw/lib:/raid/vol1/app/oracle/product/9.2.0.1_32bit/jdbc/lib:/raid/vol1/app/oracle/product/9.2.0.1_32bit/lib LOGNAME => root MAKEFLAGS => MAKELEVEL => 1 ORACLE_HOME => /raid/vol1/app/oracle/product/9.2.0.1_32bit PATH => /usr/sbin:/usr/bin:/opt/sfw/bin:/usr/ccs/bin:/opt/SUNWspro/bin:/usr/local/bin:/data/production/lotus/notesdata:/raid/vol1/app/oracle/product/9.2.0.1_32bit/bin:/usr/local/teTeX/bin/sparc-sun-solaris2.9 PATH_TRANSLATED => QUERY_STRING => REDIRECT_STATUS => REQUEST_METHOD => SCRIPT_FILENAME => SGS_SUPPORT => libmakestate.so.1 SHELL => /sbin/sh TERM => vt100 TEST_PHP_EXECUTABLE => /opt/src/php-4.3.1/sapi/cli/php TEST_PHP_SRCDIR => /opt/src/php-4.3.1 TNS_ADMIN => /raid/vol1/app/oracle/product/9.2.0.1_32bit/network/admin TWO_TASK => PACIFIC.UPG TZ => Europe/Berlin VIRTUAL_ROOT => / PHP Variables Variable => Value _SERVER["CC"] => cc _SERVER["CLASSPATH"] => :/raid/vol1/app/oracle/product/9.2.0.1_32bit/jdbc/lib/nls_charset12.zip:/raid/vol1/app/oracle/product/9.2.0.1_32bit/jdbc/lib/ojdbc14.jar _SERVER["COMPIERE_HOME"] => /opt/Compiere2 _SERVER["CONTENT_LENGTH"] => _SERVER["CONTENT_TYPE"] => _SERVER["HOME"] => / _SERVER["HZ"] => _SERVER["JAVA_HOME"] => /usr/java _SERVER["LD_LIBRARY_PATH"] => /usr/local/lib:/opt/sfw/lib:/raid/vol1/app/oracle/product/9.2.0.1_32bit/jdbc/lib:/raid/vol1/app/oracle/product/9.2.0.1_32bit/lib _SERVER["LOGNAME"] => root _SERVER["MAKEFLAGS"] => _SERVER["MAKELEVEL"] => 1 _SERVER["ORACLE_HOME"] => /raid/vol1/app/oracle/product/9.2.0.1_32bit _SERVER["PATH"] => /usr/sbin:/usr/bin:/opt/sfw/bin:/usr/ccs/bin:/opt/SUNWspro/bin:/usr/local/bin:/data/production/lotus/notesdata:/raid/vol1/app/oracle/product/9.2.0.1_32bit/bin:/usr/local/teTeX/bin/sparc-sun-solaris2.9 _SERVER["PATH_TRANSLATED"] => _SERVER["QUERY_STRING"] => _SERVER["REDIRECT_STATUS"] => _SERVER["REQUEST_METHOD"] => _SERVER["SCRIPT_FILENAME"] => _SERVER["SGS_SUPPORT"] => libmakestate.so.1 _SERVER["SHELL"] => /sbin/sh _SERVER["TERM"] => vt100 _SERVER["TEST_PHP_EXECUTABLE"] => /opt/src/php-4.3.1/sapi/cli/php _SERVER["TEST_PHP_SRCDIR"] => /opt/src/php-4.3.1 _SERVER["TNS_ADMIN"] => /raid/vol1/app/oracle/product/9.2.0.1_32bit/network/admin _SERVER["TWO_TASK"] => PACIFIC.UPG _SERVER["TZ"] => Europe/Berlin _SERVER["VIRTUAL_ROOT"] => / _SERVER["PHP_SELF"] => _SERVER["SCRIPT_NAME"] => _SERVER["DOCUMENT_ROOT"] => _SERVER["argv"] => Array ( ) _SERVER["argc"] => 0 _ENV["CC"] => cc _ENV["CLASSPATH"] => :/raid/vol1/app/oracle/product/9.2.0.1_32bit/jdbc/lib/nls_charset12.zip:/raid/vol1/app/oracle/product/9.2.0.1_32bit/jdbc/lib/ojdbc14.jar _ENV["COMPIERE_HOME"] => /opt/Compiere2 _ENV["CONTENT_LENGTH"] => _ENV["CONTENT_TYPE"] => _ENV["HOME"] => / _ENV["HZ"] => _ENV["JAVA_HOME"] => /usr/java _ENV["LD_LIBRARY_PATH"] => /usr/local/lib:/opt/sfw/lib:/raid/vol1/app/oracle/product/9.2.0.1_32bit/jdbc/lib:/raid/vol1/app/oracle/product/9.2.0.1_32bit/lib _ENV["LOGNAME"] => root _ENV["MAKEFLAGS"] => _ENV["MAKELEVEL"] => 1 _ENV["ORACLE_HOME"] => /raid/vol1/app/oracle/product/9.2.0.1_32bit _ENV["PATH"] => /usr/sbin:/usr/bin:/opt/sfw/bin:/usr/ccs/bin:/opt/SUNWspro/bin:/usr/local/bin:/data/production/lotus/notesdata:/raid/vol1/app/oracle/product/9.2.0.1_32bit/bin:/usr/local/teTeX/bin/sparc-sun-solaris2.9 _ENV["PATH_TRANSLATED"] => _ENV["QUERY_STRING"] => _ENV["REDIRECT_STATUS"] => _ENV["REQUEST_METHOD"] => _ENV["SCRIPT_FILENAME"] => _ENV["SGS_SUPPORT"] => libmakestate.so.1 _ENV["SHELL"] => /sbin/sh _ENV["TERM"] => vt100 _ENV["TEST_PHP_EXECUTABLE"] => /opt/src/php-4.3.1/sapi/cli/php _ENV["TEST_PHP_SRCDIR"] => /opt/src/php-4.3.1 _ENV["TNS_ADMIN"] => /raid/vol1/app/oracle/product/9.2.0.1_32bit/network/admin _ENV["TWO_TASK"] => PACIFIC.UPG _ENV["TZ"] => Europe/Berlin _ENV["VIRTUAL_ROOT"] => / PHP License This program is free software; you can redistribute it and/or modify it under the terms of the PHP License as published by the PHP Group and included in the distribution in the file: LICENSE This program is distributed in the hope that it will be useful, but WITHOUT ANY WARRANTY; without even the implied warranty of MERCHANTABILITY or FITNESS FOR A PARTICULAR PURPOSE. If you did not receive a copy of the PHP license, or have any questions about PHP licensing, please contact license@php.net.

« previous php.qa (#10785) next »