Test results for 4.3.2-RC3-dev [failed]

From: Date: Thu, 08 May 2003 00:49:44 +0000
Subject: Test results for 4.3.2-RC3-dev [failed]
Groups: php.qa 
Request: Send a blank email to php-qa+get-12165@lists.php.net to get a copy of this message
===================================================================== FAILED TEST SUMMARY --------------------------------------------------------------------- String functions [tests/strings/001.phpt] unserialize() floats with E notation (#18654) [ext/standard/tests/serialize/003.phpt] microtime() function [ext/standard/tests/time/001.phpt] strtotime() function [ext/standard/tests/time/002.phpt] mktime() [ext/standard/tests/time/mktime.phpt] ===================================================================== ===================================================================== TEST RESULT SUMMARY --------------------------------------------------------------------- Exts skipped : 78 Exts tested : 9 --------------------------------------------------------------------- Number of tests : 471 Tests skipped : 240 (51.0%) Tests failed : 5 ( 1.1%) Tests passed : 226 (48.0%) --------------------------------------------------------------------- Time taken : 51 seconds ===================================================================== ================================================================================ /usr/local/lib/php4-STABLE-200305072330/tests/strings/001.phpt ================================================================================ ---- EXPECTED OUTPUT Testing strtok: passed Testing strstr: passed Testing strrchr: passed Testing strtoupper: passed Testing strtolower: passed Testing substr: passed Testing rawurlencode: passed Testing rawurldecode: passed Testing urlencode: passed Testing urldecode: passed Testing quotemeta: passed Testing ufirst: passed Testing strtr: passed Testing addslashes: passed Testing stripslashes: passed Testing uniqid: passed ---- ACTUAL OUTPUT Testing strtok: passed Testing strstr: passed Testing strrchr: passed Testing strtoupper: passed Testing strtolower: passed Testing substr: passed Testing rawurlencode: passed Testing rawurldecode: passed Testing urlencode: passed Testing urldecode: passed Testing quotemeta: passed Testing ufirst: passed Testing strtr: passed Testing addslashes: passed Testing stripslashes: passed Testing uniqid: failed! ---- FAILED ================================================================================ 016- Testing uniqid: passed 016+ Testing uniqid: failed! ================================================================================ ================================================================================ /usr/local/lib/php4-STABLE-200305072330/ext/standard/tests/serialize/003.phpt ================================================================================ ---- EXPECTED OUTPUT d:100; float(100) d:5.2E+25; float(5.2E+25) d:8.528999999999999914734871708787977695465087890625E-22; float(8.529E-22) d:9.0000000000000017763568394002504646778106689453125E-9; float(9.E-9) ---- ACTUAL OUTPUT d:100; float(100) d:5.2E+25; float(5.2E+25) d:8.528999999999999914734871708787977695465087890625E-22; float(8.529E-22) d:9.E-9; Notice: unserialize(): Error at offset 0 of 8 bytes in /usr/local/lib/php4-STABLE-200305072330/ext/standard/tests/serialize/003.php on line 4 bool(false) ---- FAILED ================================================================================ 010- d:9.0000000000000017763568394002504646778106689453125E-9; 010+ d:9.E-9; 011- float(9.E-9) 011+ 012+ Notice: unserialize(): Error at offset 0 of 8 bytes in /usr/local/lib/php4-STABLE-200305072330/ext/standard/tests/serialize/003.php on line 4 013+ bool(false) ================================================================================ ================================================================================ /usr/local/lib/php4-STABLE-200305072330/ext/standard/tests/time/001.phpt ================================================================================ ---- EXPECTED OUTPUT Passed: 100000 Failed: 0 ---- ACTUAL OUTPUT Passed: 6049 Failed: 93951 000002: 1052353942 0.77544000 < 1052353942 0.77544000 000003: 1052353942 0.77544000 < 1052353942 0.77544000 000004: 1052353942 0.77544000 < 1052353942 0.77544000 000005: 1052353942 0.77544000 < 1052353942 0.77544000 000006: 1052353942 0.77544000 < 1052353942 0.77544000 000007: 1052353942 0.77544000 < 1052353942 0.77544000 000008: 1052353942 0.77544000 < 1052353942 0.77544000 000009: 1052353942 0.77544000 < 1052353942 0.77544000 000010: 1052353942 0.77544000 < 1052353942 0.77544000 000012: 1052353942 0.77644000 < 1052353942 0.77644000 000013: 1052353942 0.77644000 < 1052353942 0.77644000 ---- FAILED ================================================================================ 001- Passed: 100000 001+ Passed: 6049 002- Failed: 0 002+ Failed: 93951 003+ 000002: 1052353942 0.77544000 < 1052353942 0.77544000 004+ 000003: 1052353942 0.77544000 < 1052353942 0.77544000 005+ 000004: 1052353942 0.77544000 < 1052353942 0.77544000 006+ 000005: 1052353942 0.77544000 < 1052353942 0.77544000 007+ 000006: 1052353942 0.77544000 < 1052353942 0.77544000 008+ 000007: 1052353942 0.77544000 < 1052353942 0.77544000 009+ 000008: 1052353942 0.77544000 < 1052353942 0.77544000 010+ 000009: 1052353942 0.77544000 < 1052353942 0.77544000 011+ 000010: 1052353942 0.77544000 < 1052353942 0.77544000 012+ 000012: 1052353942 0.77644000 < 1052353942 0.77644000 013+ 000013: 1052353942 0.77644000 < 1052353942 0.77644000 ================================================================================ ================================================================================ /usr/local/lib/php4-STABLE-200305072330/ext/standard/tests/time/002.phpt ================================================================================ ---- EXPECTED OUTPUT 1999-10-13 00:00:00 1999-10-13 00:00:00 2000-01-19 00:00:00 2000-01-19 00:00:00 2001-12-21 00:00:00 2001-12-21 00:00:00 2001-12-21 12:16:00 2001-12-21 12:16:00 1969-12-31 23:59:59 2001-10-22 21:19:58 2001-10-22 23:19:58 2001-10-22 23:32:58 2001-10-22 19:19:58 2001-10-22 19:06:58 1999-10-13 00:00:00 1999-10-13 00:00:00 2000-01-19 00:00:00 2000-01-19 00:00:00 2001-12-21 00:00:00 2001-12-21 00:00:00 2001-12-21 12:16:00 2001-12-21 12:16:00 1969-12-31 18:59:59 2001-10-22 21:19:58 2001-10-22 19:19:58 2001-10-22 19:32:58 2001-10-22 15:19:58 2001-10-22 15:06:58 ---- ACTUAL OUTPUT 1999-10-13 00:00:00 1999-10-13 00:00:00 2000-01-19 00:00:00 2000-01-19 00:00:00 2001-12-21 00:00:00 2001-12-21 00:00:00 2001-12-21 12:16:00 2001-12-21 12:16:00 1969-12-31 23:59:59 2001-10-22 21:19:58 2001-10-22 23:19:58 2001-10-22 23:32:58 2001-10-22 19:19:58 2001-10-22 19:06:58 1999-10-13 00:00:00 1999-10-13 00:00:00 2000-01-19 00:00:00 2000-01-19 00:00:00 2001-12-21 00:00:00 2001-12-21 00:00:00 2001-12-21 12:16:00 2001-12-21 12:16:00 1969-12-31 23:59:59 2001-10-22 21:19:58 2001-10-22 23:19:58 2001-10-22 23:32:58 2001-10-22 19:19:58 2001-10-22 19:06:58 ---- FAILED ================================================================================ 023- 1969-12-31 18:59:59 023+ 1969-12-31 23:59:59 025- 2001-10-22 19:19:58 025+ 2001-10-22 23:19:58 026- 2001-10-22 19:32:58 026+ 2001-10-22 23:32:58 027- 2001-10-22 15:19:58 027+ 2001-10-22 19:19:58 028- 2001-10-22 15:06:58 028+ 2001-10-22 19:06:58 ================================================================================ ================================================================================ /usr/local/lib/php4-STABLE-200305072330/ext/standard/tests/time/mktime.phpt ================================================================================ ---- EXPECTED OUTPUT int(1009843200) int(1009843200) int(1009843200) int(1009843200) int(1025481600) int(1025481600) int(1025481600) int(1025481600) int(1009839600) int(1009839600) int(1009839600) int(1009836000) int(1025474400) int(1025474400) int(1025478000) int(1025474400) ---- ACTUAL OUTPUT int(1009843200) int(1009843200) int(1009843200) int(-3662) int(1025481600) int(1025481600) int(1025481600) int(-3662) int(1009839600) int(1009839600) int(1009839600) int(1009836000) int(1025474400) int(1025474400) int(1025478000) int(1025474400) ---- FAILED ================================================================================ 004- int(1009843200) 004+ int(-3662) 008- int(1025481600) 008+ int(-3662) ================================================================================ ================================================================================ BUILD ENVIRONMENT ================================================================================ OS: CYGWIN_NT-5.1 Automake: automake (GNU automake) 1.4-p5 Copyright (C) 1999, 2001 Free Software Foundation, Inc. This is free software; see the source for copying conditions. There is NO warranty; not even for MERCHANTABILITY or FITNESS FOR A PARTICULAR PURPOSE. Written by Tom Tromey <tromey@cygnus.com> Autoconf: Autoconf version 2.13 Libtool: ltmain.sh (GNU libtool) 1.4.3 (1.922.2.110 2002/10/23 01:39:54) Compiler: Reading specs from /usr/lib/gcc-lib/i686-pc-cygwin/3.2/specs Configured with: /netrel/src/gcc-3.2-3/configure --enable-languages=c,c++,f77,java --enable-libgcj --enable-threads=posix --with-system-zlib --enable-nls --without-included-gettext --enable-interpreter --disable-sjlj-exceptions --disable-version-specific-runtime-libs --enable-shared --build=i686-pc-linux --host=i686-pc-cygwin --target=i686-pc-cygwin --enable-haifa --prefix=/usr --exec-prefix=/usr --sysconfdir=/etc --libdir=/usr/lib --includedir=/nonexistent/include --libexecdir=/usr/sbin Thread model: posix gcc version 3.2 20020927 (prerelease) Bison: bison (GNU Bison) 1.75 Written by Robert Corbett and Richard Stallman. Copyright (C) 2002 Free Software Foundation, Inc. This is free software; see the source for copying conditions. There is NO warranty; not even for MERCHANTABILITY or FITNESS FOR A PARTICULAR PURPOSE. Libraries: User's E-mail: iancoles at gaming-forums dot net ================================================================================ PHPINFO ================================================================================ phpinfo() PHP Version => 4.3.2-RC3-dev System => CYGWIN_NT-5.1 IAN 1.3.19(0.71/3/2) 2003-01-23 21:31 i686 Build Date => May 7 2003 20:08:07 Configure Command => './configure' '--with-mysql' Server API => Command Line Interface Virtual Directory Support => disabled Configuration File (php.ini) Path => /usr/local/lib/php.ini PHP API => 20020918 PHP Extension => 20020429 Zend Extension => 20021010 Debug Build => no Thread Safety => disabled Registered PHP Streams => php, http, ftp This program makes use of the Zend Scripting Language Engine: Zend Engine v1.3.0, Copyright (c) 1998-2003 Zend Technologies _______________________________________________________________________ Configuration PHP Core Directive => Local Value => Master Value allow_call_time_pass_reference => On => On allow_url_fopen => On => On always_populate_raw_post_data => Off => Off arg_separator.input => & => & arg_separator.output => & => & asp_tags => Off => Off auto_append_file => no value => no value auto_prepend_file => no value => no value browscap => no value => no value default_charset => no value => no value default_mimetype => text/html => text/html define_syslog_variables => Off => Off disable_classes => no value => no value disable_functions => no value => no value display_errors => On => On display_startup_errors => Off => Off doc_root => no value => no value docref_ext => no value => no value docref_root => no value => no value enable_dl => On => On error_append_string => no value => no value error_log => no value => no value error_prepend_string => no value => no value error_reporting => 2039 => 2039 expose_php => On => On extension_dir => ./ => ./ file_uploads => On => On gpc_order => GPC => GPC highlight.bg => #FFFFFF => #FFFFFF highlight.comment => #FF8000 => #FF8000 highlight.default => #0000BB => #0000BB highlight.html => #000000 => #000000 highlight.keyword => #007700 => #007700 highlight.string => #DD0000 => #DD0000 html_errors => Off => On ignore_repeated_errors => Off => Off ignore_repeated_source => Off => Off ignore_user_abort => Off => Off implicit_flush => On => Off include_path => .:/usr/local/lib/php => .:/usr/local/lib/php log_errors => Off => Off log_errors_max_len => 1024 => 1024 magic_quotes_gpc => On => On magic_quotes_runtime => Off => Off magic_quotes_sybase => Off => Off max_execution_time => 0 => 30 max_input_time => 60 => 60 open_basedir => no value => no value output_buffering => no value => no value output_handler => no value => no value post_max_size => 8M => 8M precision => 12 => 12 register_argc_argv => On => On register_globals => Off => Off report_memleaks => On => On safe_mode => Off => Off safe_mode_exec_dir => no value => no value safe_mode_gid => Off => Off safe_mode_include_dir => no value => no value sendmail_from => me@localhost.com => me@localhost.com sendmail_path => -t -i => -t -i short_open_tag => On => On SMTP => localhost => localhost smtp_port => 25 => 25 sql.safe_mode => Off => Off track_errors => Off => Off unserialize_callback_func => no value => no value upload_max_filesize => 2M => 2M upload_tmp_dir => no value => no value user_dir => no value => no value variables_order => EGPCS => EGPCS xmlrpc_error_number => 0 => 0 xmlrpc_errors => Off => Off y2k_compliance => On => On ctype ctype functions => enabled mysql MySQL Support => enabled Active Persistent Links => 0 Active Links => 0 Client API version => 3.23.49 MYSQL_MODULE_TYPE => builtin MYSQL_SOCKET => /tmp/mysql.sock MYSQL_INCLUDE => MYSQL_LIBS => Directive => Local Value => Master Value mysql.allow_persistent => On => On mysql.connect_timeout => -1 => -1 mysql.default_host => no value => no value mysql.default_password => no value => no value mysql.default_port => no value => no value mysql.default_socket => no value => no value mysql.default_user => no value => no value mysql.max_links => Unlimited => Unlimited mysql.max_persistent => Unlimited => Unlimited mysql.trace_mode => Off => Off overload User-Space Object Overloading Support => enabled pcre PCRE (Perl Compatible Regular Expressions) Support => enabled PCRE Library Version => 3.92 11-Sep-2002 posix Revision => $Revision: 1.51.2.2 $ session Session Support => enabled Registered save handlers => files user Directive => Local Value => Master Value session.auto_start => Off => Off session.bug_compat_42 => On => On session.bug_compat_warn => On => On session.cache_expire => 180 => 180 session.cache_limiter => nocache => nocache session.cookie_domain => no value => no value session.cookie_lifetime => 0 => 0 session.cookie_path => / => / session.cookie_secure => Off => Off session.entropy_file => no value => no value session.entropy_length => 0 => 0 session.gc_divisor => 100 => 100 session.gc_maxlifetime => 1440 => 1440 session.gc_probability => 1 => 1 session.name => PHPSESSID => PHPSESSID session.referer_check => no value => no value session.save_handler => files => files session.save_path => /tmp => /tmp session.serialize_handler => php => php session.use_cookies => On => On session.use_only_cookies => Off => Off session.use_trans_sid => Off => Off standard Regex Library => Bundled library enabled Dynamic Library Support => enabled Directive => Local Value => Master Value assert.active => 1 => 1 assert.bail => 0 => 0 assert.callback => no value => no value assert.quiet_eval => 0 => 0 assert.warning => 1 => 1 auto_detect_line_endings => 0 => 0 default_socket_timeout => 60 => 60 safe_mode_allowed_env_vars => PHP_ => PHP_ safe_mode_protected_env_vars => LD_LIBRARY_PATH => LD_LIBRARY_PATH url_rewriter.tags => a=href,area=href,frame=src,input=src,form=,fieldset= => a=href,area=href,frame=src,input=src,form=,fieldset= user_agent => no value => no value tokenizer Tokenizer Support => enabled xml XML Support => active XML Namespace Support => active EXPAT Version => 1.95.2 Additional Modules Module Name Environment Variable => Value !:: => ::\ !E: => E:\Cygwin\bin ALLUSERSPROFILE => E:\Documents and Settings\All Users.WINXP APPDATA => E:\Documents and Settings\Ian Coles\Application Data CC => gcc CLIENTNAME => Console COMMONPROGRAMFILES => E:\Program Files\Common Files COMPUTERNAME => IAN COMSPEC => E:\WINXP\system32\cmd.exe CONTENT_LENGTH => CONTENT_TYPE => HOME => /home/Ian Coles HOMEDRIVE => E: HOMEPATH => \Documents and Settings\Ian Coles INCLUDE => C:\Program Files\Microsoft Visual Studio .NET\FrameworkSDK\include\ LIB => C:\Program Files\Microsoft Visual Studio .NET\FrameworkSDK\Lib\ LOGONSERVER => \\IAN MAKEFLAGS => --unix MAKELEVEL => 1 MAKE_MODE => unix MANPATH => :/usr/ssl/man MFLAGS => - --unix NUMBER_OF_PROCESSORS => 1 OLDPWD => /usr/local/lib OS => Windows_NT PATH => /usr/local/bin:/usr/bin:/bin:/cygdrive/e/WINXP/system32:/cygdrive/e/WINXP:/cygdrive/e/WINXP/System32/Wbem:"E:/Program Files/Norton SystemWorks/Norton Ghost/":/cygdrive/e/Program Files/AliasWavefront/Maya 4 Personal Learning Edition/bin:/cygdrive/e/UT2003/System:/cygdrive/e/PROGRA~1/ULTRAE~1:/cygdrive/e/WINXP/system32:/cygdrive/e/WINXP:/cygdrive/e/WINXP/System32/Wbem:"E:/Program Files/Norton SystemWorks/Norton Ghost/":/cygdrive/e/Program Files/AliasWavefront/Maya 4 Personal Learning Edition/bin:/cygdrive/e/UT2003/System:/cygdrive/e/PROGRA~1/ULTRAE~1:/cygdrive/e/Program Files/WinRAR:/cygdrive/e/Program Files/UltraEdit:/usr/X11R6/bin PATHEXT => .COM;.EXE;.BAT;.CMD;.VBS;.VBE;.JS;.JSE;.WSF;.WSH PATH_TRANSLATED => PROCESSOR_ARCHITECTURE => x86 PROCESSOR_IDENTIFIER => x86 Family 6 Model 4 Stepping 4, AuthenticAMD PROCESSOR_LEVEL => 6 PROCESSOR_REVISION => 0404 PROGRAMFILES => E:\Program Files PROMPT => $P$G PS1 => \[\033]0;\w\007 \033[32m\]\u@\h \[\033[33m\w\033[0m\] $ PWD => /usr/local/lib/php4-STABLE-200305072330 QUERY_STRING => REDIRECT_STATUS => REQUEST_METHOD => SCRIPT_FILENAME => SESSIONNAME => Console SHELL => /bin/sh SHLVL => 1 SYSTEMDRIVE => E: SYSTEMROOT => E:\WINXP TEMP => /cygdrive/e/DOCUME~1/IANCOL~1/LOCALS~1/Temp TERM => cygwin TEST_PHP_EXECUTABLE => /usr/local/lib/php4-STABLE-200305072330/sapi/cli/php.exe TEST_PHP_SRCDIR => /usr/local/lib/php4-STABLE-200305072330 TEXMF => {/usr/share/lilypond/1.6.5,/usr/share/texmf} TMP => /cygdrive/e/DOCUME~1/IANCOL~1/LOCALS~1/Temp USER => Ian Coles USERDOMAIN => IAN USERNAME => Ian Coles USERPROFILE => E:\Documents and Settings\Ian Coles VSCOMNTOOLS => "C:\Program Files\Microsoft Visual Studio .NET\Common7\Tools\" WINDIR => E:\WINXP _ => /usr/bin/make PHP Variables Variable => Value _SERVER["!::"] => ::\\ _SERVER["!E:"] => E:\\Cygwin\\bin _SERVER["ALLUSERSPROFILE"] => E:\\Documents and Settings\\All Users.WINXP _SERVER["APPDATA"] => E:\\Documents and Settings\\Ian Coles\\Application Data _SERVER["CC"] => gcc _SERVER["CLIENTNAME"] => Console _SERVER["COMMONPROGRAMFILES"] => E:\\Program Files\\Common Files _SERVER["COMPUTERNAME"] => IAN _SERVER["COMSPEC"] => E:\\WINXP\\system32\\cmd.exe _SERVER["CONTENT_LENGTH"] => _SERVER["CONTENT_TYPE"] => _SERVER["HOME"] => /home/Ian Coles _SERVER["HOMEDRIVE"] => E: _SERVER["HOMEPATH"] => \\Documents and Settings\\Ian Coles _SERVER["INCLUDE"] => C:\\Program Files\\Microsoft Visual Studio .NET\\FrameworkSDK\\include\\ _SERVER["LIB"] => C:\\Program Files\\Microsoft Visual Studio .NET\\FrameworkSDK\\Lib\\ _SERVER["LOGONSERVER"] => \\\\IAN _SERVER["MAKEFLAGS"] => --unix _SERVER["MAKELEVEL"] => 1 _SERVER["MAKE_MODE"] => unix _SERVER["MANPATH"] => :/usr/ssl/man _SERVER["MFLAGS"] => - --unix _SERVER["NUMBER_OF_PROCESSORS"] => 1 _SERVER["OLDPWD"] => /usr/local/lib _SERVER["OS"] => Windows_NT _SERVER["PATH"] => /usr/local/bin:/usr/bin:/bin:/cygdrive/e/WINXP/system32:/cygdrive/e/WINXP:/cygdrive/e/WINXP/System32/Wbem:\"E:/Program Files/Norton SystemWorks/Norton Ghost/\":/cygdrive/e/Program Files/AliasWavefront/Maya 4 Personal Learning Edition/bin:/cygdrive/e/UT2003/System:/cygdrive/e/PROGRA~1/ULTRAE~1:/cygdrive/e/WINXP/system32:/cygdrive/e/WINXP:/cygdrive/e/WINXP/System32/Wbem:\"E:/Program Files/Norton SystemWorks/Norton Ghost/\":/cygdrive/e/Program Files/AliasWavefront/Maya 4 Personal Learning Edition/bin:/cygdrive/e/UT2003/System:/cygdrive/e/PROGRA~1/ULTRAE~1:/cygdrive/e/Program Files/WinRAR:/cygdrive/e/Program Files/UltraEdit:/usr/X11R6/bin _SERVER["PATHEXT"] => .COM;.EXE;.BAT;.CMD;.VBS;.VBE;.JS;.JSE;.WSF;.WSH _SERVER["PATH_TRANSLATED"] => _SERVER["PROCESSOR_ARCHITECTURE"] => x86 _SERVER["PROCESSOR_IDENTIFIER"] => x86 Family 6 Model 4 Stepping 4, AuthenticAMD _SERVER["PROCESSOR_LEVEL"] => 6 _SERVER["PROCESSOR_REVISION"] => 0404 _SERVER["PROGRAMFILES"] => E:\\Program Files _SERVER["PROMPT"] => $P$G _SERVER["PS1"] => \\[\\033]0;\\w\\007 \\033[32m\\]\\u@\\h \\[\\033[33m\\w\\033[0m\\] $ _SERVER["PWD"] => /usr/local/lib/php4-STABLE-200305072330 _SERVER["QUERY_STRING"] => _SERVER["REDIRECT_STATUS"] => _SERVER["REQUEST_METHOD"] => _SERVER["SCRIPT_FILENAME"] => _SERVER["SESSIONNAME"] => Console _SERVER["SHELL"] => /bin/sh _SERVER["SHLVL"] => 1 _SERVER["SYSTEMDRIVE"] => E: _SERVER["SYSTEMROOT"] => E:\\WINXP _SERVER["TEMP"] => /cygdrive/e/DOCUME~1/IANCOL~1/LOCALS~1/Temp _SERVER["TERM"] => cygwin _SERVER["TEST_PHP_EXECUTABLE"] => /usr/local/lib/php4-STABLE-200305072330/sapi/cli/php.exe _SERVER["TEST_PHP_SRCDIR"] => /usr/local/lib/php4-STABLE-200305072330 _SERVER["TEXMF"] => {/usr/share/lilypond/1.6.5,/usr/share/texmf} _SERVER["TMP"] => /cygdrive/e/DOCUME~1/IANCOL~1/LOCALS~1/Temp _SERVER["USER"] => Ian Coles _SERVER["USERDOMAIN"] => IAN _SERVER["USERNAME"] => Ian Coles _SERVER["USERPROFILE"] => E:\\Documents and Settings\\Ian Coles _SERVER["VSCOMNTOOLS"] => \"C:\\Program Files\\Microsoft Visual Studio .NET\\Common7\\Tools\\\" _SERVER["WINDIR"] => E:\\WINXP _SERVER["_"] => /usr/bin/make _SERVER["PHP_SELF"] => _SERVER["SCRIPT_NAME"] => _SERVER["DOCUMENT_ROOT"] => _SERVER["argv"] => Array ( ) _SERVER["argc"] => 0 _ENV["!::"] => ::\\ _ENV["!E:"] => E:\\Cygwin\\bin _ENV["ALLUSERSPROFILE"] => E:\\Documents and Settings\\All Users.WINXP _ENV["APPDATA"] => E:\\Documents and Settings\\Ian Coles\\Application Data _ENV["CC"] => gcc _ENV["CLIENTNAME"] => Console _ENV["COMMONPROGRAMFILES"] => E:\\Program Files\\Common Files _ENV["COMPUTERNAME"] => IAN _ENV["COMSPEC"] => E:\\WINXP\\system32\\cmd.exe _ENV["CONTENT_LENGTH"] => _ENV["CONTENT_TYPE"] => _ENV["HOME"] => /home/Ian Coles _ENV["HOMEDRIVE"] => E: _ENV["HOMEPATH"] => \\Documents and Settings\\Ian Coles _ENV["INCLUDE"] => C:\\Program Files\\Microsoft Visual Studio .NET\\FrameworkSDK\\include\\ _ENV["LIB"] => C:\\Program Files\\Microsoft Visual Studio .NET\\FrameworkSDK\\Lib\\ _ENV["LOGONSERVER"] => \\\\IAN _ENV["MAKEFLAGS"] => --unix _ENV["MAKELEVEL"] => 1 _ENV["MAKE_MODE"] => unix _ENV["MANPATH"] => :/usr/ssl/man _ENV["MFLAGS"] => - --unix _ENV["NUMBER_OF_PROCESSORS"] => 1 _ENV["OLDPWD"] => /usr/local/lib _ENV["OS"] => Windows_NT _ENV["PATH"] => /usr/local/bin:/usr/bin:/bin:/cygdrive/e/WINXP/system32:/cygdrive/e/WINXP:/cygdrive/e/WINXP/System32/Wbem:\"E:/Program Files/Norton SystemWorks/Norton Ghost/\":/cygdrive/e/Program Files/AliasWavefront/Maya 4 Personal Learning Edition/bin:/cygdrive/e/UT2003/System:/cygdrive/e/PROGRA~1/ULTRAE~1:/cygdrive/e/WINXP/system32:/cygdrive/e/WINXP:/cygdrive/e/WINXP/System32/Wbem:\"E:/Program Files/Norton SystemWorks/Norton Ghost/\":/cygdrive/e/Program Files/AliasWavefront/Maya 4 Personal Learning Edition/bin:/cygdrive/e/UT2003/System:/cygdrive/e/PROGRA~1/ULTRAE~1:/cygdrive/e/Program Files/WinRAR:/cygdrive/e/Program Files/UltraEdit:/usr/X11R6/bin _ENV["PATHEXT"] => .COM;.EXE;.BAT;.CMD;.VBS;.VBE;.JS;.JSE;.WSF;.WSH _ENV["PATH_TRANSLATED"] => _ENV["PROCESSOR_ARCHITECTURE"] => x86 _ENV["PROCESSOR_IDENTIFIER"] => x86 Family 6 Model 4 Stepping 4, AuthenticAMD _ENV["PROCESSOR_LEVEL"] => 6 _ENV["PROCESSOR_REVISION"] => 0404 _ENV["PROGRAMFILES"] => E:\\Program Files _ENV["PROMPT"] => $P$G _ENV["PS1"] => \\[\\033]0;\\w\\007 \\033[32m\\]\\u@\\h \\[\\033[33m\\w\\033[0m\\] $ _ENV["PWD"] => /usr/local/lib/php4-STABLE-200305072330 _ENV["QUERY_STRING"] => _ENV["REDIRECT_STATUS"] => _ENV["REQUEST_METHOD"] => _ENV["SCRIPT_FILENAME"] => _ENV["SESSIONNAME"] => Console _ENV["SHELL"] => /bin/sh _ENV["SHLVL"] => 1 _ENV["SYSTEMDRIVE"] => E: _ENV["SYSTEMROOT"] => E:\\WINXP _ENV["TEMP"] => /cygdrive/e/DOCUME~1/IANCOL~1/LOCALS~1/Temp _ENV["TERM"] => cygwin _ENV["TEST_PHP_EXECUTABLE"] => /usr/local/lib/php4-STABLE-200305072330/sapi/cli/php.exe _ENV["TEST_PHP_SRCDIR"] => /usr/local/lib/php4-STABLE-200305072330 _ENV["TEXMF"] => {/usr/share/lilypond/1.6.5,/usr/share/texmf} _ENV["TMP"] => /cygdrive/e/DOCUME~1/IANCOL~1/LOCALS~1/Temp _ENV["USER"] => Ian Coles _ENV["USERDOMAIN"] => IAN _ENV["USERNAME"] => Ian Coles _ENV["USERPROFILE"] => E:\\Documents and Settings\\Ian Coles _ENV["VSCOMNTOOLS"] => \"C:\\Program Files\\Microsoft Visual Studio .NET\\Common7\\Tools\\\" _ENV["WINDIR"] => E:\\WINXP _ENV["_"] => /usr/bin/make PHP License This program is free software; you can redistribute it and/or modify it under the terms of the PHP License as published by the PHP Group and included in the distribution in the file: LICENSE This program is distributed in the hope that it will be useful, but WITHOUT ANY WARRANTY; without even the implied warranty of MERCHANTABILITY or FITNESS FOR A PARTICULAR PURPOSE. If you did not receive a copy of the PHP license, or have any questions about PHP licensing, please contact license@php.net.

« previous php.qa (#12165) next »