PHP Test Results

From: Date: Thu, 08 May 2003 18:03:26 +0000
Subject: PHP Test Results
Groups: php.qa 
Request: Send a blank email to php-qa+get-12201@lists.php.net to get a copy of this message
===================================================================== FAILED TEST SUMMARY --------------------------------------------------------------------- Bug #21131: fopen($filename, "a+") has broken position [ext/standard/tests/file/bug21131.phpt] fopencookie detected and working (or cast mechanism works) [ext/standard/tests/file/fopencookie.phpt] strtotime() function [ext/standard/tests/time/002.phpt] ===================================================================== ===================================================================== TEST RESULT SUMMARY --------------------------------------------------------------------- Exts skipped : 79 Exts tested : 9 --------------------------------------------------------------------- Number of tests : 443 Tests skipped : 232 (52.4%) Tests failed : 3 ( 0.7%) Tests passed : 208 (47.0%) --------------------------------------------------------------------- Time taken : 57 seconds ===================================================================== ================================================================================ /misc/php-4.3.1/ext/standard/tests/file/bug21131.phpt ================================================================================ ---- EXPECTED OUTPUT int(6) int(0) foobar ---- ACTUAL OUTPUT int(0) int(0) foobar ---- FAILED ================================================================================ 001- int(6) 001+ int(0) ================================================================================ ================================================================================ /misc/php-4.3.1/ext/standard/tests/file/fopencookie.phpt ================================================================================ ---- EXPECTED OUTPUT If you can read this, it worked ---- ACTUAL OUTPUT If you can read this, it worked/misc/php-4.3.1/main/php_open_temporary_file.c(121) : Freeing 0x00274008 (1024 bytes), script=/misc/php-4.3.1/ext/standard/tests/file/fopencookie.php ---- FAILED ================================================================================ 001- If you can read this, it worked 001+ If you can read this, it worked/misc/php-4.3.1/main/php_open_temporary_file.c(121) : Freeing 0x00274008 (1024 bytes), script=/misc/php-4.3.1/ext/standard/tests/file/fopencookie.php ================================================================================ ================================================================================ /misc/php-4.3.1/ext/standard/tests/time/002.phpt ================================================================================ ---- EXPECTED OUTPUT 1999-10-13 00:00:00 1999-10-13 00:00:00 2000-01-19 00:00:00 2000-01-19 00:00:00 2001-12-21 00:00:00 2001-12-21 00:00:00 2001-12-21 12:16:00 2001-12-21 12:16:00 1969-12-31 23:59:59 2001-10-22 21:19:58 2001-10-22 23:19:58 2001-10-22 23:32:58 2001-10-22 19:19:58 2001-10-22 19:06:58 1999-10-13 00:00:00 1999-10-13 00:00:00 2000-01-19 00:00:00 2000-01-19 00:00:00 2001-12-21 00:00:00 2001-12-21 00:00:00 2001-12-21 12:16:00 2001-12-21 12:16:00 1970-01-01 00:59:59 2001-10-22 21:19:58 2001-10-23 01:19:58 2001-10-23 01:32:58 2001-10-22 21:19:58 2001-10-22 21:06:58 ---- ACTUAL OUTPUT 1999-10-13 00:00:00 1999-10-13 00:00:00 2000-01-19 00:00:00 2000-01-19 00:00:00 2001-12-21 00:00:00 2001-12-21 00:00:00 2001-12-21 12:16:00 2001-12-21 12:16:00 1969-12-31 23:59:59 2001-10-22 21:19:58 2001-10-22 23:19:58 2001-10-22 23:32:58 2001-10-22 19:19:58 2001-10-22 19:06:58 1999-10-13 00:00:00 1999-10-13 00:00:00 2000-01-19 00:00:00 2000-01-19 00:00:00 2001-12-21 00:00:00 2001-12-21 00:00:00 2001-12-21 12:16:00 2001-12-21 12:16:00 1969-12-31 23:59:59 2001-10-22 21:19:58 2001-10-22 23:19:58 2001-10-22 23:32:58 2001-10-22 19:19:58 2001-10-22 19:06:58 ---- FAILED ================================================================================ 023- 1970-01-01 00:59:59 023+ 1969-12-31 23:59:59 025- 2001-10-23 01:19:58 025+ 2001-10-22 23:19:58 026- 2001-10-23 01:32:58 026+ 2001-10-22 23:32:58 027- 2001-10-22 21:19:58 027+ 2001-10-22 19:19:58 028- 2001-10-22 21:06:58 028+ 2001-10-22 19:06:58 ================================================================================ ================================================================================ BUILD ENVIRONMENT ================================================================================ OS: SunOS Automake: automake (GNU automake) 1.2 Copyright (C) 1994, 1995, 1996, 1997 Free Software Foundation, Inc. This is free software; see the source for copying conditions. There is NO warranty; not even for MERCHANTABILITY or FITNESS FOR A PARTICULAR PURPOSE. Written by Tom Tromey <tromey@cygnus.com> Autoconf: Autoconf version 2.12 Libtool: ltmain.sh (GNU libtool) 1.4.2 (1.922.2.53 2001/09/11 03:18:52) Compiler: Reading specs from /misc/local/lib/gcc-lib/sparc-sun-solaris2.8/3.2.1/specs Configured with: ../configure --prefix=/misc/local --with-local-prefix=/misc/local --enable-language=c,c++ Thread model: posix gcc version 3.2.1 Bison: GNU Bison version 1.28 User's E-mail: James_Pittman at raytheon dot com ================================================================================ PHPINFO ================================================================================ phpinfo() PHP Version => 4.3.1 System => SunOS slpyvm.msd.ray.com 5.8 Generic_108528-15 sun4u Build Date => Mar 25 2003 11:34:13 Configure Command => 'configure' '--prefix=/misc/local' '--with-apxs2=/misc/apache2/bin/apxs' '--enable-force-cgi-redirect' '--enable-discard-path' '--enable-fastcgi' '--enable-debug' '--enable-calendar' '--enable-ftp' '--with-java=/misc/j2sdk1.4.1_01' '--with-ldap=/misc/local/ldapcsdk' '--with-oracle' Server API => Command Line Interface Virtual Directory Support => disabled Configuration File (php.ini) Path => /misc/local/lib PHP API => 20020918 PHP Extension => 20020429 Zend Extension => 20021010 Debug Build => yes Thread Safety => disabled Registered PHP Streams => php, http, ftp This program makes use of the Zend Scripting Language Engine: Zend Engine v1.3.0, Copyright (c) 1998-2002 Zend Technologies _______________________________________________________________________ Configuration PHP Core Directive => Local Value => Master Value allow_call_time_pass_reference => On => On allow_url_fopen => On => On always_populate_raw_post_data => Off => Off arg_separator.input => &amp; => &amp; arg_separator.output => &amp; => &amp; asp_tags => Off => Off auto_append_file => no value => no value auto_prepend_file => no value => no value browscap => no value => no value default_charset => no value => no value default_mimetype => text/html => text/html define_syslog_variables => Off => Off disable_functions => no value => no value display_errors => On => On display_startup_errors => Off => Off doc_root => no value => no value docref_ext => no value => no value docref_root => http://www.php.net/ => http://www.php.net/ enable_dl => On => On error_append_string => no value => no value error_log => no value => no value error_prepend_string => no value => no value error_reporting => no value => no value expose_php => On => On extension_dir => /misc/local/lib/php/extensions/debug-non-zts-20020429 => /misc/local/lib/php/extensions/debug-non-zts-20020429 file_uploads => On => On gpc_order => GPC => GPC highlight.bg => #FFFFFF => #FFFFFF highlight.comment => #FF8000 => #FF8000 highlight.default => #0000BB => #0000BB highlight.html => #000000 => #000000 highlight.keyword => #007700 => #007700 highlight.string => #DD0000 => #DD0000 html_errors => Off => On ignore_repeated_errors => Off => Off ignore_repeated_source => Off => Off ignore_user_abort => Off => Off implicit_flush => On => Off include_path => .:/misc/local/lib/php => .:/misc/local/lib/php log_errors => Off => Off log_errors_max_len => 1024 => 1024 magic_quotes_gpc => On => On magic_quotes_runtime => Off => Off magic_quotes_sybase => Off => Off max_execution_time => 0 => 30 max_input_time => -1 => -1 open_basedir => no value => no value output_buffering => 0 => 0 output_handler => no value => no value post_max_size => 8M => 8M precision => 14 => 14 register_argc_argv => On => On register_globals => Off => Off report_memleaks => On => On safe_mode => Off => Off safe_mode_exec_dir => 1 => 1 safe_mode_gid => Off => Off safe_mode_include_dir => no value => no value sendmail_from => no value => no value sendmail_path => /usr/lib/sendmail -t -i => /usr/lib/sendmail -t -i short_open_tag => On => On SMTP => localhost => localhost smtp_port => 25 => 25 sql.safe_mode => Off => Off track_errors => Off => Off unserialize_callback_func => no value => no value upload_max_filesize => 2M => 2M upload_tmp_dir => no value => no value user_dir => no value => no value variables_order => no value => no value xmlrpc_error_number => 0 => 0 xmlrpc_errors => Off => Off y2k_compliance => On => On ctype ctype functions => enabled mysql MySQL Support => enabled Active Persistent Links => 0 Active Links => 0 Client API version => 3.23.49 MYSQL_MODULE_TYPE => builtin MYSQL_SOCKET => /tmp/mysql.sock MYSQL_INCLUDE => MYSQL_LIBS => Directive => Local Value => Master Value mysql.allow_persistent => On => On mysql.connect_timeout => -1 => -1 mysql.default_host => no value => no value mysql.default_password => no value => no value mysql.default_port => no value => no value mysql.default_socket => no value => no value mysql.default_user => no value => no value mysql.max_links => Unlimited => Unlimited mysql.max_persistent => Unlimited => Unlimited mysql.trace_mode => Off => Off overload User-Space Object Overloading Support => enabled pcre PCRE (Perl Compatible Regular Expressions) Support => enabled PCRE Library Version => 3.92 11-Sep-2002 posix Revision => $Revision: 1.51 $ session Session Support => enabled Registered save handlers => files user Directive => Local Value => Master Value session.auto_start => Off => Off session.bug_compat_42 => On => On session.bug_compat_warn => On => On session.cache_expire => 180 => 180 session.cache_limiter => nocache => nocache session.cookie_domain => no value => no value session.cookie_lifetime => 0 => 0 session.cookie_path => / => / session.cookie_secure => Off => Off session.entropy_file => no value => no value session.entropy_length => 0 => 0 session.gc_dividend => 100 => 100 session.gc_maxlifetime => 1440 => 1440 session.gc_probability => 1 => 1 session.name => PHPSESSID => PHPSESSID session.referer_check => no value => no value session.save_handler => files => files session.save_path => /tmp => /tmp session.serialize_handler => php => php session.use_cookies => On => On session.use_only_cookies => Off => Off session.use_trans_sid => Off => Off standard Regex Library => Bundled library enabled Dynamic Library Support => enabled Path to sendmail => /usr/lib/sendmail -t -i Directive => Local Value => Master Value assert.active => 1 => 1 assert.bail => 0 => 0 assert.callback => no value => no value assert.quiet_eval => 0 => 0 assert.warning => 1 => 1 auto_detect_line_endings => 0 => 0 default_socket_timeout => 60 => 60 safe_mode_allowed_env_vars => PHP_ => PHP_ safe_mode_protected_env_vars => LD_LIBRARY_PATH => LD_LIBRARY_PATH url_rewriter.tags => a=href,area=href,frame=src,form=,fieldset= => a=href,area=href,frame=src,form=,fieldset= user_agent => no value => no value tokenizer Tokenizer Support => enabled xml XML Support => active XML Namespace Support => active EXPAT Version => 1.95.2 Additional Modules Module Name Environment Variable => Value AB2_DEFAULTSERVER => http://7149web.msd.ray.com:8888/ BASEDIR => /misc/jakarta-tomcat-4.1.18 CATALINA_HOME => /misc/jakarta-tomcat-4.1.18 CC => gcc CLASSPATH => /misc/j2sdk1.4.1_01/lib CONTENT_LENGTH => CONTENT_TYPE => DISPLAY => 138.127.192.163:0.0 EDITOR => vi EXINIT => set redraw wm=8 HOME => / HZ => 100 II_SYSTEM => /nfs/links/ingres.solaris JAVA_HOME => /misc/j2sdk1.4.1_01 LD_LIBRARY_PATH => /misc/app/oracle/product/8.1.7/lib:/misc/app/oracle/jre/1.1.8/lib/sparc/native_threads:/usr/lib:/usr/openwin/lib:/nfs/links/uimx.sparc/lib:/nfs/links/ingres.solaris/ingres/lib:/usr/dt/lib:/usr/ucblib:/misc/local/lib:/misc/local/ldapcsdk/lib LOGNAME => root MAIL => /usr/spool/mail/root MAKEFLAGS => MAKELEVEL => 1 MANPATH => /usr/man:/usr/openwin/man:/opt/SUNWspro/man:/opt/SUNWste/license_tools/man:/usr/local/man MFLAGS => NNTPSERVER => nntp.ext.ray.com ORACLE_BASE => /misc/app/oracle ORACLE_HOME => /misc/app/oracle/product/8.1.7 ORACLE_SID => oracle PATH => //bin:/usr/ucb:/bin:/usr/bin:/usr/local:/usr/new:/usr/hosts:/misc/local/sbin:/misc/local/bin:/misc/apache2/bin:/opt/Acrobat3/bin:/usr/sbin:/usr/bin:/usr/bin/X11:/local/bin:/etc:/usr/etc:/local/sdf/bin:/local/tools/bin:/local/ptools/bin:/usr/lib/X11:/usr/openwin/bin:/local/gnu/bin:/usr/xpg4/bin:/usr/ccs/bin:/opt/SUNWspro/bin:/usr/ucb:.:/users/jfv/bin:/users/xtools:/nfs/links/ingres.solaris/ingres/bin:/nfs/links/ingres.sparc/ingres/bin:/users/patada/bin:/home/patsdf/usables/PERL:/home/patsdf/usables://bin://bin/sun5:/home/bmh/TOOLS/NBSHELL/NBCAT/SUN:/home/jlp/Stuff/:/misc/app/oracle/product/8.1.7/bin:/misc/app/oracle/product/8.1.7/lib:. PATH_TRANSLATED => PWD => /misc/php-4.3.1 QUERY_STRING => RDIR => . REDIRECT_STATUS => REQUEST_METHOD => SCRIPT_FILENAME => SDC_TOOLS => /local/tools SHELL => /bin/sh TERM => xterm TERM_INGRES => sune TEST_PHP_EXECUTABLE => /misc/php-4.3.1/sapi/cli/php TEST_PHP_SRCDIR => /misc/php-4.3.1 TZ => US/Eastern UIMXDIR => /opt/uimx29 USER => root WWW_HOME => /home/jlp/.netscape/home_page.html ftp_proxy => http://ftp.ext.ray.com:21/ http_proxy => http://proxy.ext.ray.com:80/ no_proxy => .ray.com,localhost socks_proxy => http://socks.ext.ray.com:1080/ telnet_proxy => http://telnet.ext.ray.com/ user_home => / PHP Variables Variable => Value _SERVER["AB2_DEFAULTSERVER"] => http://7149web.msd.ray.com:8888/ _SERVER["BASEDIR"] => /misc/jakarta-tomcat-4.1.18 _SERVER["CATALINA_HOME"] => /misc/jakarta-tomcat-4.1.18 _SERVER["CC"] => gcc _SERVER["CLASSPATH"] => /misc/j2sdk1.4.1_01/lib _SERVER["CONTENT_LENGTH"] => _SERVER["CONTENT_TYPE"] => _SERVER["DISPLAY"] => 138.127.192.163:0.0 _SERVER["EDITOR"] => vi _SERVER["EXINIT"] => set redraw wm=8 _SERVER["HOME"] => / _SERVER["HZ"] => 100 _SERVER["II_SYSTEM"] => /nfs/links/ingres.solaris _SERVER["JAVA_HOME"] => /misc/j2sdk1.4.1_01 _SERVER["LD_LIBRARY_PATH"] => /misc/app/oracle/product/8.1.7/lib:/misc/app/oracle/jre/1.1.8/lib/sparc/native_threads:/usr/lib:/usr/openwin/lib:/nfs/links/uimx.sparc/lib:/nfs/links/ingres.solaris/ingres/lib:/usr/dt/lib:/usr/ucblib:/misc/local/lib:/misc/local/ldapcsdk/lib _SERVER["LOGNAME"] => root _SERVER["MAIL"] => /usr/spool/mail/root _SERVER["MAKEFLAGS"] => _SERVER["MAKELEVEL"] => 1 _SERVER["MANPATH"] => /usr/man:/usr/openwin/man:/opt/SUNWspro/man:/opt/SUNWste/license_tools/man:/usr/local/man _SERVER["MFLAGS"] => _SERVER["NNTPSERVER"] => nntp.ext.ray.com _SERVER["ORACLE_BASE"] => /misc/app/oracle _SERVER["ORACLE_HOME"] => /misc/app/oracle/product/8.1.7 _SERVER["ORACLE_SID"] => oracle _SERVER["PATH"] => //bin:/usr/ucb:/bin:/usr/bin:/usr/local:/usr/new:/usr/hosts:/misc/local/sbin:/misc/local/bin:/misc/apache2/bin:/opt/Acrobat3/bin:/usr/sbin:/usr/bin:/usr/bin/X11:/local/bin:/etc:/usr/etc:/local/sdf/bin:/local/tools/bin:/local/ptools/bin:/usr/lib/X11:/usr/openwin/bin:/local/gnu/bin:/usr/xpg4/bin:/usr/ccs/bin:/opt/SUNWspro/bin:/usr/ucb:.:/users/jfv/bin:/users/xtools:/nfs/links/ingres.solaris/ingres/bin:/nfs/links/ingres.sparc/ingres/bin:/users/patada/bin:/home/patsdf/usables/PERL:/home/patsdf/usables://bin://bin/sun5:/home/bmh/TOOLS/NBSHELL/NBCAT/SUN:/home/jlp/Stuff/:/misc/app/oracle/product/8.1.7/bin:/misc/app/oracle/product/8.1.7/lib:. _SERVER["PATH_TRANSLATED"] => _SERVER["PWD"] => /misc/php-4.3.1 _SERVER["QUERY_STRING"] => _SERVER["RDIR"] => . _SERVER["REDIRECT_STATUS"] => _SERVER["REQUEST_METHOD"] => _SERVER["SCRIPT_FILENAME"] => _SERVER["SDC_TOOLS"] => /local/tools _SERVER["SHELL"] => /bin/sh _SERVER["TERM"] => xterm _SERVER["TERM_INGRES"] => sune _SERVER["TEST_PHP_EXECUTABLE"] => /misc/php-4.3.1/sapi/cli/php _SERVER["TEST_PHP_SRCDIR"] => /misc/php-4.3.1 _SERVER["TZ"] => US/Eastern _SERVER["UIMXDIR"] => /opt/uimx29 _SERVER["USER"] => root _SERVER["WWW_HOME"] => /home/jlp/.netscape/home_page.html _SERVER["ftp_proxy"] => http://ftp.ext.ray.com:21/ _SERVER["http_proxy"] => http://proxy.ext.ray.com:80/ _SERVER["no_proxy"] => .ray.com,localhost _SERVER["socks_proxy"] => http://socks.ext.ray.com:1080/ _SERVER["telnet_proxy"] => http://telnet.ext.ray.com/ _SERVER["user_home"] => / _SERVER["PHP_SELF"] => _SERVER["SCRIPT_NAME"] => _SERVER["DOCUMENT_ROOT"] => _SERVER["argv"] => Array ( ) _SERVER["argc"] => 0 _ENV["AB2_DEFAULTSERVER"] => http://7149web.msd.ray.com:8888/ _ENV["BASEDIR"] => /misc/jakarta-tomcat-4.1.18 _ENV["CATALINA_HOME"] => /misc/jakarta-tomcat-4.1.18 _ENV["CC"] => gcc _ENV["CLASSPATH"] => /misc/j2sdk1.4.1_01/lib _ENV["CONTENT_LENGTH"] => _ENV["CONTENT_TYPE"] => _ENV["DISPLAY"] => 138.127.192.163:0.0 _ENV["EDITOR"] => vi _ENV["EXINIT"] => set redraw wm=8 _ENV["HOME"] => / _ENV["HZ"] => 100 _ENV["II_SYSTEM"] => /nfs/links/ingres.solaris _ENV["JAVA_HOME"] => /misc/j2sdk1.4.1_01 _ENV["LD_LIBRARY_PATH"] => /misc/app/oracle/product/8.1.7/lib:/misc/app/oracle/jre/1.1.8/lib/sparc/native_threads:/usr/lib:/usr/openwin/lib:/nfs/links/uimx.sparc/lib:/nfs/links/ingres.solaris/ingres/lib:/usr/dt/lib:/usr/ucblib:/misc/local/lib:/misc/local/ldapcsdk/lib _ENV["LOGNAME"] => root _ENV["MAIL"] => /usr/spool/mail/root _ENV["MAKEFLAGS"] => _ENV["MAKELEVEL"] => 1 _ENV["MANPATH"] => /usr/man:/usr/openwin/man:/opt/SUNWspro/man:/opt/SUNWste/license_tools/man:/usr/local/man _ENV["MFLAGS"] => _ENV["NNTPSERVER"] => nntp.ext.ray.com _ENV["ORACLE_BASE"] => /misc/app/oracle _ENV["ORACLE_HOME"] => /misc/app/oracle/product/8.1.7 _ENV["ORACLE_SID"] => oracle _ENV["PATH"] => //bin:/usr/ucb:/bin:/usr/bin:/usr/local:/usr/new:/usr/hosts:/misc/local/sbin:/misc/local/bin:/misc/apache2/bin:/opt/Acrobat3/bin:/usr/sbin:/usr/bin:/usr/bin/X11:/local/bin:/etc:/usr/etc:/local/sdf/bin:/local/tools/bin:/local/ptools/bin:/usr/lib/X11:/usr/openwin/bin:/local/gnu/bin:/usr/xpg4/bin:/usr/ccs/bin:/opt/SUNWspro/bin:/usr/ucb:.:/users/jfv/bin:/users/xtools:/nfs/links/ingres.solaris/ingres/bin:/nfs/links/ingres.sparc/ingres/bin:/users/patada/bin:/home/patsdf/usables/PERL:/home/patsdf/usables://bin://bin/sun5:/home/bmh/TOOLS/NBSHELL/NBCAT/SUN:/home/jlp/Stuff/:/misc/app/oracle/product/8.1.7/bin:/misc/app/oracle/product/8.1.7/lib:. _ENV["PATH_TRANSLATED"] => _ENV["PWD"] => /misc/php-4.3.1 _ENV["QUERY_STRING"] => _ENV["RDIR"] => . _ENV["REDIRECT_STATUS"] => _ENV["REQUEST_METHOD"] => _ENV["SCRIPT_FILENAME"] => _ENV["SDC_TOOLS"] => /local/tools _ENV["SHELL"] => /bin/sh _ENV["TERM"] => xterm _ENV["TERM_INGRES"] => sune _ENV["TEST_PHP_EXECUTABLE"] => /misc/php-4.3.1/sapi/cli/php _ENV["TEST_PHP_SRCDIR"] => /misc/php-4.3.1 _ENV["TZ"] => US/Eastern _ENV["UIMXDIR"] => /opt/uimx29 _ENV["USER"] => root _ENV["WWW_HOME"] => /home/jlp/.netscape/home_page.html _ENV["ftp_proxy"] => http://ftp.ext.ray.com:21/ _ENV["http_proxy"] => http://proxy.ext.ray.com:80/ _ENV["no_proxy"] => .ray.com,localhost _ENV["socks_proxy"] => http://socks.ext.ray.com:1080/ _ENV["telnet_proxy"] => http://telnet.ext.ray.com/ _ENV["user_home"] => / PHP License This program is free software; you can redistribute it and/or modify it under the terms of the PHP License as published by the PHP Group and included in the distribution in the file: LICENSE This program is distributed in the hope that it will be useful, but WITHOUT ANY WARRANTY; without even the implied warranty of MERCHANTABILITY or FITNESS FOR A PARTICULAR PURPOSE. If you did not receive a copy of the PHP license, or have any questions about PHP licensing, please contact license@php.net.

« previous php.qa (#12201) next »