Test results for 4.3.2-RC2 [failed]
| From: | noreply@php.net | Date: | Thu, 08 May 2003 21:41:28 +0000 |
| Subject: | Test results for 4.3.2-RC2 [failed] | ||
| Groups: | php.qa | ||
| Request: | Send a blank email to php-qa+get-12203@lists.php.net to get a copy of this message | ||
=====================================================================
FAILED TEST SUMMARY
---------------------------------------------------------------------
DBA Insert/Fetch Test [ext/dba/tests/dba002.phpt] (info: CDB_MAKE handler used)
DBA Insert/Replace/Fetch Test [ext/dba/tests/dba003.phpt] (info: CDB_MAKE handler used)
DBA Multiple Insert/Fetch Test [ext/dba/tests/dba004.phpt] (info: CDB_MAKE handler used)
DBA FirstKey/NextKey Loop Test With 5 Items [ext/dba/tests/dba005.phpt] (info: CDB_MAKE handler
used)
DBA FirstKey/NextKey with 2 deletes [ext/dba/tests/dba006.phpt] (info: CDB_MAKE handler used)
DBA magic_quotes_runtime Test [ext/dba/tests/dba008.phpt] (info: CDB_MAKE handler used)
DBA dba_popen Test [ext/dba/tests/dba009.phpt] (info: CDB_MAKE handler used)
strtotime() function [ext/standard/tests/time/002.phpt]
Check for mktime with out-of-range parameters [ext/standard/tests/time/003.phpt]
mktime() [ext/standard/tests/time/mktime.phpt]
=====================================================================
=====================================================================
TEST RESULT SUMMARY
---------------------------------------------------------------------
Exts skipped : 76
Exts tested : 11
---------------------------------------------------------------------
Number of tests : 469
Tests skipped : 217 (46.3%)
Tests failed : 10 ( 2.1%)
Tests passed : 242 (51.6%)
---------------------------------------------------------------------
Time taken : 25 seconds
=====================================================================
================================================================================
/var/home/lyle/php-4.3.2RC2/ext/dba/tests/dba002.phpt
================================================================================
---- EXPECTED OUTPUT
database handler: %s
This is a test insert
---- ACTUAL OUTPUT
database handler: cdb_make
---- FAILED
================================================================================
001- database handler: %s
001+ database handler: cdb_make
002- This is a test insert
================================================================================
================================================================================
/var/home/lyle/php-4.3.2RC2/ext/dba/tests/dba003.phpt
================================================================================
---- EXPECTED OUTPUT
database handler: %s
This is the replacement text
---- ACTUAL OUTPUT
database handler: cdb_make
---- FAILED
================================================================================
001- database handler: %s
001+ database handler: cdb_make
002- This is the replacement text
================================================================================
================================================================================
/var/home/lyle/php-4.3.2RC2/ext/dba/tests/dba004.phpt
================================================================================
---- EXPECTED OUTPUT
database handler: %s
Another Content String Content String 2
---- ACTUAL OUTPUT
database handler: cdb_make
---- FAILED
================================================================================
001- database handler: %s
001+ database handler: cdb_make
002- Another Content String Content String 2
================================================================================
================================================================================
/var/home/lyle/php-4.3.2RC2/ext/dba/tests/dba005.phpt
================================================================================
---- EXPECTED OUTPUT
database handler: %s
5YYYYY
---- ACTUAL OUTPUT
database handler: cdb_make
0NNNNN
---- FAILED
================================================================================
001- database handler: %s
001+ database handler: cdb_make
002- 5YYYYY
002+ 0NNNNN
================================================================================
================================================================================
/var/home/lyle/php-4.3.2RC2/ext/dba/tests/dba006.phpt
================================================================================
---- EXPECTED OUTPUT
database handler: %s
3NYNYY
---- ACTUAL OUTPUT
database handler: cdb_make
0NNNNN
---- FAILED
================================================================================
001- database handler: %s
001+ database handler: cdb_make
002- 3NYNYY
002+ 0NNNNN
================================================================================
================================================================================
/var/home/lyle/php-4.3.2RC2/ext/dba/tests/dba008.phpt
================================================================================
---- EXPECTED OUTPUT
database handler: %s
string(1) """
string(2) "\""
string(2) "\""
string(1) """
---- ACTUAL OUTPUT
database handler: cdb_make
bool(false)
bool(false)
bool(false)
bool(false)
---- FAILED
================================================================================
001- database handler: %s
001+ database handler: cdb_make
002- string(1) """
002+ bool(false)
003- string(2) "\""
003+ bool(false)
004- string(2) "\""
004+ bool(false)
005- string(1) """
005+ bool(false)
================================================================================
================================================================================
/var/home/lyle/php-4.3.2RC2/ext/dba/tests/dba009.phpt
================================================================================
---- EXPECTED OUTPUT
database handler: %s
Opened
Inserted
Closed
Opened
Inserted
---- ACTUAL OUTPUT
database handler: cdb_make
Opened
Closed
Opened
---- FAILED
================================================================================
001- database handler: %s
001+ database handler: cdb_make
003- Inserted
003+
006- Inserted
================================================================================
================================================================================
/var/home/lyle/php-4.3.2RC2/ext/standard/tests/time/002.phpt
================================================================================
---- EXPECTED OUTPUT
1999-10-13 00:00:00
1999-10-13 00:00:00
2000-01-19 00:00:00
2000-01-19 00:00:00
2001-12-21 00:00:00
2001-12-21 00:00:00
2001-12-21 12:16:00
2001-12-21 12:16:00
1969-12-31 23:59:59
2001-10-22 21:19:58
2001-10-22 23:19:58
2001-10-22 23:32:58
2001-10-22 19:19:58
2001-10-22 19:06:58
1999-10-13 00:00:00
1999-10-13 00:00:00
2000-01-19 00:00:00
2000-01-19 00:00:00
2001-12-21 00:00:00
2001-12-21 00:00:00
2001-12-21 12:16:00
2001-12-21 12:16:00
1969-12-31 18:59:59
2001-10-22 21:19:58
2001-10-22 19:19:58
2001-10-22 19:32:58
2001-10-22 15:19:58
2001-10-22 15:06:58
---- ACTUAL OUTPUT
1999-10-13 00:00:00
1999-10-13 00:00:00
2000-01-19 00:00:00
2000-01-19 00:00:00
2001-12-21 00:00:00
2001-12-21 00:00:00
2001-12-21 12:16:00
2001-12-21 12:16:00
1969-12-31 23:59:59
2001-10-22 21:19:58
2001-10-22 23:19:58
2001-10-22 23:32:58
2001-10-22 19:19:58
2001-10-22 19:06:58
1999-10-13 00:00:00
1999-10-13 00:00:00
2000-01-19 00:00:00
2000-01-19 00:00:00
2001-12-21 00:00:00
2001-12-21 00:00:00
2001-12-21 12:16:00
2001-12-21 12:16:00
1969-12-31 23:59:59
2001-10-22 21:19:58
2001-10-22 23:19:58
2001-10-22 23:32:58
2001-10-22 19:19:58
2001-10-22 19:06:58
---- FAILED
================================================================================
023- 1969-12-31 18:59:59
023+ 1969-12-31 23:59:59
025- 2001-10-22 19:19:58
025+ 2001-10-22 23:19:58
026- 2001-10-22 19:32:58
026+ 2001-10-22 23:32:58
027- 2001-10-22 15:19:58
027+ 2001-10-22 19:19:58
028- 2001-10-22 15:06:58
028+ 2001-10-22 19:06:58
================================================================================
================================================================================
/var/home/lyle/php-4.3.2RC2/ext/standard/tests/time/003.phpt
================================================================================
---- EXPECTED OUTPUT
2000-02-29
2000-02-28
2000-02-29
2001-02-28
2001-03-01
1999-11-30
2000-05-29 12:00:00
2000-05-29 13:00:00
2000-05-29 12:00:00
2000-01-31 12:00:00
2000-01-31 12:00:00
2000-01-31 11:00:00
2000-04-29 12:00:00
2000-04-29 13:00:00
2000-04-29 12:00:00
---- ACTUAL OUTPUT
2000-02-29
2000-02-28
2000-02-29
2001-02-28
2001-03-01
1999-11-30
2000-05-29 12:00:00
2000-05-29 07:00:00
2000-05-29 12:00:00
2000-01-31 12:00:00
2000-01-31 06:00:00
2000-01-31 11:00:00
2000-04-29 12:00:00
2000-04-29 07:00:00
2000-04-29 12:00:00
---- FAILED
================================================================================
008- 2000-05-29 13:00:00
008+ 2000-05-29 07:00:00
011- 2000-01-31 12:00:00
011+ 2000-01-31 06:00:00
014- 2000-04-29 13:00:00
014+ 2000-04-29 07:00:00
================================================================================
================================================================================
/var/home/lyle/php-4.3.2RC2/ext/standard/tests/time/mktime.phpt
================================================================================
---- EXPECTED OUTPUT
int(1009843200)
int(1009843200)
int(1009843200)
int(1009843200)
int(1025481600)
int(1025481600)
int(1025481600)
int(1025481600)
int(1009839600)
int(1009839600)
int(1009839600)
int(1009836000)
int(1025474400)
int(1025474400)
int(1025478000)
int(1025474400)
---- ACTUAL OUTPUT
int(1009843200)
int(1009843200)
int(1009843200)
int(-3662)
int(1025481600)
int(1025481600)
int(1025481600)
int(-3662)
int(1009839600)
int(1009839600)
int(1009839600)
int(1009857600)
int(1025474400)
int(1025474400)
int(1025456400)
int(1025474400)
---- FAILED
================================================================================
004- int(1009843200)
004+ int(-3662)
008- int(1025481600)
008+ int(-3662)
012- int(1009836000)
012+ int(1009857600)
015- int(1025478000)
015+ int(1025456400)
================================================================================
================================================================================
BUILD ENVIRONMENT
================================================================================
OS:
FreeBSD
Automake:
Autoconf:
Libtool:
ltmain.sh (GNU libtool) 1.4.3 (1.922.2.110 2002/10/23 01:39:54)
Compiler:
Using builtin specs.
gcc version 2.95.4 20020320 [FreeBSD]
Bison:
Libraries:
/var/home/lyle/php-4.3.2RC2/sapi/cli/php:
libcrypt.so.2 => /usr/lib/libcrypt.so.2 (0x28170000)
libdb-4.1.so => /usr/local/BerkeleyDB/lib/libdb-4.1.so (0x28189000)
libz.so.2 => /usr/lib/libz.so.2 (0x28225000)
libm.so.2 => /usr/lib/libm.so.2 (0x28232000)
libcurl.so.2 => /usr/local/lib/libcurl.so.2 (0x2824d000)
libssl.so.2 => /usr/lib/libssl.so.2 (0x2826f000)
libcrypto.so.2 => /usr/lib/libcrypto.so.2 (0x2829c000)
libc.so.4 => /usr/lib/libc.so.4 (0x28354000)
User's E-mail:
================================================================================
PHPINFO
================================================================================
phpinfo()
PHP Version => 4.3.2-RC2
System => FreeBSD sf106.cometsystems.com 4.7-RELEASE FreeBSD 4.7-RELEASE #0: Mon Apr i386
Build Date => May 8 2003 17:15:37
Configure Command => './configure' '--with-db3=/usr/local/BerkeleyDB'
'--with-xml' '--with-apxs=/usr/local/apache/bin/apxs'
'--without-mysql' '--with-curl' '--disable-ipv6'
'--with-zlib' '--with-cdb' '../php-4.3.2RC2.configure.stdout4'
Server API => Command Line Interface
Virtual Directory Support => disabled
Configuration File (php.ini) Path => /usr/local/lib/php.ini
PHP API => 20020918
PHP Extension => 20020429
Zend Extension => 20021010
Debug Build => no
Thread Safety => disabled
Registered PHP Streams => php, http, ftp, compress.zlib
This program makes use of the Zend Scripting Language Engine:
Zend Engine v1.3.0, Copyright (c) 1998-2003 Zend Technologies
_______________________________________________________________________
Configuration
PHP Core
Directive => Local Value => Master Value
allow_call_time_pass_reference => On => On
allow_url_fopen => On => On
always_populate_raw_post_data => Off => Off
arg_separator.input => & => &
arg_separator.output => & => &
asp_tags => Off => Off
auto_append_file => no value => no value
auto_prepend_file => no value => no value
browscap => no value => no value
default_charset => no value => no value
default_mimetype => text/html => text/html
define_syslog_variables => Off => Off
disable_classes => no value => no value
disable_functions => no value => no value
display_errors => Off => Off
display_startup_errors => Off => Off
doc_root => no value => no value
docref_ext => no value => no value
docref_root => no value => no value
enable_dl => On => On
error_append_string => no value => no value
error_log => /var/log/httpd/php.log => /var/log/httpd/php.log
error_prepend_string => no value => no value
error_reporting => 8 => 8
expose_php => On => On
extension_dir => /usr/local/lib/php/extensions => /usr/local/lib/php/extensions
file_uploads => Off => Off
gpc_order => GPC => GPC
highlight.bg => #FFFFFF => #FFFFFF
highlight.comment => #FF9900 => #FF9900
highlight.default => #0000CC => #0000CC
highlight.html => #000000 => #000000
highlight.keyword => #006600 => #006600
highlight.string => #CC0000 => #CC0000
html_errors => Off => On
ignore_repeated_errors => Off => Off
ignore_repeated_source => Off => Off
ignore_user_abort => Off => Off
implicit_flush => On => Off
include_path => .:/usr/local/lib/php:/home/apache/support =>
.:/usr/local/lib/php:/home/apache/support
log_errors => On => On
log_errors_max_len => 1024 => 1024
magic_quotes_gpc => Off => Off
magic_quotes_runtime => Off => Off
magic_quotes_sybase => Off => Off
max_execution_time => 0 => 30
max_input_time => -1 => -1
open_basedir => no value => no value
output_buffering => no value => no value
output_handler => no value => no value
post_max_size => 8M => 8M
precision => 14 => 14
register_argc_argv => On => On
register_globals => On => On
report_memleaks => On => On
safe_mode => Off => Off
safe_mode_exec_dir => no value => no value
safe_mode_gid => Off => Off
safe_mode_include_dir => no value => no value
sendmail_from => me@localhost.com => me@localhost.com
sendmail_path => /usr/sbin/sendmail -t -i => /usr/sbin/sendmail -t -i
short_open_tag => On => On
SMTP => localhost => localhost
smtp_port => 25 => 25
sql.safe_mode => Off => Off
track_errors => Off => Off
unserialize_callback_func => no value => no value
upload_max_filesize => 2M => 2M
upload_tmp_dir => no value => no value
user_dir => no value => no value
variables_order => EGPCS => EGPCS
xmlrpc_error_number => 0 => 0
xmlrpc_errors => Off => Off
y2k_compliance => Off => Off
ctype
ctype functions => enabled
curl
CURL support => enabled
CURL Information => libcurl/7.10.3 OpenSSL/0.9.6g zlib/1.1.3
dba
DBA support => enabled
Supported handlers => cdb cdb_make db3
overload
User-Space Object Overloading Support => enabled
pcre
PCRE (Perl Compatible Regular Expressions) Support => enabled
PCRE Library Version => 3.92 11-Sep-2002
posix
Revision => $Revision: 1.51.2.2 $
session
Session Support => enabled
Registered save handlers => files user
Directive => Local Value => Master Value
session.auto_start => Off => Off
session.bug_compat_42 => On => On
session.bug_compat_warn => On => On
session.cache_expire => 180 => 180
session.cache_limiter => nocache => nocache
session.cookie_domain => no value => no value
session.cookie_lifetime => 0 => 0
session.cookie_path => / => /
session.cookie_secure => Off => Off
session.entropy_file => no value => no value
session.entropy_length => 0 => 0
session.gc_divisor => 100 => 100
session.gc_maxlifetime => 1440 => 1440
session.gc_probability => 1 => 1
session.name => PHPSESSID => PHPSESSID
session.referer_check => no value => no value
session.save_handler => files => files
session.save_path => /tmp => /tmp
session.serialize_handler => php => php
session.use_cookies => On => On
session.use_only_cookies => Off => Off
session.use_trans_sid => On => On
standard
Regex Library => Bundled library enabled
Dynamic Library Support => enabled
Path to sendmail => /usr/sbin/sendmail -t -i
Directive => Local Value => Master Value
assert.active => 1 => 1
assert.bail => 0 => 0
assert.callback => no value => no value
assert.quiet_eval => 0 => 0
assert.warning => 1 => 1
auto_detect_line_endings => 0 => 0
default_socket_timeout => 60 => 60
safe_mode_allowed_env_vars => PHP_ => PHP_
safe_mode_protected_env_vars => LD_LIBRARY_PATH => LD_LIBRARY_PATH
url_rewriter.tags => a=href,area=href,frame=src,input=src,form=fakeentry =>
a=href,area=href,frame=src,input=src,form=fakeentry
user_agent => no value => no value
tokenizer
Tokenizer Support => enabled
xml
XML Support => active
XML Namespace Support => active
EXPAT Version => 1.95.2
zlib
ZLib Support => enabled
Compiled Version => 1.1.3
Linked Version => 1.1.3
Directive => Local Value => Master Value
zlib.output_compression => Off => Off
zlib.output_compression_level => -1 => -1
zlib.output_handler => no value => no value
Additional Modules
Module Name
Environment
Variable => Value
CONTENT_TYPE =>
HISTFILESIZE => 0
SSH_CLIENT => 198.65.220.81 1677 22
USER => lyle
MAIL => /var/mail/lyle
SHLVL => 1
QUERY_STRING =>
OLDPWD => /home/lyle/php-4.3.2RC2/ext/dba
HOME => /home/lyle
TEST_PHP_SRCDIR => /var/home/lyle/php-4.3.2RC2
SSH_TTY => /dev/ttyp0
CONTENT_LENGTH =>
SCRIPT_FILENAME =>
PATH_TRANSLATED =>
LOGNAME => lyle
_ => /usr/bin/make
TEST_PHP_EXECUTABLE => /var/home/lyle/php-4.3.2RC2/sapi/cli/php
TERM => vt100
BLOCKSIZE => K
LC_COLLATE => POSIX
PATH =>
/sbin:/bin:/usr/sbin:/usr/bin:/usr/games:/usr/local/sbin:/usr/local/bin:/usr/X11R6/bin:/home/lyle/bin:/home/lyle/tools/bin
CFLAGS => -O2
SSH_AUTH_SOCK => /tmp/ssh-pXZ0u4Se/agent.70191
SHELL => /usr/local/bin/bash
REDIRECT_STATUS =>
REQUEST_METHOD =>
PWD => /home/lyle/php-4.3.2RC2
FTP_PASSIVE_MODE => YES
CC => gcc
EDITOR => vi
PHP Variables
Variable => Value
PHP_SELF =>
_SERVER["CONTENT_TYPE"] =>
_SERVER["HISTFILESIZE"] => 0
_SERVER["SSH_CLIENT"] => 198.65.220.81 1677 22
_SERVER["USER"] => lyle
_SERVER["MAIL"] => /var/mail/lyle
_SERVER["SHLVL"] => 1
_SERVER["QUERY_STRING"] =>
_SERVER["OLDPWD"] => /home/lyle/php-4.3.2RC2/ext/dba
_SERVER["HOME"] => /home/lyle
_SERVER["TEST_PHP_SRCDIR"] => /var/home/lyle/php-4.3.2RC2
_SERVER["SSH_TTY"] => /dev/ttyp0
_SERVER["CONTENT_LENGTH"] =>
_SERVER["SCRIPT_FILENAME"] =>
_SERVER["PATH_TRANSLATED"] =>
_SERVER["LOGNAME"] => lyle
_SERVER["_"] => /usr/bin/make
_SERVER["TEST_PHP_EXECUTABLE"] => /var/home/lyle/php-4.3.2RC2/sapi/cli/php
_SERVER["TERM"] => vt100
_SERVER["BLOCKSIZE"] => K
_SERVER["LC_COLLATE"] => POSIX
_SERVER["PATH"] =>
/sbin:/bin:/usr/sbin:/usr/bin:/usr/games:/usr/local/sbin:/usr/local/bin:/usr/X11R6/bin:/home/lyle/bin:/home/lyle/tools/bin
_SERVER["CFLAGS"] => -O2
_SERVER["SSH_AUTH_SOCK"] => /tmp/ssh-pXZ0u4Se/agent.70191
_SERVER["SHELL"] => /usr/local/bin/bash
_SERVER["REDIRECT_STATUS"] =>
_SERVER["REQUEST_METHOD"] =>
_SERVER["PWD"] => /home/lyle/php-4.3.2RC2
_SERVER["FTP_PASSIVE_MODE"] => YES
_SERVER["CC"] => gcc
_SERVER["EDITOR"] => vi
_SERVER["PHP_SELF"] =>
_SERVER["SCRIPT_NAME"] =>
_SERVER["DOCUMENT_ROOT"] =>
_SERVER["argv"] => Array
(
)
_SERVER["argc"] => 0
_ENV["CONTENT_TYPE"] =>
_ENV["HISTFILESIZE"] => 0
_ENV["SSH_CLIENT"] => 198.65.220.81 1677 22
_ENV["USER"] => lyle
_ENV["MAIL"] => /var/mail/lyle
_ENV["SHLVL"] => 1
_ENV["QUERY_STRING"] =>
_ENV["OLDPWD"] => /home/lyle/php-4.3.2RC2/ext/dba
_ENV["HOME"] => /home/lyle
_ENV["TEST_PHP_SRCDIR"] => /var/home/lyle/php-4.3.2RC2
_ENV["SSH_TTY"] => /dev/ttyp0
_ENV["CONTENT_LENGTH"] =>
_ENV["SCRIPT_FILENAME"] =>
_ENV["PATH_TRANSLATED"] =>
_ENV["LOGNAME"] => lyle
_ENV["_"] => /usr/bin/make
_ENV["TEST_PHP_EXECUTABLE"] => /var/home/lyle/php-4.3.2RC2/sapi/cli/php
_ENV["TERM"] => vt100
_ENV["BLOCKSIZE"] => K
_ENV["LC_COLLATE"] => POSIX
_ENV["PATH"] =>
/sbin:/bin:/usr/sbin:/usr/bin:/usr/games:/usr/local/sbin:/usr/local/bin:/usr/X11R6/bin:/home/lyle/bin:/home/lyle/tools/bin
_ENV["CFLAGS"] => -O2
_ENV["SSH_AUTH_SOCK"] => /tmp/ssh-pXZ0u4Se/agent.70191
_ENV["SHELL"] => /usr/local/bin/bash
_ENV["REDIRECT_STATUS"] =>
_ENV["REQUEST_METHOD"] =>
_ENV["PWD"] => /home/lyle/php-4.3.2RC2
_ENV["FTP_PASSIVE_MODE"] => YES
_ENV["CC"] => gcc
_ENV["EDITOR"] => vi
PHP License
This program is free software; you can redistribute it and/or modify
it under the terms of the PHP License as published by the PHP Group
and included in the distribution in the file: LICENSE
This program is distributed in the hope that it will be useful,
but WITHOUT ANY WARRANTY; without even the implied warranty of
MERCHANTABILITY or FITNESS FOR A PARTICULAR PURPOSE.
If you did not receive a copy of the PHP license, or have any
questions about PHP licensing, please contact license@php.net.