Test results for 5.0.0-dev [failed]
| From: | noreply@php.net | Date: | Thu, 08 May 2003 22:26:15 +0000 |
| Subject: | Test results for 5.0.0-dev [failed] | ||
| Groups: | php.qa | ||
| Request: | Send a blank email to php-qa+get-12205@lists.php.net to get a copy of this message | ||
=====================================================================
FAILED TEST SUMMARY
---------------------------------------------------------------------
ZE2 __clone() [tests/classes/__clone_001.phpt]
Methods via variable name, bug #20120 [tests/classes/bug20120.phpt]
Bug #21094 (set_error_handler not accepting methods) [tests/lang/bug21094.phpt]
Bug #21800 (Segfault under interactive mode) [tests/lang/bug21800.phpt]
Bug #21849 (self::constant doesn't work as method's default parameter)
[tests/lang/bug21849.phpt]
Bug #22367 (weird zval allocation problem) [tests/lang/bug22367.phpt]
Bug #22592 (cascading assignments to strings with curly braces broken) [tests/lang/bug22592.phpt]
xmldoc() [ext/domxml/tests/xmldoc.phpt]
gdimagefill() function (Bug #19366 (fixed in bundled libgd)) [ext/gd/tests/bug19366.phpt]
session object deserialization [ext/session/tests/003.phpt]
session_set_save_handler test [ext/session/tests/004.phpt]
custom save handler, multiple session_start()s, complex data structure test.
[ext/session/tests/005.phpt]
correct instantiation of references between variables in sessions [ext/session/tests/006.phpt]
serializing references test case using globals [ext/session/tests/019.phpt]
aggregating everything [ext/standard/tests/aggregation/aggregate.phpt]
aggregating all methods [ext/standard/tests/aggregation/aggregate_methods.phpt]
aggregating methods specified in the list
[ext/standard/tests/aggregation/aggregate_methods_by_list.phpt]
aggregating methods matching regular expression
[ext/standard/tests/aggregation/aggregate_methods_by_regexp.phpt]
date_sunrise() and date_sunset() functions [ext/standard/tests/general_functions/sunfuncts.phpt]
Bug #14293 (serialize() and __sleep()) [ext/standard/tests/serialize/bug14293.phpt]
=====================================================================
=====================================================================
TEST RESULT SUMMARY
---------------------------------------------------------------------
Exts skipped : 72
Exts tested : 14
---------------------------------------------------------------------
Number of tests : 631
Tests skipped : 272 (43.1%)
Tests failed : 20 ( 3.2%)
Tests passed : 339 (53.7%)
---------------------------------------------------------------------
Time taken : 61 seconds
=====================================================================
=====================================================================
FAILED TEST SUMMARY
---------------------------------------------------------------------
ZE2 __clone() [tests/classes/__clone_001.phpt]
Methods via variable name, bug #20120 [tests/classes/bug20120.phpt]
Bug #21094 (set_error_handler not accepting methods) [tests/lang/bug21094.phpt]
Bug #21800 (Segfault under interactive mode) [tests/lang/bug21800.phpt]
Bug #21849 (self::constant doesn't work as method's default parameter)
[tests/lang/bug21849.phpt]
Bug #22367 (weird zval allocation problem) [tests/lang/bug22367.phpt]
Bug #22592 (cascading assignments to strings with curly braces broken) [tests/lang/bug22592.phpt]
xmldoc() [ext/domxml/tests/xmldoc.phpt]
gdimagefill() function (Bug #19366 (fixed in bundled libgd)) [ext/gd/tests/bug19366.phpt]
session object deserialization [ext/session/tests/003.phpt]
session_set_save_handler test [ext/session/tests/004.phpt]
custom save handler, multiple session_start()s, complex data structure test.
[ext/session/tests/005.phpt]
correct instantiation of references between variables in sessions [ext/session/tests/006.phpt]
serializing references test case using globals [ext/session/tests/019.phpt]
aggregating everything [ext/standard/tests/aggregation/aggregate.phpt]
aggregating all methods [ext/standard/tests/aggregation/aggregate_methods.phpt]
aggregating methods specified in the list
[ext/standard/tests/aggregation/aggregate_methods_by_list.phpt]
aggregating methods matching regular expression
[ext/standard/tests/aggregation/aggregate_methods_by_regexp.phpt]
date_sunrise() and date_sunset() functions [ext/standard/tests/general_functions/sunfuncts.phpt]
Bug #14293 (serialize() and __sleep()) [ext/standard/tests/serialize/bug14293.phpt]
=====================================================================
================================================================================
/home/kevin/html/php/dev/php5/php5-200305010130/tests/classes/__clone_001.phpt
================================================================================
---- EXPECTED OUTPUT
0
1
Hello
New York
---- ACTUAL OUTPUT
0
---- FAILED
================================================================================
002- 1
003- Hello
004- New York
================================================================================
================================================================================
/home/kevin/html/php/dev/php5/php5-200305010130/tests/classes/bug20120.phpt
================================================================================
---- EXPECTED OUTPUT
test
test2
test2
---- ACTUAL OUTPUT
Parse error: parse error in
/home/kevin/html/php/dev/php5/php5-200305010130/tests/classes/bug20120.php on line 11
---- FAILED
================================================================================
001- test
001+ Parse error: parse error in
/home/kevin/html/php/dev/php5/php5-200305010130/tests/classes/bug20120.php on line 11
002- test2
003- test2
================================================================================
================================================================================
/home/kevin/html/php/dev/php5/php5-200305010130/tests/lang/bug21094.phpt
================================================================================
---- EXPECTED OUTPUT
[1024] errstr: test, errfile: %s, errline: %d
---- ACTUAL OUTPUT
Notice: test in /home/kevin/html/php/dev/php5/php5-200305010130/tests/lang/bug21094.php on line 10
---- FAILED
================================================================================
001- [1024] errstr: test, errfile: %s, errline: %d
001+ Notice: test in /home/kevin/html/php/dev/php5/php5-200305010130/tests/lang/bug21094.php on line
10
================================================================================
================================================================================
/home/kevin/html/php/dev/php5/php5-200305010130/tests/lang/bug21800.phpt
================================================================================
---- EXPECTED OUTPUT
Interactive mode enabled
:test:
---- ACTUAL OUTPUT
---- FAILED
================================================================================
001- Interactive mode enabled
001+
002-
003- :test:
================================================================================
================================================================================
/home/kevin/html/php/dev/php5/php5-200305010130/tests/lang/bug21849.phpt
================================================================================
---- EXPECTED OUTPUT
fubar
---- ACTUAL OUTPUT
---- FAILED
================================================================================
001- fubar
001+
================================================================================
================================================================================
/home/kevin/html/php/dev/php5/php5-200305010130/tests/lang/bug22367.phpt
================================================================================
---- EXPECTED OUTPUT
int(5)
bool(false)
bool(false)
array(5) {
[0]=>
int(0)
[1]=>
int(1)
[2]=>
int(2)
[3]=>
int(3)
[4]=>
int(4)
}
array(5) {
[0]=>
int(0)
[1]=>
int(1)
[2]=>
int(2)
[3]=>
int(3)
[4]=>
int(4)
}
int(2)
bool(true)
bool(true)
array(5) {
[0]=>
int(0)
[1]=>
int(1)
[2]=>
int(2)
[3]=>
int(3)
[4]=>
int(4)
}
array(5) {
[0]=>
int(0)
[1]=>
int(1)
[2]=>
int(2)
[3]=>
int(3)
[4]=>
int(4)
}
---- ACTUAL OUTPUT
int(5)
bool(false)
bool(false)
array(5) {
[0]=>
int(4)
[1]=>
int(4)
[2]=>
int(4)
[3]=>
int(4)
[4]=>
int(4)
}
array(5) {
[0]=>
int(0)
[1]=>
int(1)
[2]=>
int(2)
[3]=>
int(3)
[4]=>
int(4)
}
int(2)
bool(true)
bool(true)
array(5) {
[0]=>
int(0)
[1]=>
int(1)
[2]=>
int(2)
[3]=>
int(3)
[4]=>
int(4)
}
array(5) {
[0]=>
int(0)
[1]=>
int(1)
[2]=>
&int(2)
[3]=>
int(3)
[4]=>
int(4)
}
---- FAILED
================================================================================
006- int(0)
006+ int(4)
008- int(1)
008+ int(4)
010- int(2)
010+ int(4)
012- int(3)
012+ int(4)
049- int(2)
049+ &int(2)
================================================================================
================================================================================
/home/kevin/html/php/dev/php5/php5-200305010130/tests/lang/bug22592.phpt
================================================================================
---- EXPECTED OUTPUT
string(5) "* *-*"
string(7) "* *-* *"
string(7) "*4*-* *"
string(7) "*4*s* *"
string(8) "*4*s* *0"
string(8) "*-*-* *0"
string(8) "*-*s*s*0"
string(8) "4-4s4s*0"
string(9) "4-4s4s505"
string(9) "454s4s505"
string(1) "-"
string(6) "string"
int(4)
int(5)
string(1) "5"
[Illegal string offset: -1]
---- ACTUAL OUTPUT
string(5) "* *-*"
string(7) "* *-* *"
string(7) "*4*-* *"
string(7) "*4*s* *"
string(8) "*4*s* *0"
string(8) "*[0x0]*-* *0"
string(8) "*[0x0]*[0x0]*s*0"
string(8) "[0x0][0x0][0x0][0x0]4s*0"
string(9) "[0x0][0x0][0x0][0x0]4s[0x0]05"
string(9) "[0x0][0x0][0x0][0x0]4s[0x0]05"
NULL
NULL
NULL
NULL
NULL
---- FAILED
================================================================================
006- string(8) "*-*-* *0"
006+ string(8) "*[0x0]*-* *0"
007- string(8) "*-*s*s*0"
007+ string(8) "*[0x0]*[0x0]*s*0"
008- string(8) "4-4s4s*0"
008+ string(8) "[0x0][0x0][0x0][0x0]4s*0"
009- string(9) "4-4s4s505"
009+ string(9) "[0x0][0x0][0x0][0x0]4s[0x0]05"
010- string(9) "454s4s505"
010+ string(9) "[0x0][0x0][0x0][0x0]4s[0x0]05"
011- string(1) "-"
011+ NULL
012- string(6) "string"
012+ NULL
013- int(4)
013+ NULL
014- int(5)
014+ NULL
015- string(1) "5"
015+ NULL
016- [Illegal string offset: -1]
================================================================================
================================================================================
/home/kevin/html/php/dev/php5/php5-200305010130/ext/domxml/tests/xmldoc.phpt
================================================================================
---- EXPECTED OUTPUT
object(domdocument)(9) {
["name"]=>
string(9) "#document"
["url"]=>
string(0) ""
["version"]=>
string(3) "1.0"
["standalone"]=>
int(1)
["type"]=>
int(9)
["compression"]=>
int(-1)
["charset"]=>
int(1)
[0]=>
int(5)
[1]=>
int(%d)
}
---- ACTUAL OUTPUT
object(domdocument)#1 (9) {
["name"]=>
string(9) "#document"
["url"]=>
string(0) ""
["version"]=>
string(3) "1.0"
["standalone"]=>
int(1)
["type"]=>
int(9)
["compression"]=>
int(-1)
["charset"]=>
int(1)
[0]=>
int(5)
[1]=>
int(136672304)
}
---- FAILED
================================================================================
001- object(domdocument)(9) {
001+ object(domdocument)#1 (9) {
019- int(%d)
019+ int(136672304)
================================================================================
================================================================================
/home/kevin/html/php/dev/php5/php5-200305010130/ext/gd/tests/bug19366.phpt
================================================================================
---- EXPECTED OUTPUT
Alive
Alive
Alive
Alive
Alive
Alive
---- ACTUAL OUTPUT
Alive
Alive
Alive
Alive
Warning: Cannot modify header information - headers already sent by (output started at
/home/kevin/html/php/dev/php5/php5-200305010130/ext/gd/tests/bug19366.php:2) in
/home/kevin/html/php/dev/php5/php5-200305010130/ext/gd/tests/bug19366.php on line 29
Alive
Alive
---- FAILED
================================================================================
005- Alive
005+
006- Alive
006+ Warning: Cannot modify header information - headers already sent by (output started at
/home/kevin/html/php/dev/php5/php5-200305010130/ext/gd/tests/bug19366.php:2) in
/home/kevin/html/php/dev/php5/php5-200305010130/ext/gd/tests/bug19366.php on line 29
007+ Alive
008+ Alive
================================================================================
================================================================================
/home/kevin/html/php/dev/php5/php5-200305010130/ext/session/tests/003.phpt
================================================================================
---- EXPECTED OUTPUT
object(foo)(2) {
["bar"]=>
string(2) "ok"
["yes"]=>
int(2)
}
array(1) {
[3]=>
&object(foo)(2) {
["bar"]=>
string(2) "ok"
["yes"]=>
int(2)
}
}
---- ACTUAL OUTPUT
object(foo)#1 (2) {
["bar"]=>
string(2) "ok"
["yes"]=>
int(2)
}
array(1) {
[3]=>
object(foo)#2 (2) {
["bar"]=>
string(2) "ok"
["yes"]=>
int(2)
}
}
---- FAILED
================================================================================
001- object(foo)(2) {
001+ object(foo)#1 (2) {
009- &object(foo)(2) {
009+ object(foo)#2 (2) {
================================================================================
================================================================================
/home/kevin/html/php/dev/php5/php5-200305010130/ext/session/tests/004.phpt
================================================================================
---- EXPECTED OUTPUT
OPEN: PHPSESSID
READ: abtest
object(foo)(2) {
["bar"]=>
string(2) "ok"
["yes"]=>
int(2)
}
array(1) {
[3]=>
&object(foo)(2) {
["bar"]=>
string(2) "ok"
["yes"]=>
int(2)
}
}
WRITE: abtest,
baz|O:3:"foo":2:{s:3:"bar";s:2:"ok";s:3:"yes";i:2;}arr|a:1:{i:3;O:3:"foo":2:{s:3:"bar";s:2:"ok";s:3:"yes";i:2;}}
OPEN: PHPSESSID
READ: abtest
object(foo)(2) {
["bar"]=>
string(2) "ok"
["yes"]=>
int(2)
}
array(1) {
[3]=>
object(foo)(2) {
["bar"]=>
string(2) "ok"
["yes"]=>
int(2)
}
}
DESTROY: abtest
---- ACTUAL OUTPUT
OPEN: PHPSESSID
READ: abtest
object(foo)#2 (2) {
["bar"]=>
string(2) "ok"
["yes"]=>
int(2)
}
array(1) {
[3]=>
object(foo)#3 (2) {
["bar"]=>
string(2) "ok"
["yes"]=>
int(2)
}
}
WRITE: abtest,
baz|O:3:"foo":2:{s:3:"bar";s:2:"ok";s:3:"yes";i:2;}arr|a:1:{i:3;O:3:"foo":2:{s:3:"bar";s:2:"ok";s:3:"yes";i:2;}}
OPEN: PHPSESSID
READ: abtest
object(foo)#4 (2) {
["bar"]=>
string(2) "ok"
["yes"]=>
int(2)
}
array(1) {
[3]=>
object(foo)#2 (2) {
["bar"]=>
string(2) "ok"
["yes"]=>
int(2)
}
}
DESTROY: abtest
---- FAILED
================================================================================
003- object(foo)(2) {
003+ object(foo)#2 (2) {
011- &object(foo)(2) {
011+ object(foo)#3 (2) {
021- object(foo)(2) {
021+ object(foo)#4 (2) {
029- object(foo)(2) {
029+ object(foo)#2 (2) {
================================================================================
================================================================================
/home/kevin/html/php/dev/php5/php5-200305010130/ext/session/tests/005.phpt
================================================================================
---- EXPECTED OUTPUT
OPEN: PHPSESSID
READ: abtest
object(foo)(2) {
["bar"]=>
string(2) "ok"
["yes"]=>
int(2)
}
array(1) {
[3]=>
&object(foo)(2) {
["bar"]=>
string(2) "ok"
["yes"]=>
int(2)
}
}
WRITE: abtest,
baz|O:3:"foo":2:{s:3:"bar";s:2:"ok";s:3:"yes";i:2;}arr|a:1:{i:3;O:3:"foo":2:{s:3:"bar";s:2:"ok";s:3:"yes";i:2;}}
CLOSE
OPEN: PHPSESSID
READ: abtest
object(foo)(2) {
["bar"]=>
string(2) "ok"
["yes"]=>
int(3)
}
array(1) {
[3]=>
&object(foo)(2) {
["bar"]=>
string(2) "ok"
["yes"]=>
int(3)
}
}
int(123)
WRITE: abtest,
baz|O:3:"foo":2:{s:3:"bar";s:2:"ok";s:3:"yes";i:3;}arr|a:1:{i:3;O:3:"foo":2:{s:3:"bar";s:2:"ok";s:3:"yes";i:3;}}c|i:123;
CLOSE
OPEN: PHPSESSID
READ: abtest
object(foo)(2) {
["bar"]=>
string(2) "ok"
["yes"]=>
int(3)
}
array(1) {
[3]=>
object(foo)(2) {
["bar"]=>
string(2) "ok"
["yes"]=>
int(3)
}
}
int(123)
DESTROY: abtest
CLOSE
---- ACTUAL OUTPUT
OPEN: PHPSESSID
READ: abtest
object(foo)#2 (2) {
["bar"]=>
string(2) "ok"
["yes"]=>
int(2)
}
array(1) {
[3]=>
object(foo)#3 (2) {
["bar"]=>
string(2) "ok"
["yes"]=>
int(2)
}
}
WRITE: abtest,
baz|O:3:"foo":2:{s:3:"bar";s:2:"ok";s:3:"yes";i:2;}arr|a:1:{i:3;O:3:"foo":2:{s:3:"bar";s:2:"ok";s:3:"yes";i:2;}}
CLOSE
OPEN: PHPSESSID
READ: abtest
object(foo)#4 (2) {
["bar"]=>
string(2) "ok"
["yes"]=>
int(3)
}
array(1) {
[3]=>
object(foo)#2 (2) {
["bar"]=>
string(2) "ok"
["yes"]=>
int(3)
}
}
int(123)
WRITE: abtest,
baz|O:3:"foo":2:{s:3:"bar";s:2:"ok";s:3:"yes";i:3;}arr|a:1:{i:3;O:3:"foo":2:{s:3:"bar";s:2:"ok";s:3:"yes";i:3;}}c|i:123;
CLOSE
OPEN: PHPSESSID
READ: abtest
object(foo)#3 (2) {
["bar"]=>
string(2) "ok"
["yes"]=>
int(3)
}
array(1) {
[3]=>
object(foo)#4 (2) {
["bar"]=>
string(2) "ok"
["yes"]=>
int(3)
}
}
int(123)
DESTROY: abtest
CLOSE
---- FAILED
================================================================================
003- object(foo)(2) {
003+ object(foo)#2 (2) {
011- &object(foo)(2) {
011+ object(foo)#3 (2) {
022- object(foo)(2) {
022+ object(foo)#4 (2) {
030- &object(foo)(2) {
030+ object(foo)#2 (2) {
042- object(foo)(2) {
042+ object(foo)#3 (2) {
050- object(foo)(2) {
050+ object(foo)#4 (2) {
================================================================================
================================================================================
/home/kevin/html/php/dev/php5/php5-200305010130/ext/session/tests/006.phpt
================================================================================
---- EXPECTED OUTPUT
original values:
object(a)(1) {
["test"]=>
string(5) "hallo"
}
object(b)(1) {
["a"]=>
&object(a)(1) {
["test"]=>
string(5) "hallo"
}
}
values after session:
object(a)(1) {
["test"]=>
string(5) "hallo"
}
object(b)(1) {
["a"]=>
&object(a)(1) {
["test"]=>
string(5) "hallo"
}
}
---- ACTUAL OUTPUT
original values:
object(a)#1 (1) {
["test"]=>
string(5) "hallo"
}
object(b)#2 (1) {
["a"]=>
&object(a)#1 (1) {
["test"]=>
string(5) "hallo"
}
}
values after session:
object(a)#3 (1) {
["test"]=>
string(5) "hallo"
}
object(b)#1 (1) {
["a"]=>
&object(a)#3 (1) {
["test"]=>
string(5) "hallo"
}
}
---- FAILED
================================================================================
002- object(a)(1) {
002+ object(a)#1 (1) {
006- object(b)(1) {
006+ object(b)#2 (1) {
008- &object(a)(1) {
008+ &object(a)#1 (1) {
014- object(a)(1) {
014+ object(a)#3 (1) {
018- object(b)(1) {
018+ object(b)#1 (1) {
020- &object(a)(1) {
020+ &object(a)#3 (1) {
================================================================================
================================================================================
/home/kevin/html/php/dev/php5/php5-200305010130/ext/session/tests/019.phpt
================================================================================
---- EXPECTED OUTPUT
array(2) {
["o1"]=>
&object(tfoo)(1) {
["c"]=>
int(42)
}
["o2"]=>
&object(tfoo)(1) {
["c"]=>
int(42)
}
}
array(2) {
["o1"]=>
&object(tfoo)(1) {
["c"]=>
int(44)
}
["o2"]=>
&object(tfoo)(1) {
["c"]=>
int(44)
}
}
---- ACTUAL OUTPUT
---- FAILED
================================================================================
001- array(2) {
001+
002- ["o1"]=>
003- &object(tfoo)(1) {
004- ["c"]=>
005- int(42)
006- }
007- ["o2"]=>
008- &object(tfoo)(1) {
009- ["c"]=>
010- int(42)
011- }
012- }
013- array(2) {
014- ["o1"]=>
015- &object(tfoo)(1) {
016- ["c"]=>
017- int(44)
018- }
019- ["o2"]=>
020- &object(tfoo)(1) {
021- ["c"]=>
022- int(44)
023- }
024- }
================================================================================
================================================================================
/home/kevin/html/php/dev/php5/php5-200305010130/ext/standard/tests/aggregation/aggregate.phpt
================================================================================
---- EXPECTED OUTPUT
I'm alive!
I'm helping!
I'm aggregating!
****
---- ACTUAL OUTPUT
I'm alive!
Fatal error: Call to undefined method simple::do_this() in
/home/kevin/html/php/dev/php5/php5-200305010130/ext/standard/tests/aggregation/aggregate.php on line
7
---- FAILED
================================================================================
002- I'm helping!
002+
003- I'm aggregating!
003+ Fatal error: Call to undefined method simple::do_this() in
/home/kevin/html/php/dev/php5/php5-200305010130/ext/standard/tests/aggregation/aggregate.php on line
7
004- ****
================================================================================
================================================================================
/home/kevin/html/php/dev/php5/php5-200305010130/ext/standard/tests/aggregation/aggregate_methods.phpt
================================================================================
---- EXPECTED OUTPUT
I'm alive!
mixing
100
simple,mix_it
simple_prop
mixing
---- ACTUAL OUTPUT
I'm alive!
Fatal error: Call to undefined method simple::mix_it() in
/home/kevin/html/php/dev/php5/php5-200305010130/ext/standard/tests/aggregation/aggregate_methods.php
on line 6
---- FAILED
================================================================================
002- mixing
002+
003- 100
003+ Fatal error: Call to undefined method simple::mix_it() in
/home/kevin/html/php/dev/php5/php5-200305010130/ext/standard/tests/aggregation/aggregate_methods.php
on line 6
004- simple,mix_it
005- simple_prop
006- mixing
================================================================================
================================================================================
/home/kevin/html/php/dev/php5/php5-200305010130/ext/standard/tests/aggregation/aggregate_methods_by_list.phpt
================================================================================
---- EXPECTED OUTPUT
I'm alive!
simple,just_another_method
I'm alive!
simple,do_this,do_that
yep, that's me
---- ACTUAL OUTPUT
I'm alive!
simple
I'm alive!
simple
Fatal error: Call to undefined method simple::just_another_method() in
/home/kevin/html/php/dev/php5/php5-200305010130/ext/standard/tests/aggregation/aggregate_methods_by_list.php
on line 10
---- FAILED
================================================================================
002- simple,just_another_method
002+ simple
004- simple,do_this,do_that
004+ simple
005- yep, that's me
005+
006+ Fatal error: Call to undefined method simple::just_another_method() in
/home/kevin/html/php/dev/php5/php5-200305010130/ext/standard/tests/aggregation/aggregate_methods_by_list.php
on line 10
================================================================================
================================================================================
/home/kevin/html/php/dev/php5/php5-200305010130/ext/standard/tests/aggregation/aggregate_methods_by_regexp.phpt
================================================================================
---- EXPECTED OUTPUT
I'm alive!
simple,do_this,do_that
I'm alive!
simple,just_another_method
---- ACTUAL OUTPUT
I'm alive!
simple
I'm alive!
simple
---- FAILED
================================================================================
002- simple,do_this,do_that
002+ simple
004- simple,just_another_method
004+ simple
================================================================================
================================================================================
/home/kevin/html/php/dev/php5/php5-200305010130/ext/standard/tests/general_functions/sunfuncts.phpt
================================================================================
---- EXPECTED OUTPUT
1041293199 06:39 6.6524557618962
1041293806 16:46 16.769374867459
1043971592 06:32 6.5453702926602
1043972233 17:13 17.217524708736
1046390766 06:06 6.1156526756851
1046391456 17:36 17.6108549623
1049069128 05:28 5.4727420290691
1049069878 17:58 17.972552584375
1051661094 04:54 4.9012299828593
1051661898 18:18 18.313688769483
1054339474 04:34 4.5744292894498
1054340319 18:39 18.656400943241
1056931476 04:36 4.6161204505189
1056932328 18:48 18.808871657766
1059609894 04:54 4.9068825098365
1059610715 18:35 18.599286002028
1062288314 05:14 5.2368895570738
1062289083 18:03 18.060541787879
1064880332 05:32 5.542366581139
1064881044 17:24 17.411505614917
1067558754 05:54 5.9162088420581
1067559410 16:50 16.833698570628
1070150780 06:20 6.3462215520697
1070151395 16:35 16.583589055537
---- ACTUAL OUTPUT
1041293199 06:39 6.6524557618962
1041293806 16:46 16.769374867459
1043971592 06:32 6.5453702926602
1043972233 17:13 17.217524708736
1046390766 06:06 6.1156526756851
1046391456 17:36 17.6108549623
1049069128 05:28 5.4727420290691
1049069878 17:58 17.972552584375
1051661094 04:54 4.9012299828593
1051661898 18:18 18.313688769483
1054339474 04:34 4.5744292894498
1054340319 18:39 18.656400943241
1056931476 04:36 4.6161204505189
1056932328 18:48 18.808871657766
1059609894 04:54 4.9068825098364
1059610715 18:35 18.599286002028
1062288314 05:14 5.2368895570738
1062289083 18:03 18.060541787879
1064880332 05:32 5.542366581139
1064881044 17:24 17.411505614917
1067558754 05:54 5.9162088420581
1067559410 16:50 16.833698570628
1070150780 06:20 6.3462215520697
1070151395 16:35 16.583589055537
---- FAILED
================================================================================
015- 1059609894 04:54 4.9068825098365
015+ 1059609894 04:54 4.9068825098364
================================================================================
================================================================================
/home/kevin/html/php/dev/php5/php5-200305010130/ext/standard/tests/serialize/bug14293.phpt
================================================================================
---- EXPECTED OUTPUT
__sleep called
O:1:"t":2:{s:1:"a";s:5:"hello";s:1:"b";N;}
object(t)(2) {
["a"]=>
string(5) "hello"
["b"]=>
NULL
}
---- ACTUAL OUTPUT
__sleep called
O:1:"t":2:{s:1:"a";s:5:"hello";s:1:"b";N;}
object(t)#2 (2) {
["a"]=>
string(5) "hello"
["b"]=>
NULL
}
---- FAILED
================================================================================
003- object(t)(2) {
003+ object(t)#2 (2) {
================================================================================
================================================================================
BUILD ENVIRONMENT
================================================================================
OS:
Linux
Automake:
automake (GNU automake) 1.6.3
Written by Tom Tromey <tromey@redhat.com>.
Copyright 2002 Free Software Foundation, Inc.
This is free software; see the source for copying conditions. There is NO
warranty; not even for MERCHANTABILITY or FITNESS FOR A PARTICULAR PURPOSE.
Autoconf:
autoconf (GNU Autoconf) 2.57
Written by David J. MacKenzie and Akim Demaille.
Copyright 2002 Free Software Foundation, Inc.
This is free software; see the source for copying conditions. There is NO
warranty; not even for MERCHANTABILITY or FITNESS FOR A PARTICULAR PURPOSE.
Libtool:
ltmain.sh (GNU libtool) 1.4.3 (1.922.2.110 2002/10/23 01:39:54)
Compiler:
Reading specs from /usr/lib/gcc-lib/i386-redhat-linux/3.2.2/specs
Configured with: ../configure --prefix=/usr --mandir=/usr/share/man --infodir=/usr/share/info
--enable-shared --enable-threads=posix --disable-checking --with-system-zlib --enable-__cxa_atexit
--host=i386-redhat-linux
Thread model: posix
gcc version 3.2.2 20030222 (Red Hat Linux 3.2.2-5)
Bison:
bison (GNU Bison) 1.35
Copyright 1984, 1986, 1989, 1992, 2000, 2001, 2002
Free Software Foundation, Inc.
This is free software; see the source for copying conditions. There is NO
warranty; not even for MERCHANTABILITY or FITNESS FOR A PARTICULAR PURPOSE.
Libraries:
libcrypt.so.1 => /lib/libcrypt.so.1 (0x40034000)
libsablot.so.0 => /usr/lib/libsablot.so.0 (0x40061000)
libstdc++.so.5 => /usr/lib/libstdc++.so.5 (0x40136000)
libjs.so => /usr/lib/libjs.so (0x401e9000)
libexpat.so.0 => /usr/lib/libexpat.so.0 (0x40253000)
libmysqlclient.so.10 => /usr/lib/mysql/libmysqlclient.so.10 (0x40273000)
libttf.so.2 => /usr/lib/libttf.so.2 (0x402ab000)
libm.so.6 => /lib/tls/libm.so.6 (0x402d1000)
libpng12.so.0 => /usr/lib/libpng12.so.0 (0x402f3000)
libz.so.1 => /usr/lib/libz.so.1 (0x40316000)
libjpeg.so.62 => /usr/lib/libjpeg.so.62 (0x40324000)
libresolv.so.2 => /lib/libresolv.so.2 (0x40342000)
libdl.so.2 => /lib/libdl.so.2 (0x40355000)
libnsl.so.1 => /lib/libnsl.so.1 (0x40358000)
libxml2.so.2 => /usr/lib/libxml2.so.2 (0x4036d000)
libc.so.6 => /lib/tls/libc.so.6 (0x42000000)
libgcc_s.so.1 => /lib/libgcc_s.so.1 (0x40458000)
/lib/ld-linux.so.2 => /lib/ld-linux.so.2 (0x40000000)
User's E-mail: kevin at oceania dot net
================================================================================
PHPINFO
================================================================================
phpinfo()
PHP Version => 5.0.0-dev
System => Linux kevin.oceania.net 2.4.20-8 #1 Thu Mar 13 17:18:24 EST 2003 i686
Build Date => May 9 2003 09:15:09
Configure Command => './configure' '--with-apxs2=/usr/sbin/apxs'
'--with-mysql=/usr' '--enable-track-vars' '--enable-ftp'
'--enable-imap' '--enable-ssl' '--enable-versioning'
'--enable-trans-sid' '--enable-sysvsem' '--enable-xslt'
'--with-xslt-sablot=/usr' '--with-sablot-js=/usr'
'--with-config-file-path=/etc' '--with-jpeg-dir=/usr'
'--with-png-dir=/usr' '--with-zlib-dir=/usr' '--with-ttf=/usr'
'--disable-static' '--with-gd' '--with-dom' '--with-xml'
'--with-domxml'
Server API => Command Line Interface
Virtual Directory Support => disabled
Configuration File (php.ini) Path => /etc/php.ini
PHP API => 20020918
PHP Extension => 20020429
Zend Extension => 90021012
Debug Build => no
Thread Safety => disabled
Registered PHP Streams => php, http, ftp, compress.zlib
This program makes use of the Zend Scripting Language Engine:
Zend Engine v2.0.0-dev, Copyright (c) 1998-2003 Zend Technologies
_______________________________________________________________________
Configuration
PHP Core
Directive => Local Value => Master Value
allow_call_time_pass_reference => On => On
allow_url_fopen => On => On
always_populate_raw_post_data => Off => Off
arg_separator.input => & => &
arg_separator.output => & => &
asp_tags => Off => Off
auto_append_file => no value => no value
auto_prepend_file => no value => no value
browscap => no value => no value
default_charset => no value => no value
default_mimetype => text/html => text/html
define_syslog_variables => Off => Off
disable_classes => no value => no value
disable_functions => no value => no value
display_errors => On => On
display_startup_errors => Off => Off
doc_root => no value => no value
docref_ext => no value => no value
docref_root => no value => no value
enable_dl => On => On
error_append_string => no value => no value
error_log => no value => no value
error_prepend_string => no value => no value
error_reporting => 2039 => 2039
expose_php => On => On
extension_dir => ./ => ./
file_uploads => On => On
gpc_order => GPC => GPC
highlight.bg => #FFFFFF => #FFFFFF
highlight.comment => #FF8000 => #FF8000
highlight.default => #0000BB => #0000BB
highlight.html => #000000 => #000000
highlight.keyword => #007700 => #007700
highlight.string => #DD0000 => #DD0000
html_errors => On => On
ignore_repeated_errors => Off => Off
ignore_repeated_source => Off => Off
ignore_user_abort => Off => Off
implicit_flush => Off => Off
include_path => .:/usr/local/lib/php => .:/usr/local/lib/php
log_errors => Off => Off
log_errors_max_len => 1024 => 1024
magic_quotes_gpc => On => On
magic_quotes_runtime => Off => Off
magic_quotes_sybase => Off => Off
mail_force_extra_parameters => no value => no value
max_execution_time => 30 => 30
max_input_time => 60 => 60
open_basedir => no value => no value
output_buffering => no value => no value
output_handler => no value => no value
post_max_size => 8M => 8M
precision => 12 => 12
register_argc_argv => On => On
register_globals => Off => Off
register_long_arrays => On => On
report_memleaks => On => On
report_zend_debug => Off => Off
safe_mode => Off => Off
safe_mode_exec_dir => no value => no value
safe_mode_gid => Off => Off
safe_mode_include_dir => no value => no value
sendmail_from => me@localhost.com => me@localhost.com
sendmail_path => /usr/sbin/sendmail -t -i => /usr/sbin/sendmail -t -i
short_open_tag => On => On
SMTP => localhost => localhost
smtp_port => 25 => 25
sql.safe_mode => Off => Off
track_errors => Off => Off
unserialize_callback_func => no value => no value
upload_max_filesize => 2M => 2M
upload_tmp_dir => no value => no value
user_dir => no value => no value
variables_order => EGPCS => EGPCS
xmlrpc_error_number => 0 => 0
xmlrpc_errors => Off => Off
y2k_compliance => On => On
zend2.implicit_clone => no value => no value
ctype
ctype functions => enabled
domxml
DOM/XML => enabled
DOM/XML API Version => 20030407
libxml Version => 20504
HTML Support => enabled
XPath Support => enabled
XPointer Support => enabled
ftp
FTP support => enabled
gd
GD Support => enabled
GD Version => bundled (2.0.12 compatible)
FreeType Support => enabled
FreeType Linkage => with TTF library
GIF Read Support => enabled
JPG Support => enabled
PNG Support => enabled
WBMP Support => enabled
XBM Support => enabled
mysql
MySQL Support => enabled
Active Persistent Links => 0
Active Links => 0
Client API version => 3.23.54
MYSQL_MODULE_TYPE => external
MYSQL_SOCKET => /var/lib/mysql/mysql.sock
MYSQL_INCLUDE => -I/usr/include/mysql
MYSQL_LIBS => -L/usr/lib/mysql -lmysqlclient
Directive => Local Value => Master Value
mysql.allow_persistent => On => On
mysql.connect_timeout => -1 => -1
mysql.default_host => no value => no value
mysql.default_password => no value => no value
mysql.default_port => no value => no value
mysql.default_socket => no value => no value
mysql.default_user => no value => no value
mysql.max_links => Unlimited => Unlimited
mysql.max_persistent => Unlimited => Unlimited
mysql.trace_mode => Off => Off
pcre
PCRE (Perl Compatible Regular Expressions) Support => enabled
PCRE Library Version => 3.92 11-Sep-2002
posix
Revision => $Revision: 1.55 $
session
Session Support => enabled
Registered save handlers => files user
Directive => Local Value => Master Value
session.auto_start => Off => Off
session.bug_compat_42 => On => On
session.bug_compat_warn => On => On
session.cache_expire => 180 => 180
session.cache_limiter => nocache => nocache
session.cookie_domain => no value => no value
session.cookie_lifetime => 0 => 0
session.cookie_path => / => /
session.cookie_secure => Off => Off
session.entropy_file => no value => no value
session.entropy_length => 0 => 0
session.gc_divisor => 100 => 100
session.gc_maxlifetime => 1440 => 1440
session.gc_probability => 1 => 1
session.hash_bits_per_character => 4 => 4
session.hash_function => 0 => 0
session.name => PHPSESSID => PHPSESSID
session.referer_check => no value => no value
session.save_handler => files => files
session.save_path => /tmp => /tmp
session.serialize_handler => php => php
session.use_cookies => On => On
session.use_only_cookies => Off => Off
session.use_trans_sid => Off => Off
standard
Regex Library => Bundled library enabled
Dynamic Library Support => enabled
Path to sendmail => /usr/sbin/sendmail -t -i
Directive => Local Value => Master Value
assert.active => 1 => 1
assert.bail => 0 => 0
assert.callback => no value => no value
assert.quiet_eval => 0 => 0
assert.warning => 1 => 1
auto_detect_line_endings => 0 => 0
date.default_latitude => 31.7667 => 31.7667
date.default_longitude => 35.2333 => 35.2333
date.sunrise_zenith => 90.83 => 90.83
date.sunset_zenith => 90.83 => 90.83
default_socket_timeout => 60 => 60
safe_mode_allowed_env_vars => PHP_ => PHP_
safe_mode_protected_env_vars => LD_LIBRARY_PATH => LD_LIBRARY_PATH
url_rewriter.tags => a=href,area=href,frame=src,input=src,form=,fieldset= =>
a=href,area=href,frame=src,input=src,form=,fieldset=
user_agent => no value => no value
tokenizer
Tokenizer Support => enabled
xml
XML Support => active
XML Namespace Support => active
EXPAT Version => 1.95.5
xslt
XSLT support => enabled
Backend => Sablotron
Sablotron Version => 0.98
Sablotron Information => Cflags: -O2 -g -pipe -march=i386 -mcpu=i686
Libs: -L/usr/lib -lexpat -ljs
Prefix: /usr
zlib
ZLib Support => enabled
Compiled Version => 1.1.4
Linked Version => 1.1.4
Directive => Local Value => Master Value
zlib.output_compression => Off => Off
zlib.output_compression_level => -1 => -1
zlib.output_handler => no value => no value
Additional Modules
Module Name
sysvsem
Environment
Variable => Value
SSH_AGENT_PID => 1250
HOSTNAME => kevin.oceania.net
TEST_PHP_SRCDIR => /home/kevin/html/php/dev/php5/php5-200305010130
PVM_RSH => /usr/bin/rsh
DESKTOP_STARTUP_ID =>
TERM => xterm
SHELL => /bin/sh
HISTSIZE => 1000
MAKEFLAGS =>
SSH_CLIENT => deleted
GTK_RC_FILES => /etc/gtk/gtkrc:/home/kevin//.gtkrc-1.2-gnome2
WINDOWID => 29362680
QTDIR => /usr/lib/qt-3.1
SSH_TTY => deleted
USER => kevin
LS_COLORS =>
no=00:fi=00:di=00;34:ln=00;36:pi=40;33:so=00;35:bd=40;33;01:cd=40;33;01:or=01;05;37;41:mi=01;05;37;41:ex=00;32:*.cmd=00;32:*.exe=00;32:*.com=00;32:*.btm=00;32:*.bat=00;32:*.sh=00;32:*.csh=00;32:*.tar=00;31:*.tgz=00;31:*.arj=00;31:*.taz=00;31:*.lzh=00;31:*.zip=00;31:*.z=00;31:*.Z=00;31:*.gz=00;31:*.bz2=00;31:*.bz=00;31:*.tz=00;31:*.rpm=00;31:*.cpio=00;31:*.jpg=00;35:*.gif=00;35:*.bmp=00;35:*.xbm=00;35:*.xpm=00;35:*.png=00;35:*.tif=00;35:
SCRIPT_FILENAME =>
PVM_ROOT => /usr/share/pvm3
SSH_AUTH_SOCK => deleted
SESSION_MANAGER => local/kevin.oceania.net:/tmp/.ICE-unix/1238
MAKELEVEL => 1
MFLAGS =>
PATH =>
/usr/kerberos/sbin:/usr/kerberos/bin:/usr/local/bin:/bin:/usr/bin:/usr/X11R6/bin:/home/kevin//bin
MAIL => /var/spool/mail/kevin
_ => /home/kevin/html/php/dev/php5/php5-200305010130/sapi/cli/php
PWD => /home/kevin/html/php/dev/php5/php5-200305010130
INPUTRC => /etc/inputrc
XMODIFIERS => @im=none
LANG => en_US.UTF-8
TEST_PHP_EXECUTABLE => /home/kevin/html/php/dev/php5/php5-200305010130/sapi/cli/php
REDIRECT_STATUS =>
LAMHELPFILE => /etc/lam/lam-helpfile
PATH_TRANSLATED =>
SSH_ASKPASS => /usr/libexec/openssh/gnome-ssh-askpass
HOME => /root
SHLVL => 7
CONTENT_LENGTH =>
XPVM_ROOT => /usr/share/pvm3/xpvm
GNOME_DESKTOP_SESSION_ID => Default
LOGNAME => kevin
QUERY_STRING =>
LESSOPEN => |/usr/bin/lesspipe.sh %s
CONTENT_TYPE =>
DISPLAY => :0.0
CC => gcc
REQUEST_METHOD =>
G_BROKEN_FILENAMES => 1
XAUTHORITY => /root/.xauth2yKqmH
COLORTERM => gnome-terminal
PHP Variables
Variable => Value
_SERVER["SSH_AGENT_PID"] => 1250
_SERVER["HOSTNAME"] => kevin.oceania.net
_SERVER["TEST_PHP_SRCDIR"] => /home/kevin/html/php/dev/php5/php5-200305010130
_SERVER["PVM_RSH"] => /usr/bin/rsh
_SERVER["DESKTOP_STARTUP_ID"] =>
_SERVER["TERM"] => xterm
_SERVER["SHELL"] => /bin/sh
_SERVER["HISTSIZE"] => 1000
_SERVER["MAKEFLAGS"] =>
_SERVER["SSH_CLIENT"] => deleted
_SERVER["GTK_RC_FILES"] => /etc/gtk/gtkrc:/home/kevin//.gtkrc-1.2-gnome2
_SERVER["WINDOWID"] => 29362680
_SERVER["QTDIR"] => /usr/lib/qt-3.1
_SERVER["SSH_TTY"] => deleted
_SERVER["USER"] => kevin
_SERVER["LS_COLORS"] =>
no=00:fi=00:di=00;34:ln=00;36:pi=40;33:so=00;35:bd=40;33;01:cd=40;33;01:or=01;05;37;41:mi=01;05;37;41:ex=00;32:*.cmd=00;32:*.exe=00;32:*.com=00;32:*.btm=00;32:*.bat=00;32:*.sh=00;32:*.csh=00;32:*.tar=00;31:*.tgz=00;31:*.arj=00;31:*.taz=00;31:*.lzh=00;31:*.zip=00;31:*.z=00;31:*.Z=00;31:*.gz=00;31:*.bz2=00;31:*.bz=00;31:*.tz=00;31:*.rpm=00;31:*.cpio=00;31:*.jpg=00;35:*.gif=00;35:*.bmp=00;35:*.xbm=00;35:*.xpm=00;35:*.png=00;35:*.tif=00;35:
_SERVER["SCRIPT_FILENAME"] =>
_SERVER["PVM_ROOT"] => /usr/share/pvm3
_SERVER["SSH_AUTH_SOCK"] => deleted
_SERVER["SESSION_MANAGER"] => local/kevin.oceania.net:/tmp/.ICE-unix/1238
_SERVER["MAKELEVEL"] => 1
_SERVER["MFLAGS"] =>
_SERVER["PATH"] =>
/usr/kerberos/sbin:/usr/kerberos/bin:/usr/local/bin:/bin:/usr/bin:/usr/X11R6/bin:/home/kevin//bin
_SERVER["MAIL"] => /var/spool/mail/kevin
_SERVER["_"] => /home/kevin/html/php/dev/php5/php5-200305010130/sapi/cli/php
_SERVER["PWD"] => /home/kevin/html/php/dev/php5/php5-200305010130
_SERVER["INPUTRC"] => /etc/inputrc
_SERVER["XMODIFIERS"] => @im=none
_SERVER["LANG"] => en_US.UTF-8
_SERVER["TEST_PHP_EXECUTABLE"] =>
/home/kevin/html/php/dev/php5/php5-200305010130/sapi/cli/php
_SERVER["REDIRECT_STATUS"] =>
_SERVER["LAMHELPFILE"] => /etc/lam/lam-helpfile
_SERVER["PATH_TRANSLATED"] =>
_SERVER["SSH_ASKPASS"] => /usr/libexec/openssh/gnome-ssh-askpass
_SERVER["HOME"] => /root
_SERVER["SHLVL"] => 7
_SERVER["CONTENT_LENGTH"] =>
_SERVER["XPVM_ROOT"] => /usr/share/pvm3/xpvm
_SERVER["GNOME_DESKTOP_SESSION_ID"] => Default
_SERVER["LOGNAME"] => kevin
_SERVER["QUERY_STRING"] =>
_SERVER["LESSOPEN"] => |/usr/bin/lesspipe.sh %s
_SERVER["CONTENT_TYPE"] =>
_SERVER["DISPLAY"] => :0.0
_SERVER["CC"] => gcc
_SERVER["REQUEST_METHOD"] =>
_SERVER["G_BROKEN_FILENAMES"] => 1
_SERVER["XAUTHORITY"] => /root/.xauth2yKqmH
_SERVER["COLORTERM"] => gnome-terminal
_SERVER["PHP_SELF"] =>
_SERVER["SCRIPT_NAME"] =>
_SERVER["DOCUMENT_ROOT"] =>
_SERVER["argv"] => Array
(
)
_SERVER["argc"] => 0
_ENV["SSH_AGENT_PID"] => 1250
_ENV["HOSTNAME"] => kevin.oceania.net
_ENV["TEST_PHP_SRCDIR"] => /home/kevin/html/php/dev/php5/php5-200305010130
_ENV["PVM_RSH"] => /usr/bin/rsh
_ENV["DESKTOP_STARTUP_ID"] =>
_ENV["TERM"] => xterm
_ENV["SHELL"] => /bin/sh
_ENV["HISTSIZE"] => 1000
_ENV["MAKEFLAGS"] =>
_ENV["SSH_CLIENT"] => deleted
_ENV["GTK_RC_FILES"] => /etc/gtk/gtkrc:/home/kevin//.gtkrc-1.2-gnome2
_ENV["WINDOWID"] => 29362680
_ENV["QTDIR"] => /usr/lib/qt-3.1
_ENV["SSH_TTY"] => deleted
_ENV["USER"] => kevin
_ENV["LS_COLORS"] =>
no=00:fi=00:di=00;34:ln=00;36:pi=40;33:so=00;35:bd=40;33;01:cd=40;33;01:or=01;05;37;41:mi=01;05;37;41:ex=00;32:*.cmd=00;32:*.exe=00;32:*.com=00;32:*.btm=00;32:*.bat=00;32:*.sh=00;32:*.csh=00;32:*.tar=00;31:*.tgz=00;31:*.arj=00;31:*.taz=00;31:*.lzh=00;31:*.zip=00;31:*.z=00;31:*.Z=00;31:*.gz=00;31:*.bz2=00;31:*.bz=00;31:*.tz=00;31:*.rpm=00;31:*.cpio=00;31:*.jpg=00;35:*.gif=00;35:*.bmp=00;35:*.xbm=00;35:*.xpm=00;35:*.png=00;35:*.tif=00;35:
_ENV["SCRIPT_FILENAME"] =>
_ENV["PVM_ROOT"] => /usr/share/pvm3
_ENV["SSH_AUTH_SOCK"] => deleted
_ENV["SESSION_MANAGER"] => local/kevin.oceania.net:/tmp/.ICE-unix/1238
_ENV["MAKELEVEL"] => 1
_ENV["MFLAGS"] =>
_ENV["PATH"] =>
/usr/kerberos/sbin:/usr/kerberos/bin:/usr/local/bin:/bin:/usr/bin:/usr/X11R6/bin:/home/kevin//bin
_ENV["MAIL"] => /var/spool/mail/kevin
_ENV["_"] => /home/kevin/html/php/dev/php5/php5-200305010130/sapi/cli/php
_ENV["PWD"] => /home/kevin/html/php/dev/php5/php5-200305010130
_ENV["INPUTRC"] => /etc/inputrc
_ENV["XMODIFIERS"] => @im=none
_ENV["LANG"] => en_US.UTF-8
_ENV["TEST_PHP_EXECUTABLE"] =>
/home/kevin/html/php/dev/php5/php5-200305010130/sapi/cli/php
_ENV["REDIRECT_STATUS"] =>
_ENV["LAMHELPFILE"] => /etc/lam/lam-helpfile
_ENV["PATH_TRANSLATED"] =>
_ENV["SSH_ASKPASS"] => /usr/libexec/openssh/gnome-ssh-askpass
_ENV["HOME"] => /root
_ENV["SHLVL"] => 7
_ENV["CONTENT_LENGTH"] =>
_ENV["XPVM_ROOT"] => /usr/share/pvm3/xpvm
_ENV["GNOME_DESKTOP_SESSION_ID"] => Default
_ENV["LOGNAME"] => kevin
_ENV["QUERY_STRING"] =>
_ENV["LESSOPEN"] => |/usr/bin/lesspipe.sh %s
_ENV["CONTENT_TYPE"] =>
_ENV["DISPLAY"] => :0.0
_ENV["CC"] => gcc
_ENV["REQUEST_METHOD"] =>
_ENV["G_BROKEN_FILENAMES"] => 1
_ENV["XAUTHORITY"] => /root/.xauth2yKqmH
_ENV["COLORTERM"] => gnome-terminal
PHP License
This program is free software; you can redistribute it and/or modify
it under the terms of the PHP License as published by the PHP Group
and included in the distribution in the file: LICENSE
This program is distributed in the hope that it will be useful,
but WITHOUT ANY WARRANTY; without even the implied warranty of
MERCHANTABILITY or FITNESS FOR A PARTICULAR PURPOSE.
If you did not receive a copy of the PHP license, or have any
questions about PHP licensing, please contact license@php.net.