Test results for 4.3.2RC4 [failed]

From: Date: Thu, 22 May 2003 07:46:43 +0000
Subject: Test results for 4.3.2RC4 [failed]
Groups: php.qa 
Request: Send a blank email to php-qa+get-12834@lists.php.net to get a copy of this message
===================================================================== FAILED TEST SUMMARY --------------------------------------------------------------------- strtotime() function [ext/standard/tests/time/002.phpt] Check for mktime with out-of-range parameters [ext/standard/tests/time/003.phpt] mktime() [ext/standard/tests/time/mktime.phpt] ===================================================================== ===================================================================== TEST RESULT SUMMARY --------------------------------------------------------------------- Exts skipped : 76 Exts tested : 11 --------------------------------------------------------------------- Number of tests : 476 Tests skipped : 230 (48.3%) Tests failed : 3 ( 0.6%) Tests passed : 243 (51.1%) --------------------------------------------------------------------- Time taken : 23 seconds ===================================================================== ================================================================================ /usr/src/php-4.3.2RC4/ext/standard/tests/time/002.phpt ================================================================================ ---- EXPECTED OUTPUT 1999-10-13 00:00:00 1999-10-13 00:00:00 2000-01-19 00:00:00 2000-01-19 00:00:00 2001-12-21 00:00:00 2001-12-21 00:00:00 2001-12-21 12:16:00 2001-12-21 12:16:00 1969-12-31 23:59:59 2001-10-22 21:19:58 2001-10-22 23:19:58 2001-10-22 23:32:58 2001-10-22 19:19:58 2001-10-22 19:06:58 1999-10-13 00:00:00 1999-10-13 00:00:00 2000-01-19 00:00:00 2000-01-19 00:00:00 2001-12-21 00:00:00 2001-12-21 00:00:00 2001-12-21 12:16:00 2001-12-21 12:16:00 1969-12-31 18:59:59 2001-10-22 21:19:58 2001-10-22 19:19:58 2001-10-22 19:32:58 2001-10-22 15:19:58 2001-10-22 15:06:58 ---- ACTUAL OUTPUT 1999-10-13 00:00:00 1999-10-13 00:00:00 2000-01-19 00:00:00 2000-01-19 00:00:00 2001-12-21 00:00:00 2001-12-21 00:00:00 2001-12-21 12:16:00 2001-12-21 12:16:00 1969-12-31 23:59:59 2001-10-22 21:19:58 2001-10-22 23:19:58 2001-10-22 23:32:58 2001-10-22 19:19:58 2001-10-22 19:06:58 1999-10-13 00:00:00 1999-10-13 00:00:00 2000-01-19 00:00:00 2000-01-19 00:00:00 2001-12-21 00:00:00 2001-12-21 00:00:00 2001-12-21 12:16:00 2001-12-21 12:16:00 1969-12-31 23:59:59 2001-10-22 21:19:58 2001-10-22 23:19:58 2001-10-22 23:32:58 2001-10-22 19:19:58 2001-10-22 19:06:58 ---- FAILED ================================================================================ 023- 1969-12-31 18:59:59 023+ 1969-12-31 23:59:59 025- 2001-10-22 19:19:58 025+ 2001-10-22 23:19:58 026- 2001-10-22 19:32:58 026+ 2001-10-22 23:32:58 027- 2001-10-22 15:19:58 027+ 2001-10-22 19:19:58 028- 2001-10-22 15:06:58 028+ 2001-10-22 19:06:58 ================================================================================ ================================================================================ /usr/src/php-4.3.2RC4/ext/standard/tests/time/003.phpt ================================================================================ ---- EXPECTED OUTPUT 2000-02-29 2000-02-28 2000-02-29 2001-02-28 2001-03-01 1999-11-30 2000-05-29 12:00:00 2000-05-29 13:00:00 2000-05-29 12:00:00 2000-01-31 12:00:00 2000-01-31 12:00:00 2000-01-31 11:00:00 2000-04-29 12:00:00 2000-04-29 13:00:00 2000-04-29 12:00:00 ---- ACTUAL OUTPUT 2000-02-29 2000-02-28 2000-02-29 2001-02-28 2001-03-01 1999-11-30 2000-05-29 12:00:00 2000-05-29 07:00:00 2000-05-29 12:00:00 2000-01-31 12:00:00 2000-01-31 06:00:00 2000-01-31 11:00:00 2000-04-29 12:00:00 2000-04-29 07:00:00 2000-04-29 12:00:00 ---- FAILED ================================================================================ 008- 2000-05-29 13:00:00 008+ 2000-05-29 07:00:00 011- 2000-01-31 12:00:00 011+ 2000-01-31 06:00:00 014- 2000-04-29 13:00:00 014+ 2000-04-29 07:00:00 ================================================================================ ================================================================================ /usr/src/php-4.3.2RC4/ext/standard/tests/time/mktime.phpt ================================================================================ ---- EXPECTED OUTPUT int(1009843200) int(1009843200) int(1009843200) int(1009843200) int(1025481600) int(1025481600) int(1025481600) int(1025481600) int(1009839600) int(1009839600) int(1009839600) int(1009836000) int(1025474400) int(1025474400) int(1025478000) int(1025474400) ---- ACTUAL OUTPUT int(1009843200) int(1009843200) int(1009843200) int(-3662) int(1025481600) int(1025481600) int(1025481600) int(-3662) int(1009839600) int(1009839600) int(1009839600) int(1009857600) int(1025474400) int(1025474400) int(1025456400) int(1025474400) ---- FAILED ================================================================================ 004- int(1009843200) 004+ int(-3662) 008- int(1025481600) 008+ int(-3662) 012- int(1009836000) 012+ int(1009857600) 015- int(1025478000) 015+ int(1025456400) ================================================================================ ================================================================================ BUILD ENVIRONMENT ================================================================================ OS: FreeBSD Automake: Autoconf: autoconf (GNU Autoconf) 2.57 Written by David J. MacKenzie and Akim Demaille. Copyright 2002 Free Software Foundation, Inc. This is free software; see the source for copying conditions. There is NO warranty; not even for MERCHANTABILITY or FITNESS FOR A PARTICULAR PURPOSE. Libtool: ltmain.sh (GNU libtool) 1.4.3 (1.922.2.110 2002/10/23 01:39:54) Compiler: Using builtin specs. gcc version 2.95.4 20020320 [FreeBSD] Bison: Libraries: /usr/src/php-4.3.2RC4/sapi/cli/php: libcrypt.so.2 => /usr/lib/libcrypt.so.2 (0x28168000) libm.so.2 => /usr/lib/libm.so.2 (0x28181000) libz.so.2 => /usr/lib/libz.so.2 (0x2819c000) libc.so.4 => /usr/lib/libc.so.4 (0x281a9000) User's E-mail: public at jasonhoffman dot org ================================================================================ PHPINFO ================================================================================ phpinfo() PHP Version => 4.3.2RC4 System => FreeBSD jasonhoffman.org 4.8-STABLE FreeBSD 4.8-STABLE #1: Fri Apr i386 Build Date => May 22 2003 00:24:05 Configure Command => './configure' '--with-apxs=/usr/bin/apxs' '--with-config-file-path=/etc/httpd/conf' '--with-mysql=shared,/usr' '--with-gd=shared' '--with-pgsql=shared,/usr' '--with-jpeg-dir=shared,/usr' '--with-png-dir=shared,/usr' '--with-freetype-dir=shared,/usr' '--with-zlib-dir=shared,/usr' '--enable-ftp=shared' '--with-curl=shared,/usr/local' '--with-mcrypt=shared,/usr/local' '--with-bz2=shared,/usr' '--with-ming=shared,/usr' '--enable-bcmath=shared' '--with-iconv=shared,/usr/local' '--with-iconv-dir=shared,/usr/local' '--with-xmlrpc=shared' '--with-pdflib=shared,/usr' '--with-tiff-dir=shared,/usr' '--with-gettext=shared,/usr/local' '--enable-exif=shared' '--with-xml' '--with-dom=shared,/usr/local' '--with-dom-xslt=shared,/usr/local' '--with-dom-exslt=shared,/usr/local' '--enable-mbstring=shared' '--enable-mbregex=shared' '--with-pear' '--with-java=/usr/bin/jdk-bsd' Server API => Command Line Interface Virtual Directory Support => disabled Configuration File (php.ini) Path => /etc/httpd/conf/php.ini PHP API => 20020918 PHP Extension => 20020429 Zend Extension => 20021010 Debug Build => no Thread Safety => disabled Registered PHP Streams => php, http, ftp, compress.zlib This program makes use of the Zend Scripting Language Engine: Zend Engine v1.3.0, Copyright (c) 1998-2003 Zend Technologies _______________________________________________________________________ Configuration PHP Core Directive => Local Value => Master Value allow_call_time_pass_reference => Off => Off allow_url_fopen => On => On always_populate_raw_post_data => Off => Off arg_separator.input => & => & arg_separator.output => & => & asp_tags => Off => Off auto_append_file => no value => no value auto_prepend_file => no value => no value browscap => no value => no value default_charset => no value => no value default_mimetype => text/html => text/html define_syslog_variables => Off => Off disable_classes => no value => no value disable_functions => no value => no value display_errors => Off => Off display_startup_errors => Off => Off doc_root => no value => no value docref_ext => no value => no value docref_root => no value => no value enable_dl => On => On error_append_string => no value => no value error_log => no value => no value error_prepend_string => no value => no value error_reporting => 2039 => 2039 expose_php => On => On extension_dir => /usr/lib/php/extensions/no-debug-non-zts-20020429 => /usr/lib/php/extensions/no-debug-non-zts-20020429 file_uploads => On => On gpc_order => GPC => GPC highlight.bg => #FFFFFF => #FFFFFF highlight.comment => #FF9900 => #FF9900 highlight.default => #0000CC => #0000CC highlight.html => #000000 => #000000 highlight.keyword => #006600 => #006600 highlight.string => #CC0000 => #CC0000 html_errors => Off => On ignore_repeated_errors => Off => Off ignore_repeated_source => Off => Off ignore_user_abort => Off => Off implicit_flush => On => Off include_path => .:/usr/local/lib/php => .:/usr/local/lib/php log_errors => Off => Off log_errors_max_len => 1024 => 1024 magic_quotes_gpc => Off => Off magic_quotes_runtime => Off => Off magic_quotes_sybase => Off => Off max_execution_time => 0 => 30 max_input_time => -1 => -1 open_basedir => no value => no value output_buffering => no value => no value output_handler => no value => no value post_max_size => 20M => 20M precision => 14 => 14 register_argc_argv => On => On register_globals => On => On report_memleaks => On => On safe_mode => Off => Off safe_mode_exec_dir => no value => no value safe_mode_gid => Off => Off safe_mode_include_dir => no value => no value sendmail_from => no value => no value sendmail_path => /usr/sbin/sendmail -t -i => /usr/sbin/sendmail -t -i serialize_precision => 100 => 100 short_open_tag => On => On SMTP => localhost => localhost smtp_port => 25 => 25 sql.safe_mode => Off => Off track_errors => Off => Off unserialize_callback_func => no value => no value upload_max_filesize => 16M => 16M upload_tmp_dir => no value => no value user_dir => no value => no value variables_order => EGPCS => EGPCS xmlrpc_error_number => 0 => 0 xmlrpc_errors => Off => Off y2k_compliance => Off => Off ctype ctype functions => enabled mysql MySQL Support => enabled Active Persistent Links => 0 Active Links => 0 Client API version => 3.23.55 MYSQL_MODULE_TYPE => external MYSQL_SOCKET => /tmp/mysql.sock MYSQL_INCLUDE => -I/usr/include/mysql MYSQL_LIBS => -L/usr/lib/mysql -lmysqlclient Directive => Local Value => Master Value mysql.allow_persistent => On => On mysql.connect_timeout => -1 => -1 mysql.default_host => no value => no value mysql.default_password => no value => no value mysql.default_port => no value => no value mysql.default_socket => no value => no value mysql.default_user => no value => no value mysql.max_links => Unlimited => Unlimited mysql.max_persistent => Unlimited => Unlimited mysql.trace_mode => Off => Off overload User-Space Object Overloading Support => enabled pcre PCRE (Perl Compatible Regular Expressions) Support => enabled PCRE Library Version => 3.92 11-Sep-2002 pgsql PostgreSQL Support => enabled PostgreSQL(libpq) Version => 7.3.1 Multibyte character support => enabled SSL support => disabled Active Persistent Links => 0 Active Links => 0 Directive => Local Value => Master Value pgsql.allow_persistent => On => On pgsql.auto_reset_persistent => Off => Off pgsql.ignore_notice => Off => Off pgsql.log_notice => Off => Off pgsql.max_links => Unlimited => Unlimited pgsql.max_persistent => Unlimited => Unlimited posix Revision => $Revision: 1.51.2.2 $ session Session Support => enabled Registered save handlers => files user Directive => Local Value => Master Value session.auto_start => Off => Off session.bug_compat_42 => On => On session.bug_compat_warn => On => On session.cache_expire => 180 => 180 session.cache_limiter => nocache => nocache session.cookie_domain => no value => no value session.cookie_lifetime => 0 => 0 session.cookie_path => / => / session.cookie_secure => Off => Off session.entropy_file => no value => no value session.entropy_length => 0 => 0 session.gc_divisor => 100 => 100 session.gc_maxlifetime => 1440 => 1440 session.gc_probability => 1 => 1 session.name => PHPSESSID => PHPSESSID session.referer_check => no value => no value session.save_handler => files => files session.save_path => /tmp => /tmp session.serialize_handler => php => php session.use_cookies => On => On session.use_only_cookies => Off => Off session.use_trans_sid => On => On standard Regex Library => Bundled library enabled Dynamic Library Support => enabled Path to sendmail => /usr/sbin/sendmail -t -i Directive => Local Value => Master Value assert.active => 1 => 1 assert.bail => 0 => 0 assert.callback => no value => no value assert.quiet_eval => 0 => 0 assert.warning => 1 => 1 auto_detect_line_endings => 0 => 0 default_socket_timeout => 60 => 60 safe_mode_allowed_env_vars => PHP_ => PHP_ safe_mode_protected_env_vars => LD_LIBRARY_PATH => LD_LIBRARY_PATH url_rewriter.tags => a=href,area=href,frame=src,input=src,form=fakeentry => a=href,area=href,frame=src,input=src,form=fakeentry user_agent => no value => no value tokenizer Tokenizer Support => enabled xml XML Support => active XML Namespace Support => active EXPAT Version => 1.95.2 zlib ZLib Support => enabled Compiled Version => 1.1.4 Linked Version => 1.1.4 Directive => Local Value => Master Value zlib.output_compression => Off => Off zlib.output_compression_level => -1 => -1 zlib.output_handler => no value => no value Additional Modules Module Name Environment Variable => Value CONTENT_TYPE => MACHTYPE => i386--freebsd4.3 USER => root MAIL => /var/mail/root HOSTNAME => jasonhoffman.org SHLVL => 1 QUERY_STRING => HOME => /root OLDPWD => /usr/src TEST_PHP_SRCDIR => /usr/src/php-4.3.2RC4 SSH_TTY => /dev/ttyp0 PS1 => root@\h:\w# CONTENT_LENGTH => MAKEFLAGS => SCRIPT_FILENAME => PATH_TRANSLATED => LOGNAME => root _ => /usr/local/bin/gmake TEST_PHP_EXECUTABLE => /usr/src/php-4.3.2RC4/sapi/cli/php BLOCKSIZE => K TERM => vt100 PATH => /sbin:/bin:/usr/sbin:/usr/bin:/usr/games:/usr/local/sbin:/usr/local/bin:/usr/X11R6/bin:/root/bin:/usr/bin/jdk-bsd/bin:/usr/local/ant/bin MAKELEVEL => 1 DISPLAY => localhost:10.0 SHELL => /bin/sh REDIRECT_STATUS => REQUEST_METHOD => OSTYPE => freebsd4.3 PWD => /usr/src/php-4.3.2RC4 JAVA_HOME => /usr/bin/jdk-bsd SSH_CONNECTION => 128.54.216.151 54319 66.111.36.95 22 MFLAGS => FTP_PASSIVE_MODE => YES CC => gcc HOSTTYPE => i386 PHP Variables Variable => Value PHP_SELF => _SERVER["CONTENT_TYPE"] => _SERVER["MACHTYPE"] => i386--freebsd4.3 _SERVER["USER"] => root _SERVER["MAIL"] => /var/mail/root _SERVER["HOSTNAME"] => jasonhoffman.org _SERVER["SHLVL"] => 1 _SERVER["QUERY_STRING"] => _SERVER["HOME"] => /root _SERVER["OLDPWD"] => /usr/src _SERVER["TEST_PHP_SRCDIR"] => /usr/src/php-4.3.2RC4 _SERVER["SSH_TTY"] => /dev/ttyp0 _SERVER["PS1"] => root@\h:\w# _SERVER["CONTENT_LENGTH"] => _SERVER["MAKEFLAGS"] => _SERVER["SCRIPT_FILENAME"] => _SERVER["PATH_TRANSLATED"] => _SERVER["LOGNAME"] => root _SERVER["_"] => /usr/local/bin/gmake _SERVER["TEST_PHP_EXECUTABLE"] => /usr/src/php-4.3.2RC4/sapi/cli/php _SERVER["BLOCKSIZE"] => K _SERVER["TERM"] => vt100 _SERVER["PATH"] => /sbin:/bin:/usr/sbin:/usr/bin:/usr/games:/usr/local/sbin:/usr/local/bin:/usr/X11R6/bin:/root/bin:/usr/bin/jdk-bsd/bin:/usr/local/ant/bin _SERVER["MAKELEVEL"] => 1 _SERVER["DISPLAY"] => localhost:10.0 _SERVER["SHELL"] => /bin/sh _SERVER["REDIRECT_STATUS"] => _SERVER["REQUEST_METHOD"] => _SERVER["OSTYPE"] => freebsd4.3 _SERVER["PWD"] => /usr/src/php-4.3.2RC4 _SERVER["JAVA_HOME"] => /usr/bin/jdk-bsd _SERVER["SSH_CONNECTION"] => 128.54.216.151 54319 66.111.36.95 22 _SERVER["MFLAGS"] => _SERVER["FTP_PASSIVE_MODE"] => YES _SERVER["CC"] => gcc _SERVER["HOSTTYPE"] => i386 _SERVER["PHP_SELF"] => _SERVER["SCRIPT_NAME"] => _SERVER["DOCUMENT_ROOT"] => _SERVER["argv"] => Array ( ) _SERVER["argc"] => 0 _ENV["CONTENT_TYPE"] => _ENV["MACHTYPE"] => i386--freebsd4.3 _ENV["USER"] => root _ENV["MAIL"] => /var/mail/root _ENV["HOSTNAME"] => jasonhoffman.org _ENV["SHLVL"] => 1 _ENV["QUERY_STRING"] => _ENV["HOME"] => /root _ENV["OLDPWD"] => /usr/src _ENV["TEST_PHP_SRCDIR"] => /usr/src/php-4.3.2RC4 _ENV["SSH_TTY"] => /dev/ttyp0 _ENV["PS1"] => root@\h:\w# _ENV["CONTENT_LENGTH"] => _ENV["MAKEFLAGS"] => _ENV["SCRIPT_FILENAME"] => _ENV["PATH_TRANSLATED"] => _ENV["LOGNAME"] => root _ENV["_"] => /usr/local/bin/gmake _ENV["TEST_PHP_EXECUTABLE"] => /usr/src/php-4.3.2RC4/sapi/cli/php _ENV["BLOCKSIZE"] => K _ENV["TERM"] => vt100 _ENV["PATH"] => /sbin:/bin:/usr/sbin:/usr/bin:/usr/games:/usr/local/sbin:/usr/local/bin:/usr/X11R6/bin:/root/bin:/usr/bin/jdk-bsd/bin:/usr/local/ant/bin _ENV["MAKELEVEL"] => 1 _ENV["DISPLAY"] => localhost:10.0 _ENV["SHELL"] => /bin/sh _ENV["REDIRECT_STATUS"] => _ENV["REQUEST_METHOD"] => _ENV["OSTYPE"] => freebsd4.3 _ENV["PWD"] => /usr/src/php-4.3.2RC4 _ENV["JAVA_HOME"] => /usr/bin/jdk-bsd _ENV["SSH_CONNECTION"] => 128.54.216.151 54319 66.111.36.95 22 _ENV["MFLAGS"] => _ENV["FTP_PASSIVE_MODE"] => YES _ENV["CC"] => gcc _ENV["HOSTTYPE"] => i386 PHP License This program is free software; you can redistribute it and/or modify it under the terms of the PHP License as published by the PHP Group and included in the distribution in the file: LICENSE This program is distributed in the hope that it will be useful, but WITHOUT ANY WARRANTY; without even the implied warranty of MERCHANTABILITY or FITNESS FOR A PARTICULAR PURPOSE. If you did not receive a copy of the PHP license, or have any questions about PHP licensing, please contact license@php.net.

« previous php.qa (#12834) next »