Test results for unknown [failed]
| From: | noreply@php.net | Date: | Thu, 22 May 2003 17:10:21 +0000 |
| Subject: | Test results for unknown [failed] | ||
| Groups: | php.qa | ||
| Request: | Send a blank email to php-qa+get-12888@lists.php.net to get a copy of this message | ||
=====================================================================
FAILED TEST SUMMARY
---------------------------------------------------------------------
correct instantiation of references between variables in sessions [ext/session/tests/006.phpt]
bug compatibility: unset($c) with enabled register_globals [ext/session/tests/007.phpt]
bug compatibility: global is used albeit register_globals=0 [ext/session/tests/008-php4.2.3.phpt]
unset($_SESSION["name"]); should work with register_globals=off
[ext/session/tests/009.phpt]
serializing references test case using globals [ext/session/tests/019.phpt]
=====================================================================
=====================================================================
TEST RESULT SUMMARY
---------------------------------------------------------------------
Exts skipped : 79
Exts tested : 9
---------------------------------------------------------------------
Number of tests : 443
Tests skipped : 232 (52.4%)
Tests failed : 5 ( 1.1%)
Tests passed : 206 (46.5%)
---------------------------------------------------------------------
Time taken : 76 seconds
=====================================================================
================================================================================
/usr/src/php-4.3.1/ext/session/tests/006.phpt
================================================================================
---- EXPECTED OUTPUT
original values:
object(a)(1) {
["test"]=>
string(5) "hallo"
}
object(b)(1) {
["a"]=>
&object(a)(1) {
["test"]=>
string(5) "hallo"
}
}
values after session:
object(a)(1) {
["test"]=>
string(5) "hallo"
}
object(b)(1) {
["a"]=>
&object(a)(1) {
["test"]=>
string(5) "hallo"
}
}
---- ACTUAL OUTPUT
original values:
object(a)(1) {
["test"]=>
string(5) "hallo"
}
object(b)(1) {
["a"]=>
&object(a)(1) {
["test"]=>
string(5) "hallo"
}
}
Warning: session_start() [/phpmanual/function.session-start.html]: read returned less bytes than
requested in /usr/src/php-4.3.1/ext/session/tests/006.php on line 31
values after session:
object(a)(1) {
["test"]=>
string(5) "hallo"
}
object(b)(1) {
["a"]=>
&object(a)(1) {
["test"]=>
string(5) "hallo"
}
}
---- FAILED
================================================================================
013- values after session:
013+
014- object(a)(1) {
014+ Warning: session_start() [/phpmanual/function.session-start.html]: read returned less bytes
than requested in /usr/src/php-4.3.1/ext/session/tests/006.php on line 31
015- ["test"]=>
015+ values after session:
016- string(5) "hallo"
016+ object(a)(1) {
017- }
017+ ["test"]=>
018- object(b)(1) {
018+ string(5) "hallo"
019- ["a"]=>
019+ }
020- &object(a)(1) {
020+ object(b)(1) {
021- ["test"]=>
021+ ["a"]=>
022- string(5) "hallo"
022+ &object(a)(1) {
023- }
023+ ["test"]=>
024- }
024+ string(5) "hallo"
025+ }
026+ }
================================================================================
================================================================================
/usr/src/php-4.3.1/ext/session/tests/007.phpt
================================================================================
---- EXPECTED OUTPUT
float(3.14)
array(1) {
["c"]=>
&float(3.14)
}
float(3.14)
array(1) {
["c"]=>
&float(3.14)
}
---- ACTUAL OUTPUT
Warning: session_start() [/phpmanual/function.session-start.html]: read returned less bytes than
requested in /usr/src/php-4.3.1/ext/session/tests/007.php on line 20
Notice: Undefined variable: c in /usr/src/php-4.3.1/ext/session/tests/007.php on line 21
NULL
array(0) {
}
Notice: Undefined variable: c in /usr/src/php-4.3.1/ext/session/tests/007.php on line 33
NULL
array(0) {
}
---- FAILED
================================================================================
001- float(3.14)
001+ Warning: session_start() [/phpmanual/function.session-start.html]: read returned less bytes
than requested in /usr/src/php-4.3.1/ext/session/tests/007.php on line 20
002- array(1) {
002+
003- ["c"]=>
003+ Notice: Undefined variable: c in /usr/src/php-4.3.1/ext/session/tests/007.php on line 21
004- &float(3.14)
004+ NULL
005- }
005+ array(0) {
006- float(3.14)
006+ }
007- array(1) {
007+
008- ["c"]=>
008+ Notice: Undefined variable: c in /usr/src/php-4.3.1/ext/session/tests/007.php on line 33
009- &float(3.14)
009+ NULL
010- }
010+ array(0) {
011+ }
================================================================================
================================================================================
/usr/src/php-4.3.1/ext/session/tests/008-php4.2.3.phpt
================================================================================
---- EXPECTED OUTPUT
NULL
Your script possibly relies on a session side-effect which existed until PHP 4.2.3. Please be
advised that the session extension does not consider global variables as a source of data, unless
register_globals is enabled. You can disable this functionality and this warning by setting
session.bug_compat_42 or session.bug_compat_warn to off, respectively.
array(1) {
["c"]=>
float(3.14)
}
NULL
array(1) {
["c"]=>
float(3.14)
}
---- ACTUAL OUTPUT
NULL
Your script possibly relies on a session side-effect which existed until PHP 4.2.3. Please be
advised that the session extension does not consider global variables as a source of data, unless
register_globals is enabled. You can disable this functionality and this warning by setting
session.bug_compat_42 or session.bug_compat_warn to off, respectively.
Warning: session_start() [/phpmanual/function.session-start.html]: read returned less bytes than
requested in /usr/src/php-4.3.1/ext/session/tests/008-php4.2.3.php on line 21
array(0) {
}
NULL
array(0) {
}
---- FAILED
================================================================================
003- array(1) {
003+
004- ["c"]=>
004+ Warning: session_start() [/phpmanual/function.session-start.html]: read returned less bytes
than requested in /usr/src/php-4.3.1/ext/session/tests/008-php4.2.3.php on line 21
005- float(3.14)
005+ array(0) {
008- array(1) {
008+ array(0) {
009- ["c"]=>
009+ }
010- float(3.14)
011- }
================================================================================
================================================================================
/usr/src/php-4.3.1/ext/session/tests/009.phpt
================================================================================
---- EXPECTED OUTPUT
array(0) {
}
array(1) {
["name"]=>
string(3) "foo"
}
array(1) {
["name"]=>
string(3) "foo"
}
array(0) {
}
array(0) {
}
---- ACTUAL OUTPUT
array(0) {
}
array(1) {
["name"]=>
string(3) "foo"
}
Warning: session_start() [/phpmanual/function.session-start.html]: read returned less bytes than
requested in /usr/src/php-4.3.1/ext/session/tests/009.php on line 19
array(0) {
}
array(0) {
}
array(0) {
}
---- FAILED
================================================================================
007- array(1) {
007+
008- ["name"]=>
008+ Warning: session_start() [/phpmanual/function.session-start.html]: read returned less bytes
than requested in /usr/src/php-4.3.1/ext/session/tests/009.php on line 19
009- string(3) "foo"
009+ array(0) {
================================================================================
================================================================================
/usr/src/php-4.3.1/ext/session/tests/019.phpt
================================================================================
---- EXPECTED OUTPUT
array(2) {
["o1"]=>
&object(tfoo)(1) {
["c"]=>
int(42)
}
["o2"]=>
&object(tfoo)(1) {
["c"]=>
int(42)
}
}
array(2) {
["o1"]=>
&object(tfoo)(1) {
["c"]=>
int(44)
}
["o2"]=>
&object(tfoo)(1) {
["c"]=>
int(44)
}
}
---- ACTUAL OUTPUT
Warning: session_start() [/phpmanual/function.session-start.html]: read returned less bytes than
requested in /usr/src/php-4.3.1/ext/session/tests/019.php on line 27
array(0) {
}
Fatal error: Call to a member function on a non-object in
/usr/src/php-4.3.1/ext/session/tests/019.php on line 31
---- FAILED
================================================================================
001- array(2) {
001+ Warning: session_start() [/phpmanual/function.session-start.html]: read returned less bytes
than requested in /usr/src/php-4.3.1/ext/session/tests/019.php on line 27
002- ["o1"]=>
002+ array(0) {
003- &object(tfoo)(1) {
003+ }
004- ["c"]=>
004+
005- int(42)
005+ Fatal error: Call to a member function on a non-object in
/usr/src/php-4.3.1/ext/session/tests/019.php on line 31
006- }
007- ["o2"]=>
008- &object(tfoo)(1) {
009- ["c"]=>
010- int(42)
011- }
012- }
013- array(2) {
014- ["o1"]=>
015- &object(tfoo)(1) {
016- ["c"]=>
017- int(44)
018- }
019- ["o2"]=>
020- &object(tfoo)(1) {
021- ["c"]=>
022- int(44)
023- }
024- }
================================================================================
================================================================================
BUILD ENVIRONMENT
================================================================================
OS:
Linux
Automake:
automake (GNU automake) 1.4-p4
Copyright (C) 1999, 2001 Free Software Foundation, Inc.
This is free software; see the source for copying conditions. There is NO
warranty; not even for MERCHANTABILITY or FITNESS FOR A PARTICULAR PURPOSE.
Written by Tom Tromey <tromey@cygnus.com>
Autoconf:
Autoconf version 2.13
Libtool:
ltmain.sh (GNU libtool) 1.4.2 (1.922.2.53 2001/09/11 03:18:52)
Compiler:
Reading specs from /usr/lib/gcc-lib/sparc-linux/2.95.4/specs
gcc version 2.95.4 20011002 (Debian prerelease)
Bison:
bison (GNU Bison) 1.35
Copyright 1984, 1986, 1989, 1992, 2000, 2001, 2002
Free Software Foundation, Inc.
This is free software; see the source for copying conditions. There is NO
warranty; not even for MERCHANTABILITY or FITNESS FOR A PARTICULAR PURPOSE.
User's E-mail:
================================================================================
PHPINFO
================================================================================
phpinfo()
PHP Version => 4.3.1
System => Linux sokaris 2.4.18 #2 Thu Apr 11 14:37:17 EDT 2002 sparc64
Build Date => May 22 2003 11:39:35
Configure Command => './configure' '--with-apxs=/usr/bin/apxs'
'--enable-force-cgi-redirect'
Server API => Command Line Interface
Virtual Directory Support => disabled
Configuration File (php.ini) Path => /usr/local/lib
PHP API => 20020918
PHP Extension => 20020429
Zend Extension => 20021010
Debug Build => no
Thread Safety => disabled
Registered PHP Streams => php, http, ftp
This program makes use of the Zend Scripting Language Engine:
Zend Engine v1.3.0, Copyright (c) 1998-2002 Zend Technologies
_______________________________________________________________________
Configuration
PHP Core
Directive => Local Value => Master Value
allow_call_time_pass_reference => On => On
allow_url_fopen => On => On
always_populate_raw_post_data => Off => Off
arg_separator.input => & => &
arg_separator.output => & => &
asp_tags => Off => Off
auto_append_file => no value => no value
auto_prepend_file => no value => no value
browscap => no value => no value
default_charset => no value => no value
default_mimetype => text/html => text/html
define_syslog_variables => Off => Off
disable_functions => no value => no value
display_errors => On => On
display_startup_errors => Off => Off
doc_root => no value => no value
docref_ext => no value => no value
docref_root => http://www.php.net/ => http://www.php.net/
enable_dl => On => On
error_append_string => no value => no value
error_log => no value => no value
error_prepend_string => no value => no value
error_reporting => no value => no value
expose_php => On => On
extension_dir => /usr/local/lib/php/extensions/no-debug-non-zts-20020429 =>
/usr/local/lib/php/extensions/no-debug-non-zts-20020429
file_uploads => On => On
gpc_order => GPC => GPC
highlight.bg => #FFFFFF => #FFFFFF
highlight.comment => #FF8000 => #FF8000
highlight.default => #0000BB => #0000BB
highlight.html => #000000 => #000000
highlight.keyword => #007700 => #007700
highlight.string => #DD0000 => #DD0000
html_errors => Off => On
ignore_repeated_errors => Off => Off
ignore_repeated_source => Off => Off
ignore_user_abort => Off => Off
implicit_flush => On => Off
include_path => .:/usr/local/lib/php => .:/usr/local/lib/php
log_errors => Off => Off
log_errors_max_len => 1024 => 1024
magic_quotes_gpc => On => On
magic_quotes_runtime => Off => Off
magic_quotes_sybase => Off => Off
max_execution_time => 0 => 30
max_input_time => -1 => -1
open_basedir => no value => no value
output_buffering => 0 => 0
output_handler => no value => no value
post_max_size => 8M => 8M
precision => 14 => 14
register_argc_argv => On => On
register_globals => Off => Off
report_memleaks => On => On
safe_mode => Off => Off
safe_mode_exec_dir => 1 => 1
safe_mode_gid => Off => Off
safe_mode_include_dir => no value => no value
sendmail_from => no value => no value
sendmail_path => /usr/sbin/sendmail -t -i => /usr/sbin/sendmail -t -i
short_open_tag => On => On
SMTP => localhost => localhost
smtp_port => 25 => 25
sql.safe_mode => Off => Off
track_errors => Off => Off
unserialize_callback_func => no value => no value
upload_max_filesize => 2M => 2M
upload_tmp_dir => no value => no value
user_dir => no value => no value
variables_order => no value => no value
xmlrpc_error_number => 0 => 0
xmlrpc_errors => Off => Off
y2k_compliance => On => On
ctype
ctype functions => enabled
mysql
MySQL Support => enabled
Active Persistent Links => 0
Active Links => 0
Client API version => 3.23.49
MYSQL_MODULE_TYPE => builtin
MYSQL_SOCKET => /tmp/mysql.sock
MYSQL_INCLUDE => MYSQL_LIBS =>
Directive => Local Value => Master Value
mysql.allow_persistent => On => On
mysql.connect_timeout => -1 => -1
mysql.default_host => no value => no value
mysql.default_password => no value => no value
mysql.default_port => no value => no value
mysql.default_socket => no value => no value
mysql.default_user => no value => no value
mysql.max_links => Unlimited => Unlimited
mysql.max_persistent => Unlimited => Unlimited
mysql.trace_mode => Off => Off
overload
User-Space Object Overloading Support => enabled
pcre
PCRE (Perl Compatible Regular Expressions) Support => enabled
PCRE Library Version => 3.92 11-Sep-2002
posix
Revision => $Revision: 1.51 $
session
Session Support => enabled
Registered save handlers => files user
Directive => Local Value => Master Value
session.auto_start => Off => Off
session.bug_compat_42 => On => On
session.bug_compat_warn => On => On
session.cache_expire => 180 => 180
session.cache_limiter => nocache => nocache
session.cookie_domain => no value => no value
session.cookie_lifetime => 0 => 0
session.cookie_path => / => /
session.cookie_secure => Off => Off
session.entropy_file => no value => no value
session.entropy_length => 0 => 0
session.gc_dividend => 100 => 100
session.gc_maxlifetime => 1440 => 1440
session.gc_probability => 1 => 1
session.name => PHPSESSID => PHPSESSID
session.referer_check => no value => no value
session.save_handler => files => files
session.save_path => /tmp => /tmp
session.serialize_handler => php => php
session.use_cookies => On => On
session.use_only_cookies => Off => Off
session.use_trans_sid => Off => Off
standard
Regex Library => Bundled library enabled
Dynamic Library Support => enabled
Path to sendmail => /usr/sbin/sendmail -t -i
Directive => Local Value => Master Value
assert.active => 1 => 1
assert.bail => 0 => 0
assert.callback => no value => no value
assert.quiet_eval => 0 => 0
assert.warning => 1 => 1
auto_detect_line_endings => 0 => 0
default_socket_timeout => 60 => 60
safe_mode_allowed_env_vars => PHP_ => PHP_
safe_mode_protected_env_vars => LD_LIBRARY_PATH => LD_LIBRARY_PATH
url_rewriter.tags => a=href,area=href,frame=src,form=,fieldset= =>
a=href,area=href,frame=src,form=,fieldset=
user_agent => no value => no value
tokenizer
Tokenizer Support => enabled
xml
XML Support => active
XML Namespace Support => active
EXPAT Version => 1.95.2
Additional Modules
Module Name
Environment
Variable => Value
PWD => /usr/src/php-4.3.1
MAKEFLAGS => MFLAGS => HZ => 100
REDIRECT_STATUS => TEST_PHP_EXECUTABLE => /usr/src/php-4.3.1/sapi/cli/php
CC => gcc
USER => root
SCRIPT_FILENAME => MAIL => /var/mail/root
PATH_TRANSLATED => QUERY_STRING => CONTENT_LENGTH => MAKELEVEL => 1
SHLVL => 3
LOGNAME => root
_ => /usr/src/php-4.3.1/sapi/cli/php
REQUEST_METHOD => SHELL => /bin/sh
TEST_PHP_SRCDIR => /usr/src/php-4.3.1
TERM => screen
HOME => /root
PATH => /usr/local/sbin:/usr/local/bin:/usr/sbin:/usr/bin:/sbin:/bin:/usr/bin/X11
CONTENT_TYPE =>
PHP Variables
Variable => Value
_SERVER["PWD"] => /usr/src/php-4.3.1
_SERVER["MAKEFLAGS"] =>
_SERVER["MFLAGS"] =>
_SERVER["HZ"] => 100
_SERVER["REDIRECT_STATUS"] =>
_SERVER["TEST_PHP_EXECUTABLE"] => /usr/src/php-4.3.1/sapi/cli/php
_SERVER["CC"] => gcc
_SERVER["USER"] => root
_SERVER["SCRIPT_FILENAME"] =>
_SERVER["MAIL"] => /var/mail/root
_SERVER["PATH_TRANSLATED"] =>
_SERVER["QUERY_STRING"] =>
_SERVER["CONTENT_LENGTH"] =>
_SERVER["MAKELEVEL"] => 1
_SERVER["SHLVL"] => 3
_SERVER["LOGNAME"] => root
_SERVER["_"] => /usr/src/php-4.3.1/sapi/cli/php
_SERVER["REQUEST_METHOD"] =>
_SERVER["SHELL"] => /bin/sh
_SERVER["TEST_PHP_SRCDIR"] => /usr/src/php-4.3.1
_SERVER["TERM"] => screen
_SERVER["HOME"] => /root
_SERVER["PATH"] =>
/usr/local/sbin:/usr/local/bin:/usr/sbin:/usr/bin:/sbin:/bin:/usr/bin/X11
_SERVER["CONTENT_TYPE"] =>
_SERVER["PHP_SELF"] =>
_SERVER["SCRIPT_NAME"] =>
_SERVER["DOCUMENT_ROOT"] =>
_SERVER["argv"] => Array
(
)
_SERVER["argc"] => 0
_ENV["PWD"] => /usr/src/php-4.3.1
_ENV["MAKEFLAGS"] =>
_ENV["MFLAGS"] =>
_ENV["HZ"] => 100
_ENV["REDIRECT_STATUS"] =>
_ENV["TEST_PHP_EXECUTABLE"] => /usr/src/php-4.3.1/sapi/cli/php
_ENV["CC"] => gcc
_ENV["USER"] => root
_ENV["SCRIPT_FILENAME"] =>
_ENV["MAIL"] => /var/mail/root
_ENV["PATH_TRANSLATED"] =>
_ENV["QUERY_STRING"] =>
_ENV["CONTENT_LENGTH"] =>
_ENV["MAKELEVEL"] => 1
_ENV["SHLVL"] => 3
_ENV["LOGNAME"] => root
_ENV["_"] => /usr/src/php-4.3.1/sapi/cli/php
_ENV["REQUEST_METHOD"] =>
_ENV["SHELL"] => /bin/sh
_ENV["TEST_PHP_SRCDIR"] => /usr/src/php-4.3.1
_ENV["TERM"] => screen
_ENV["HOME"] => /root
_ENV["PATH"] =>
/usr/local/sbin:/usr/local/bin:/usr/sbin:/usr/bin:/sbin:/bin:/usr/bin/X11
_ENV["CONTENT_TYPE"] =>
PHP License
This program is free software; you can redistribute it and/or modify
it under the terms of the PHP License as published by the PHP Group
and included in the distribution in the file: LICENSE
This program is distributed in the hope that it will be useful,
but WITHOUT ANY WARRANTY; without even the implied warranty of
MERCHANTABILITY or FITNESS FOR A PARTICULAR PURPOSE.
If you did not receive a copy of the PHP license, or have any
questions about PHP licensing, please contact license@php.net.