Test results for unknown [failed]

From: Date: Thu, 22 May 2003 17:51:06 +0000
Subject: Test results for unknown [failed]
Groups: php.qa 
Request: Send a blank email to php-qa+get-12891@lists.php.net to get a copy of this message
===================================================================== FAILED TEST SUMMARY --------------------------------------------------------------------- Bug #21131: fopen($filename, "a+") has broken position [ext/standard/tests/file/bug21131.phpt] Simple math tests [ext/standard/tests/math/abs.phpt] log() tests [ext/standard/tests/math/log.phpt] Various pow() tests [ext/standard/tests/math/pow.phpt] Simple math tests [ext/standard/tests/math/round.phpt] Bug #20934 (htmlspecialchars returns latin1 from UTF-8) [ext/standard/tests/strings/bug20934.phpt] htmlentities() test 1 (cp1252) [ext/standard/tests/strings/htmlentities01.phpt] htmlentities() test 3 (setlocale / de_DE.ISO-8859-1) [ext/standard/tests/strings/htmlentities03.phpt] htmlentities() test 10 (default_charset / cp1252) [ext/standard/tests/strings/htmlentities10.phpt] htmlentities() test 11 (default_charset / ISO-8859-15) [ext/standard/tests/strings/htmlentities11.phpt] htmlentities() test 12 (default_charset / ISO-8859-1) [ext/standard/tests/strings/htmlentities12.phpt] htmlentities() test 13 (default_charset / EUC-JP) [ext/standard/tests/strings/htmlentities13.phpt] htmlentities() test 14 (default_charset / Shift_JIS) [ext/standard/tests/strings/htmlentities14.phpt] microtime() function [ext/standard/tests/time/001.phpt] strtotime() function [ext/standard/tests/time/002.phpt] ===================================================================== ===================================================================== TEST RESULT SUMMARY --------------------------------------------------------------------- Exts skipped : 79 Exts tested : 9 --------------------------------------------------------------------- Number of tests : 443 Tests skipped : 230 (51.9%) Tests failed : 15 ( 3.4%) Tests passed : 198 (44.7%) --------------------------------------------------------------------- Time taken : 928 seconds ===================================================================== ================================================================================ /usr/local/src/php-4.3.1/ext/standard/tests/file/bug21131.phpt ================================================================================ ---- EXPECTED OUTPUT int(6) int(0) foobar ---- ACTUAL OUTPUT int(0) int(0) foobar ---- FAILED ================================================================================ 001- int(6) 001+ int(0) ================================================================================ ================================================================================ /usr/local/src/php-4.3.1/ext/standard/tests/math/abs.phpt ================================================================================ ---- EXPECTED OUTPUT 1,1,0,0 OK ---- ACTUAL OUTPUT 1,1,1,1 Assert failed: -LONG_MIN+1 === abs(LONG_MIN-1) Left: int(-9223372036854775807) Right: int(9223372036854775807) Assert failed: -LONG_MIN === abs(LONG_MIN) Left: int(-9223372036854775808) Right: float(9.2233720368548E+18) ---- FAILED ================================================================================ 001- 1,1,0,0 001+ 1,1,1,1 002- OK 002+ 003+ Assert failed: 004+ -LONG_MIN+1 === abs(LONG_MIN-1) 005+ Left: int(-9223372036854775807) 006+ Right: int(9223372036854775807) 007+ 008+ Assert failed: 009+ -LONG_MIN === abs(LONG_MIN) 010+ Left: int(-9223372036854775808) 011+ Right: float(9.2233720368548E+18) ================================================================================ ================================================================================ /usr/local/src/php-4.3.1/ext/standard/tests/math/log.phpt ================================================================================ ---- EXPECTED OUTPUT On failure, please mail result to php-dev@lists.php.net 200 50 50 50 50 50 50 50 50 50 ---- ACTUAL OUTPUT On failure, please mail result to php-dev@lists.php.net 200 ---- FAILED ================================================================================ 003- 50 004- 50 005- 50 006- 50 007- 50 008- 50 009- 50 010- 50 011- 50 ================================================================================ ================================================================================ /usr/local/src/php-4.3.1/ext/standard/tests/math/pow.phpt ================================================================================ ---- EXPECTED OUTPUT 1,1,0,0 On failure, please mail result to php-dev@lists.php.net OK ---- ACTUAL OUTPUT 1,1,1,1 On failure, please mail result to php-dev@lists.php.net Assert failed: TRUE === is_infinite(pow(0,-2)) Left: bool(true) Right: bool(false) Assert failed: TRUE === is_infinite(pow(0,-1)) Left: bool(true) Right: bool(false) Assert failed: TRUE === is_infinite(pow(0,-2.0)) Left: bool(true) Right: bool(false) Assert failed: TRUE === is_infinite(pow(0,-1.0)) Left: bool(true) Right: bool(false) Assert failed: TRUE === is_infinite(pow(0.0,-2.0)) Left: bool(true) Right: bool(false) Assert failed: TRUE === is_infinite(pow(0.0,-1.0)) Left: bool(true) Right: bool(false) Assert failed: TRUE === is_infinite(pow( 0.0,-2)) Left: bool(true) Right: bool(false) Assert failed: TRUE === is_infinite(pow( 0.0,-1)) Left: bool(true) Right: bool(false) Assert failed: LONG_MAX-1 === pow(LONG_MAX-1,1) Left: int(9223372036854775806) Right: int(-9223372036854775808) Assert failed: LONG_MIN+1 === pow(LONG_MIN+1,1) Left: int(-9223372036854775807) Right: int(-9223372036854775808) Assert failed: LONG_MAX === pow(LONG_MAX,1) Left: int(9223372036854775807) Right: int(-9223372036854775808) ---- FAILED ================================================================================ 001- 1,1,0,0 001+ 1,1,1,1 003- OK 003+ 004+ Assert failed: 005+ TRUE === is_infinite(pow(0,-2)) 006+ Left: bool(true) 007+ Right: bool(false) 008+ 009+ Assert failed: 010+ TRUE === is_infinite(pow(0,-1)) 011+ Left: bool(true) 012+ Right: bool(false) 013+ 014+ Assert failed: 015+ TRUE === is_infinite(pow(0,-2.0)) 016+ Left: bool(true) 017+ Right: bool(false) 018+ 019+ Assert failed: 020+ TRUE === is_infinite(pow(0,-1.0)) 021+ Left: bool(true) 022+ Right: bool(false) 023+ 024+ Assert failed: 025+ TRUE === is_infinite(pow(0.0,-2.0)) 026+ Left: bool(true) 027+ Right: bool(false) 028+ 029+ Assert failed: 030+ TRUE === is_infinite(pow(0.0,-1.0)) 031+ Left: bool(true) 032+ Right: bool(false) 033+ 034+ Assert failed: 035+ TRUE === is_infinite(pow( 0.0,-2)) 036+ Left: bool(true) 037+ Right: bool(false) 038+ 039+ Assert failed: 040+ TRUE === is_infinite(pow( 0.0,-1)) 041+ Left: bool(true) 042+ Right: bool(false) 043+ 044+ Assert failed: 045+ LONG_MAX-1 === pow(LONG_MAX-1,1) 046+ Left: int(9223372036854775806) 047+ Right: int(-9223372036854775808) 048+ 049+ Assert failed: 050+ LONG_MIN+1 === pow(LONG_MIN+1,1) 051+ Left: int(-9223372036854775807) 052+ Right: int(-9223372036854775808) 053+ 054+ Assert failed: 055+ LONG_MAX === pow(LONG_MAX,1) 056+ Left: int(9223372036854775807) 057+ Right: int(-9223372036854775808) ================================================================================ ================================================================================ /usr/local/src/php-4.3.1/ext/standard/tests/math/round.phpt ================================================================================ ---- EXPECTED OUTPUT 1,1,0,0 OK ---- ACTUAL OUTPUT 1,1,1,1 Assert failed: LONG_MIN-1 ~== round(LONG_MIN - 0.6) Left: int(9223372036854775807) Right: float(-9.2233720368548E+18) Assert failed: LONG_MIN-1 ~== floor(LONG_MIN - 0.5) Left: int(9223372036854775807) Right: float(-9.2233720368548E+18) Assert failed: LONG_MAX+1 ~== ceil(LONG_MAX + 0.5) Left: int(-9223372036854775808) Right: float(9.2233720368548E+18) Assert failed: LONG_MAX+1 ~== round(LONG_MAX + 0.6) Left: int(-9223372036854775808) Right: float(9.2233720368548E+18) ---- FAILED ================================================================================ 001- 1,1,0,0 001+ 1,1,1,1 002- OK 002+ 003+ Assert failed: 004+ LONG_MIN-1 ~== round(LONG_MIN - 0.6) 005+ Left: int(9223372036854775807) 006+ Right: float(-9.2233720368548E+18) 007+ 008+ Assert failed: 009+ LONG_MIN-1 ~== floor(LONG_MIN - 0.5) 010+ Left: int(9223372036854775807) 011+ Right: float(-9.2233720368548E+18) 012+ 013+ Assert failed: 014+ LONG_MAX+1 ~== ceil(LONG_MAX + 0.5) 015+ Left: int(-9223372036854775808) 016+ Right: float(9.2233720368548E+18) 017+ 018+ Assert failed: 019+ LONG_MAX+1 ~== round(LONG_MAX + 0.6) 020+ Left: int(-9223372036854775808) 021+ Right: float(9.2233720368548E+18) ================================================================================ ================================================================================ /usr/local/src/php-4.3.1/ext/standard/tests/strings/bug20934.phpt ================================================================================ ---- EXPECTED OUTPUT string(2) "àá" string(2) "àá" ---- ACTUAL OUTPUT string(2) "àá" ---- FAILED ================================================================================ 002- string(2) "àá" ================================================================================ ================================================================================ /usr/local/src/php-4.3.1/ext/standard/tests/strings/htmlentities01.phpt ================================================================================ ---- EXPECTED OUTPUT string(28) "&sbquo;&dagger;&trade;&Yuml;" string(32) "&euro;&cent;&pound;&curren;&yen;" ---- ACTUAL OUTPUT ---- FAILED ================================================================================ 001- string(28) "&sbquo;&dagger;&trade;&Yuml;" 001+ 002- string(32) "&euro;&cent;&pound;&curren;&yen;" ================================================================================ ================================================================================ /usr/local/src/php-4.3.1/ext/standard/tests/strings/htmlentities03.phpt ================================================================================ ---- EXPECTED OUTPUT string(18) "&auml;&ouml;&uuml;" ---- ACTUAL OUTPUT ---- FAILED ================================================================================ 001- string(18) "&auml;&ouml;&uuml;" 001+ ================================================================================ ================================================================================ /usr/local/src/php-4.3.1/ext/standard/tests/strings/htmlentities10.phpt ================================================================================ ---- EXPECTED OUTPUT cp1252 string(28) "&sbquo;&dagger;&trade;&Yuml;" string(32) "&euro;&cent;&pound;&curren;&yen;" ---- ACTUAL OUTPUT cp1252 ---- FAILED ================================================================================ 002- string(28) "&sbquo;&dagger;&trade;&Yuml;" 003- string(32) "&euro;&cent;&pound;&curren;&yen;" ================================================================================ ================================================================================ /usr/local/src/php-4.3.1/ext/standard/tests/strings/htmlentities11.phpt ================================================================================ ---- EXPECTED OUTPUT ISO-8859-15 string(20) "&OElig;&oelig;&Yuml;" ---- ACTUAL OUTPUT ISO-8859-15 ---- FAILED ================================================================================ 002- string(20) "&OElig;&oelig;&Yuml;" ================================================================================ ================================================================================ /usr/local/src/php-4.3.1/ext/standard/tests/strings/htmlentities12.phpt ================================================================================ ---- EXPECTED OUTPUT ISO-8859-1 string(18) "&auml;&ouml;&uuml;" ---- ACTUAL OUTPUT ISO-8859-1 ---- FAILED ================================================================================ 002- string(18) "&auml;&ouml;&uuml;" ================================================================================ ================================================================================ /usr/local/src/php-4.3.1/ext/standard/tests/strings/htmlentities13.phpt ================================================================================ ---- EXPECTED OUTPUT EUC-JP string(6) "¡¢¡£¡¤" ---- ACTUAL OUTPUT EUC-JP ---- FAILED ================================================================================ 002- string(6) "¡¢¡£¡¤" ================================================================================ ================================================================================ /usr/local/src/php-4.3.1/ext/standard/tests/strings/htmlentities14.phpt ================================================================================ ---- EXPECTED OUTPUT Shift_JIS string(6) "ABC" ---- ACTUAL OUTPUT Shift_JIS ---- FAILED ================================================================================ 002- string(6) "ABC" ================================================================================ ================================================================================ /usr/local/src/php-4.3.1/ext/standard/tests/time/001.phpt ================================================================================ ---- EXPECTED OUTPUT Passed: 100000 Failed: 0 ---- ACTUAL OUTPUT Passed: 74665 Failed: 25335 000004: 1053624544 0.80010100 < 1053624544 0.80010100 000007: 1053624544 0.80303100 < 1053624544 0.80303100 000009: 1053624544 0.80498400 < 1053624544 0.80498400 000012: 1053624544 0.80889000 < 1053624544 0.80889000 000014: 1053624544 0.81084300 < 1053624544 0.81084300 000017: 1053624544 0.81377300 < 1053624544 0.81377300 000020: 1053624544 0.81670200 < 1053624544 0.81670200 000023: 1053624544 0.82060900 < 1053624544 0.82060900 000025: 1053624544 0.82256200 < 1053624544 0.82256200 000027: 1053624544 0.82451500 < 1053624544 0.82451500 000029: 1053624544 0.82646800 < 1053624544 0.82646800 ---- FAILED ================================================================================ 001- Passed: 100000 001+ Passed: 74665 002- Failed: 0 002+ Failed: 25335 003+ 000004: 1053624544 0.80010100 < 1053624544 0.80010100 004+ 000007: 1053624544 0.80303100 < 1053624544 0.80303100 005+ 000009: 1053624544 0.80498400 < 1053624544 0.80498400 006+ 000012: 1053624544 0.80889000 < 1053624544 0.80889000 007+ 000014: 1053624544 0.81084300 < 1053624544 0.81084300 008+ 000017: 1053624544 0.81377300 < 1053624544 0.81377300 009+ 000020: 1053624544 0.81670200 < 1053624544 0.81670200 010+ 000023: 1053624544 0.82060900 < 1053624544 0.82060900 011+ 000025: 1053624544 0.82256200 < 1053624544 0.82256200 012+ 000027: 1053624544 0.82451500 < 1053624544 0.82451500 013+ 000029: 1053624544 0.82646800 < 1053624544 0.82646800 ================================================================================ ================================================================================ /usr/local/src/php-4.3.1/ext/standard/tests/time/002.phpt ================================================================================ ---- EXPECTED OUTPUT 1999-10-13 00:00:00 1999-10-13 00:00:00 2000-01-19 00:00:00 2000-01-19 00:00:00 2001-12-21 00:00:00 2001-12-21 00:00:00 2001-12-21 12:16:00 2001-12-21 12:16:00 1969-12-31 23:59:59 2001-10-22 21:19:58 2001-10-22 23:19:58 2001-10-22 23:32:58 2001-10-22 19:19:58 2001-10-22 19:06:58 1999-10-13 00:00:00 1999-10-13 00:00:00 2000-01-19 00:00:00 2000-01-19 00:00:00 2001-12-21 00:00:00 2001-12-21 00:00:00 2001-12-21 12:16:00 2001-12-21 12:16:00 1970-01-01 00:59:59 2001-10-22 21:19:58 2001-10-23 01:19:58 2001-10-23 01:32:58 2001-10-22 21:19:58 2001-10-22 21:06:58 ---- ACTUAL OUTPUT 1999-10-13 00:00:00 1999-10-13 00:00:00 2000-01-19 00:00:00 2000-01-19 00:00:00 2001-12-21 00:00:00 2001-12-21 00:00:00 2001-12-21 12:16:00 2001-12-21 12:16:00 1969-12-31 18:59:59 2001-10-22 21:19:58 2001-10-22 19:19:58 2001-10-22 19:32:58 2001-10-22 15:19:58 2001-10-22 15:06:58 1999-10-13 00:00:00 1999-10-13 00:00:00 2000-01-19 00:00:00 2000-01-19 00:00:00 2001-12-21 00:00:00 2001-12-21 00:00:00 2001-12-21 12:16:00 2001-12-21 12:16:00 1969-12-31 18:59:59 2001-10-22 21:19:58 2001-10-22 19:19:58 2001-10-22 19:32:58 2001-10-22 15:19:58 2001-10-22 15:06:58 ---- FAILED ================================================================================ 009- 1969-12-31 23:59:59 009+ 1969-12-31 18:59:59 011- 2001-10-22 23:19:58 011+ 2001-10-22 19:19:58 012- 2001-10-22 23:32:58 012+ 2001-10-22 19:32:58 013- 2001-10-22 19:19:58 013+ 2001-10-22 15:19:58 014- 2001-10-22 19:06:58 014+ 2001-10-22 15:06:58 023- 1970-01-01 00:59:59 023+ 1969-12-31 18:59:59 025- 2001-10-23 01:19:58 025+ 2001-10-22 19:19:58 026- 2001-10-23 01:32:58 026+ 2001-10-22 19:32:58 027- 2001-10-22 21:19:58 027+ 2001-10-22 15:19:58 028- 2001-10-22 21:06:58 028+ 2001-10-22 15:06:58 ================================================================================ ================================================================================ BUILD ENVIRONMENT ================================================================================ OS: OSF1 Automake: automake (GNU automake) 1.7.1 Written by Tom Tromey <tromey@redhat.com>. Copyright 2002 Free Software Foundation, Inc. This is free software; see the source for copying conditions. There is NO warranty; not even for MERCHANTABILITY or FITNESS FOR A PARTICULAR PURPOSE. Autoconf: autoconf (GNU Autoconf) 2.56 Written by David J. MacKenzie and Akim Demaille. Copyright 2002 Free Software Foundation, Inc. This is free software; see the source for copying conditions. There is NO warranty; not even for MERCHANTABILITY or FITNESS FOR A PARTICULAR PURPOSE. Libtool: ltmain.sh (GNU libtool) 1.4.2 (1.922.2.53 2001/09/11 03:18:52) Compiler: Reading specs from /usr/local/lib/gcc-lib/alpha-dec-osf4.0g/3.2.2/specs Configured with: ../gcc-3.2.2/configure Thread model: single gcc version 3.2.2 Bison: bison (GNU Bison) 1.35 Copyright 1984, 1986, 1989, 1992, 2000, 2001, 2002 Free Software Foundation, Inc. This is free software; see the source for copying conditions. There is NO warranty; not even for MERCHANTABILITY or FITNESS FOR A PARTICULAR PURPOSE. User's E-mail: weber at bucknell dot edu ================================================================================ PHPINFO ================================================================================ phpinfo() PHP Version => 4.3.1 System => OSF1 weber.bucknell.edu V4.0 1530 alpha Build Date => May 22 2003 12:25:32 Configure Command => './configure' '--with-snmp' '--without-mysql' Server API => Command Line Interface Virtual Directory Support => disabled Configuration File (php.ini) Path => /usr/local/lib PHP API => 20020918 PHP Extension => 20020429 Zend Extension => 20021010 Debug Build => no Thread Safety => disabled Registered PHP Streams => php, http, ftp This program makes use of the Zend Scripting Language Engine: Zend Engine v1.3.0, Copyright (c) 1998-2002 Zend Technologies _______________________________________________________________________ Configuration PHP Core Directive => Local Value => Master Value allow_call_time_pass_reference => On => On allow_url_fopen => On => On always_populate_raw_post_data => Off => Off arg_separator.input => &amp; => &amp; arg_separator.output => &amp; => &amp; asp_tags => Off => Off auto_append_file => no value => no value auto_prepend_file => no value => no value browscap => no value => no value default_charset => no value => no value default_mimetype => text/html => text/html define_syslog_variables => Off => Off disable_functions => no value => no value display_errors => On => On display_startup_errors => Off => Off doc_root => no value => no value docref_ext => no value => no value docref_root => http://www.php.net/ => http://www.php.net/ enable_dl => On => On error_append_string => no value => no value error_log => no value => no value error_prepend_string => no value => no value error_reporting => no value => no value expose_php => On => On extension_dir => /usr/local/lib/php/extensions/no-debug-non-zts-20020429 => /usr/local/lib/php/extensions/no-debug-non-zts-20020429 file_uploads => On => On gpc_order => GPC => GPC highlight.bg => #FFFFFF => #FFFFFF highlight.comment => #FF8000 => #FF8000 highlight.default => #0000BB => #0000BB highlight.html => #000000 => #000000 highlight.keyword => #007700 => #007700 highlight.string => #DD0000 => #DD0000 html_errors => Off => On ignore_repeated_errors => Off => Off ignore_repeated_source => Off => Off ignore_user_abort => Off => Off implicit_flush => On => Off include_path => .:/usr/local/lib/php => .:/usr/local/lib/php log_errors => Off => Off log_errors_max_len => 1024 => 1024 magic_quotes_gpc => On => On magic_quotes_runtime => Off => Off magic_quotes_sybase => Off => Off max_execution_time => 0 => 30 max_input_time => -1 => -1 open_basedir => no value => no value output_buffering => 0 => 0 output_handler => no value => no value post_max_size => 8M => 8M precision => 14 => 14 register_argc_argv => On => On register_globals => Off => Off report_memleaks => On => On safe_mode => Off => Off safe_mode_exec_dir => 1 => 1 safe_mode_gid => Off => Off safe_mode_include_dir => no value => no value sendmail_from => no value => no value sendmail_path => /usr/sbin/sendmail -t -i => /usr/sbin/sendmail -t -i short_open_tag => On => On SMTP => localhost => localhost smtp_port => 25 => 25 sql.safe_mode => Off => Off track_errors => Off => Off unserialize_callback_func => no value => no value upload_max_filesize => 2M => 2M upload_tmp_dir => no value => no value user_dir => no value => no value variables_order => no value => no value xmlrpc_error_number => 0 => 0 xmlrpc_errors => Off => Off y2k_compliance => On => On ctype ctype functions => enabled overload User-Space Object Overloading Support => enabled pcre PCRE (Perl Compatible Regular Expressions) Support => enabled PCRE Library Version => 3.92 11-Sep-2002 posix Revision => $Revision: 1.51 $ session Session Support => enabled Registered save handlers => files user Directive => Local Value => Master Value session.auto_start => Off => Off session.bug_compat_42 => On => On session.bug_compat_warn => On => On session.cache_expire => 180 => 180 session.cache_limiter => nocache => nocache session.cookie_domain => no value => no value session.cookie_lifetime => 0 => 0 session.cookie_path => / => / session.cookie_secure => Off => Off session.entropy_file => no value => no value session.entropy_length => 0 => 0 session.gc_dividend => 100 => 100 session.gc_maxlifetime => 1440 => 1440 session.gc_probability => 1 => 1 session.name => PHPSESSID => PHPSESSID session.referer_check => no value => no value session.save_handler => files => files session.save_path => /tmp => /tmp session.serialize_handler => php => php session.use_cookies => On => On session.use_only_cookies => Off => Off session.use_trans_sid => Off => Off snmp NET-SNMP Support => enabled NET-SNMP Version => 5.0.8 standard Regex Library => Bundled library enabled Dynamic Library Support => enabled Path to sendmail => /usr/sbin/sendmail -t -i Directive => Local Value => Master Value assert.active => 1 => 1 assert.bail => 0 => 0 assert.callback => no value => no value assert.quiet_eval => 0 => 0 assert.warning => 1 => 1 auto_detect_line_endings => 0 => 0 default_socket_timeout => 60 => 60 safe_mode_allowed_env_vars => PHP_ => PHP_ safe_mode_protected_env_vars => LD_LIBRARY_PATH => LD_LIBRARY_PATH url_rewriter.tags => a=href,area=href,frame=src,form=,fieldset= => a=href,area=href,frame=src,form=,fieldset= user_agent => no value => no value tokenizer Tokenizer Support => enabled xml XML Support => active XML Namespace Support => active EXPAT Version => 1.95.2 Additional Modules Module Name Environment Variable => Value CC => gcc CONTENT_LENGTH => CONTENT_TYPE => DISPLAY => :0.0 DTAPPSEARCHPATH => //.dt/appmanager:/etc/dt/appconfig/appmanager/%L:/etc/dt/appconfig/appmanager/C:/usr/dt/appconfig/appmanager/%L:/usr/dt/appconfig/appmanager/C DTDATABASESEARCHPATH => //.dt/types/fp_dynamic,//.dt/types,/etc/dt/appconfig/types/%L,/etc/dt/appconfig/types/C,/usr/dt/appconfig/types/%L,/usr/dt/appconfig/types/C DTHELPSEARCHPATH => //.dt/help/root-weber.bucknell.edu-0/%H://.dt/help/root-weber.bucknell.edu-0/%H.sdl://.dt/help/root-weber.bucknell.edu-0/%H.hv://.dt/help/%H://.dt/help/%H.sdl://.dt/help/%H.hv:/etc/dt/appconfig/help/%L/%H:/etc/dt/appconfig/help/%L/%H.sdl:/etc/dt/appconfig/help/%L/%H.hv:/etc/dt/appconfig/help/C/%H:/etc/dt/appconfig/help/C/%H.sdl:/etc/dt/appconfig/help/C/%H.hv:/usr/dt/appconfig/help/%L/%H:/usr/dt/appconfig/help/%L/%H.sdl:/usr/dt/appconfig/help/%L/%H.hv:/usr/dt/appconfig/help/C/%H:/usr/dt/appconfig/help/C/%H.sdl:/usr/dt/appconfig/help/C/%H.hv DTSCREENSAVERLIST => StartDtscreenSwarm StartDtscreenQix StartDtscreenFlame StartDtscreenHop StartDtscreenImage StartDtscreenLife StartDtscreenRotor StartDtscreenPyro StartDtscreenWorm StartDtscreenBlank DTUSERSESSION => root-weber.bucknell.edu-0 EDITOR => emacs GROUP => daemon HOME => /usr/users/weber HOST => weber.bucknell.edu HOSTTYPE => alpha LANG => C LESS => miCes LOGNAME => weber LPDEST => lp0 MACHTYPE => alpha MAIL => /usr/spool/mail/root MAKEFLAGS => MAKELEVEL => 1 MANPATH => /usr/local/man:/usr/share/%L/man:/usr/share/man:/usr/local/lib/perl5/5.00503/man:/usr/dt/share/man MFLAGS => MOZILLA_HOME => /usr/local/share/netscape NLSPATH => /usr/lib/nls/msg/%L/%N:/usr/dt/lib/nls/msg/%L/%N.cat OSTYPE => osf1 PAGER => less PATH => /usr/local/bin:/usr/local/sbin:/usr/ucb:/bin:/usr/bin:/etc:/usr/etc:/usr/bin/X11:/usr/local/lib:/usr/sbin PATH_TRANSLATED => PWD => /usr/local/src/php-4.3.1 QUERY_STRING => REDIRECT_STATUS => REQUEST_METHOD => SCRIPT_FILENAME => SESSIONTYPE => dt SESSION_SVR => weber.bucknell.edu SHELL => /bin/ksh SHLVL => 2 TERM => dtterm TERMINAL_EMULATOR => dtterm TEST_PHP_EXECUTABLE => /usr/local/src/php-4.3.1/sapi/cli/php TEST_PHP_SRCDIR => /usr/local/src/php-4.3.1 USER => weber VENDOR => dec WINDOWID => 92274743 XAUTHORITY => /usr/users/weber/.Xauthority XFILESEARCHPATH => %D:/etc/dt/app-defaults/%L/%N:/etc/dt/app-defaults/C/%N:/usr/dt/app-defaults/%L/%N:/usr/dt/app-defaults/C/%N XMICONBMSEARCHPATH => //.dt/icons/%B%M.bm://.dt/icons/%B%M.pm://.dt/icons/%B:/etc/dt/appconfig/icons/%L/%B%M.bm:/etc/dt/appconfig/icons/%L/%B%M.pm:/etc/dt/appconfig/icons/%L/%B:/etc/dt/appconfig/icons/C/%B%M.bm:/etc/dt/appconfig/icons/C/%B%M.pm:/etc/dt/appconfig/icons/C/%B:/usr/dt/appconfig/icons/%L/%B%M.bm:/usr/dt/appconfig/icons/%L/%B%M.pm:/usr/dt/appconfig/icons/%L/%B:/usr/dt/appconfig/icons/C/%B%M.bm:/usr/dt/appconfig/icons/C/%B%M.pm:/usr/dt/appconfig/icons/C/%B XMICONSEARCHPATH => //.dt/icons/%B%M.pm://.dt/icons/%B%M.bm://.dt/icons/%B:/etc/dt/appconfig/icons/%L/%B%M.pm:/etc/dt/appconfig/icons/%L/%B%M.bm:/etc/dt/appconfig/icons/%L/%B:/etc/dt/appconfig/icons/C/%B%M.pm:/etc/dt/appconfig/icons/C/%B%M.bm:/etc/dt/appconfig/icons/C/%B:/usr/dt/appconfig/icons/%L/%B%M.pm:/usr/dt/appconfig/icons/%L/%B%M.bm:/usr/dt/appconfig/icons/%L/%B:/usr/dt/appconfig/icons/C/%B%M.pm:/usr/dt/appconfig/icons/C/%B%M.bm:/usr/dt/appconfig/icons/C/%B PHP Variables Variable => Value _SERVER["CC"] => gcc _SERVER["CONTENT_LENGTH"] => _SERVER["CONTENT_TYPE"] => _SERVER["DISPLAY"] => :0.0 _SERVER["DTAPPSEARCHPATH"] => //.dt/appmanager:/etc/dt/appconfig/appmanager/%L:/etc/dt/appconfig/appmanager/C:/usr/dt/appconfig/appmanager/%L:/usr/dt/appconfig/appmanager/C _SERVER["DTDATABASESEARCHPATH"] => //.dt/types/fp_dynamic,//.dt/types,/etc/dt/appconfig/types/%L,/etc/dt/appconfig/types/C,/usr/dt/appconfig/types/%L,/usr/dt/appconfig/types/C _SERVER["DTHELPSEARCHPATH"] => //.dt/help/root-weber.bucknell.edu-0/%H://.dt/help/root-weber.bucknell.edu-0/%H.sdl://.dt/help/root-weber.bucknell.edu-0/%H.hv://.dt/help/%H://.dt/help/%H.sdl://.dt/help/%H.hv:/etc/dt/appconfig/help/%L/%H:/etc/dt/appconfig/help/%L/%H.sdl:/etc/dt/appconfig/help/%L/%H.hv:/etc/dt/appconfig/help/C/%H:/etc/dt/appconfig/help/C/%H.sdl:/etc/dt/appconfig/help/C/%H.hv:/usr/dt/appconfig/help/%L/%H:/usr/dt/appconfig/help/%L/%H.sdl:/usr/dt/appconfig/help/%L/%H.hv:/usr/dt/appconfig/help/C/%H:/usr/dt/appconfig/help/C/%H.sdl:/usr/dt/appconfig/help/C/%H.hv _SERVER["DTSCREENSAVERLIST"] => StartDtscreenSwarm StartDtscreenQix StartDtscreenFlame StartDtscreenHop StartDtscreenImage StartDtscreenLife StartDtscreenRotor StartDtscreenPyro StartDtscreenWorm StartDtscreenBlank _SERVER["DTUSERSESSION"] => root-weber.bucknell.edu-0 _SERVER["EDITOR"] => emacs _SERVER["GROUP"] => daemon _SERVER["HOME"] => /usr/users/weber _SERVER["HOST"] => weber.bucknell.edu _SERVER["HOSTTYPE"] => alpha _SERVER["LANG"] => C _SERVER["LESS"] => miCes _SERVER["LOGNAME"] => weber _SERVER["LPDEST"] => lp0 _SERVER["MACHTYPE"] => alpha _SERVER["MAIL"] => /usr/spool/mail/root _SERVER["MAKEFLAGS"] => _SERVER["MAKELEVEL"] => 1 _SERVER["MANPATH"] => /usr/local/man:/usr/share/%L/man:/usr/share/man:/usr/local/lib/perl5/5.00503/man:/usr/dt/share/man _SERVER["MFLAGS"] => _SERVER["MOZILLA_HOME"] => /usr/local/share/netscape _SERVER["NLSPATH"] => /usr/lib/nls/msg/%L/%N:/usr/dt/lib/nls/msg/%L/%N.cat _SERVER["OSTYPE"] => osf1 _SERVER["PAGER"] => less _SERVER["PATH"] => /usr/local/bin:/usr/local/sbin:/usr/ucb:/bin:/usr/bin:/etc:/usr/etc:/usr/bin/X11:/usr/local/lib:/usr/sbin _SERVER["PATH_TRANSLATED"] => _SERVER["PWD"] => /usr/local/src/php-4.3.1 _SERVER["QUERY_STRING"] => _SERVER["REDIRECT_STATUS"] => _SERVER["REQUEST_METHOD"] => _SERVER["SCRIPT_FILENAME"] => _SERVER["SESSIONTYPE"] => dt _SERVER["SESSION_SVR"] => weber.bucknell.edu _SERVER["SHELL"] => /bin/ksh _SERVER["SHLVL"] => 2 _SERVER["TERM"] => dtterm _SERVER["TERMINAL_EMULATOR"] => dtterm _SERVER["TEST_PHP_EXECUTABLE"] => /usr/local/src/php-4.3.1/sapi/cli/php _SERVER["TEST_PHP_SRCDIR"] => /usr/local/src/php-4.3.1 _SERVER["USER"] => weber _SERVER["VENDOR"] => dec _SERVER["WINDOWID"] => 92274743 _SERVER["XAUTHORITY"] => /usr/users/weber/.Xauthority _SERVER["XFILESEARCHPATH"] => %D:/etc/dt/app-defaults/%L/%N:/etc/dt/app-defaults/C/%N:/usr/dt/app-defaults/%L/%N:/usr/dt/app-defaults/C/%N _SERVER["XMICONBMSEARCHPATH"] => //.dt/icons/%B%M.bm://.dt/icons/%B%M.pm://.dt/icons/%B:/etc/dt/appconfig/icons/%L/%B%M.bm:/etc/dt/appconfig/icons/%L/%B%M.pm:/etc/dt/appconfig/icons/%L/%B:/etc/dt/appconfig/icons/C/%B%M.bm:/etc/dt/appconfig/icons/C/%B%M.pm:/etc/dt/appconfig/icons/C/%B:/usr/dt/appconfig/icons/%L/%B%M.bm:/usr/dt/appconfig/icons/%L/%B%M.pm:/usr/dt/appconfig/icons/%L/%B:/usr/dt/appconfig/icons/C/%B%M.bm:/usr/dt/appconfig/icons/C/%B%M.pm:/usr/dt/appconfig/icons/C/%B _SERVER["XMICONSEARCHPATH"] => //.dt/icons/%B%M.pm://.dt/icons/%B%M.bm://.dt/icons/%B:/etc/dt/appconfig/icons/%L/%B%M.pm:/etc/dt/appconfig/icons/%L/%B%M.bm:/etc/dt/appconfig/icons/%L/%B:/etc/dt/appconfig/icons/C/%B%M.pm:/etc/dt/appconfig/icons/C/%B%M.bm:/etc/dt/appconfig/icons/C/%B:/usr/dt/appconfig/icons/%L/%B%M.pm:/usr/dt/appconfig/icons/%L/%B%M.bm:/usr/dt/appconfig/icons/%L/%B:/usr/dt/appconfig/icons/C/%B%M.pm:/usr/dt/appconfig/icons/C/%B%M.bm:/usr/dt/appconfig/icons/C/%B _SERVER["PHP_SELF"] => _SERVER["SCRIPT_NAME"] => _SERVER["DOCUMENT_ROOT"] => _SERVER["argv"] => Array ( ) _SERVER["argc"] => 0 _ENV["CC"] => gcc _ENV["CONTENT_LENGTH"] => _ENV["CONTENT_TYPE"] => _ENV["DISPLAY"] => :0.0 _ENV["DTAPPSEARCHPATH"] => //.dt/appmanager:/etc/dt/appconfig/appmanager/%L:/etc/dt/appconfig/appmanager/C:/usr/dt/appconfig/appmanager/%L:/usr/dt/appconfig/appmanager/C _ENV["DTDATABASESEARCHPATH"] => //.dt/types/fp_dynamic,//.dt/types,/etc/dt/appconfig/types/%L,/etc/dt/appconfig/types/C,/usr/dt/appconfig/types/%L,/usr/dt/appconfig/types/C _ENV["DTHELPSEARCHPATH"] => //.dt/help/root-weber.bucknell.edu-0/%H://.dt/help/root-weber.bucknell.edu-0/%H.sdl://.dt/help/root-weber.bucknell.edu-0/%H.hv://.dt/help/%H://.dt/help/%H.sdl://.dt/help/%H.hv:/etc/dt/appconfig/help/%L/%H:/etc/dt/appconfig/help/%L/%H.sdl:/etc/dt/appconfig/help/%L/%H.hv:/etc/dt/appconfig/help/C/%H:/etc/dt/appconfig/help/C/%H.sdl:/etc/dt/appconfig/help/C/%H.hv:/usr/dt/appconfig/help/%L/%H:/usr/dt/appconfig/help/%L/%H.sdl:/usr/dt/appconfig/help/%L/%H.hv:/usr/dt/appconfig/help/C/%H:/usr/dt/appconfig/help/C/%H.sdl:/usr/dt/appconfig/help/C/%H.hv _ENV["DTSCREENSAVERLIST"] => StartDtscreenSwarm StartDtscreenQix StartDtscreenFlame StartDtscreenHop StartDtscreenImage StartDtscreenLife StartDtscreenRotor StartDtscreenPyro StartDtscreenWorm StartDtscreenBlank _ENV["DTUSERSESSION"] => root-weber.bucknell.edu-0 _ENV["EDITOR"] => emacs _ENV["GROUP"] => daemon _ENV["HOME"] => /usr/users/weber _ENV["HOST"] => weber.bucknell.edu _ENV["HOSTTYPE"] => alpha _ENV["LANG"] => C _ENV["LESS"] => miCes _ENV["LOGNAME"] => weber _ENV["LPDEST"] => lp0 _ENV["MACHTYPE"] => alpha _ENV["MAIL"] => /usr/spool/mail/root _ENV["MAKEFLAGS"] => _ENV["MAKELEVEL"] => 1 _ENV["MANPATH"] => /usr/local/man:/usr/share/%L/man:/usr/share/man:/usr/local/lib/perl5/5.00503/man:/usr/dt/share/man _ENV["MFLAGS"] => _ENV["MOZILLA_HOME"] => /usr/local/share/netscape _ENV["NLSPATH"] => /usr/lib/nls/msg/%L/%N:/usr/dt/lib/nls/msg/%L/%N.cat _ENV["OSTYPE"] => osf1 _ENV["PAGER"] => less _ENV["PATH"] => /usr/local/bin:/usr/local/sbin:/usr/ucb:/bin:/usr/bin:/etc:/usr/etc:/usr/bin/X11:/usr/local/lib:/usr/sbin _ENV["PATH_TRANSLATED"] => _ENV["PWD"] => /usr/local/src/php-4.3.1 _ENV["QUERY_STRING"] => _ENV["REDIRECT_STATUS"] => _ENV["REQUEST_METHOD"] => _ENV["SCRIPT_FILENAME"] => _ENV["SESSIONTYPE"] => dt _ENV["SESSION_SVR"] => weber.bucknell.edu _ENV["SHELL"] => /bin/ksh _ENV["SHLVL"] => 2 _ENV["TERM"] => dtterm _ENV["TERMINAL_EMULATOR"] => dtterm _ENV["TEST_PHP_EXECUTABLE"] => /usr/local/src/php-4.3.1/sapi/cli/php _ENV["TEST_PHP_SRCDIR"] => /usr/local/src/php-4.3.1 _ENV["USER"] => weber _ENV["VENDOR"] => dec _ENV["WINDOWID"] => 92274743 _ENV["XAUTHORITY"] => /usr/users/weber/.Xauthority _ENV["XFILESEARCHPATH"] => %D:/etc/dt/app-defaults/%L/%N:/etc/dt/app-defaults/C/%N:/usr/dt/app-defaults/%L/%N:/usr/dt/app-defaults/C/%N _ENV["XMICONBMSEARCHPATH"] => //.dt/icons/%B%M.bm://.dt/icons/%B%M.pm://.dt/icons/%B:/etc/dt/appconfig/icons/%L/%B%M.bm:/etc/dt/appconfig/icons/%L/%B%M.pm:/etc/dt/appconfig/icons/%L/%B:/etc/dt/appconfig/icons/C/%B%M.bm:/etc/dt/appconfig/icons/C/%B%M.pm:/etc/dt/appconfig/icons/C/%B:/usr/dt/appconfig/icons/%L/%B%M.bm:/usr/dt/appconfig/icons/%L/%B%M.pm:/usr/dt/appconfig/icons/%L/%B:/usr/dt/appconfig/icons/C/%B%M.bm:/usr/dt/appconfig/icons/C/%B%M.pm:/usr/dt/appconfig/icons/C/%B _ENV["XMICONSEARCHPATH"] => //.dt/icons/%B%M.pm://.dt/icons/%B%M.bm://.dt/icons/%B:/etc/dt/appconfig/icons/%L/%B%M.pm:/etc/dt/appconfig/icons/%L/%B%M.bm:/etc/dt/appconfig/icons/%L/%B:/etc/dt/appconfig/icons/C/%B%M.pm:/etc/dt/appconfig/icons/C/%B%M.bm:/etc/dt/appconfig/icons/C/%B:/usr/dt/appconfig/icons/%L/%B%M.pm:/usr/dt/appconfig/icons/%L/%B%M.bm:/usr/dt/appconfig/icons/%L/%B:/usr/dt/appconfig/icons/C/%B%M.pm:/usr/dt/appconfig/icons/C/%B%M.bm:/usr/dt/appconfig/icons/C/%B PHP License This program is free software; you can redistribute it and/or modify it under the terms of the PHP License as published by the PHP Group and included in the distribution in the file: LICENSE This program is distributed in the hope that it will be useful, but WITHOUT ANY WARRANTY; without even the implied warranty of MERCHANTABILITY or FITNESS FOR A PARTICULAR PURPOSE. If you did not receive a copy of the PHP license, or have any questions about PHP licensing, please contact license@php.net.

« previous php.qa (#12891) next »