Test results for 4.3.2RC4 [failed]
| From: | noreply@php.net | Date: | Thu, 22 May 2003 18:12:41 +0000 |
| Subject: | Test results for 4.3.2RC4 [failed] | ||
| Groups: | php.qa | ||
| Request: | Send a blank email to php-qa+get-12897@lists.php.net to get a copy of this message | ||
=====================================================================
FAILED TEST SUMMARY
---------------------------------------------------------------------
Bug #20539 (PHP CLI Segmentation Fault) [tests/basic/bug20539.phpt]
session object serialization [ext/session/tests/001.phpt]
session object deserialization [ext/session/tests/003.phpt]
correct instantiation of references between variables in sessions [ext/session/tests/006.phpt]
bug compatibility: unset($c) with enabled register_globals [ext/session/tests/007.phpt]
bug compatibility: global is used albeit register_globals=0 [ext/session/tests/008-php4.2.3.phpt]
unset($_SESSION["name"]); should work with register_globals=off
[ext/session/tests/009.phpt]
registering $_SESSION should not segfault [ext/session/tests/012.phpt]
redefining SID should not cause warnings [ext/session/tests/013.phpt]
a script should not be able to modify session.use_trans_sid [ext/session/tests/014.phpt]
use_trans_sid should not affect SID [ext/session/tests/015.phpt]
invalid session.save_path should not cause a segfault [ext/session/tests/016.phpt]
setting $_SESSION before session_start() should not cause segfault [ext/session/tests/017.phpt]
rewriter correctly handles attribute names which contain dashes [ext/session/tests/018.phpt]
serializing references test case using globals [ext/session/tests/019.phpt]
rewriter uses arg_seperator.output for modifying URLs [ext/session/tests/020.phpt]
rewriter handles form and fieldset tags correctly [ext/session/tests/021.phpt]
=====================================================================
=====================================================================
TEST RESULT SUMMARY
---------------------------------------------------------------------
Exts skipped : 58
Exts tested : 30
---------------------------------------------------------------------
Number of tests : 476
Tests skipped : 180 (37.8%)
Tests failed : 17 ( 3.6%)
Tests passed : 279 (58.6%)
---------------------------------------------------------------------
Time taken : 98 seconds
=====================================================================
================================================================================
/usr/src/redhat/BUILD/php-4.3.2RC4/php-4.3.2RC4/tests/basic/bug20539.phpt
================================================================================
---- EXPECTED OUTPUT
good :)
---- ACTUAL OUTPUT
Could not startup.
---- FAILED
================================================================================
001- good :)
001+ Could not startup.
================================================================================
================================================================================
/usr/src/redhat/BUILD/php-4.3.2RC4/php-4.3.2RC4/ext/session/tests/001.phpt
================================================================================
---- EXPECTED OUTPUT
baz|O:3:"foo":2:{s:3:"bar";s:2:"ok";s:3:"yes";s:4:"done";}arr|a:1:{i:3;O:3:"foo":2:{s:3:"bar";s:2:"ok";s:3:"yes";s:4:"done";}}
---- ACTUAL OUTPUT
Fatal error: session_register(): Failed to initialize storage module. in
/usr/src/redhat/BUILD/php-4.3.2RC4/php-4.3.2RC4/ext/session/tests/001.php on line 16
---- FAILED
================================================================================
001-
baz|O:3:"foo":2:{s:3:"bar";s:2:"ok";s:3:"yes";s:4:"done";}arr|a:1:{i:3;O:3:"foo":2:{s:3:"bar";s:2:"ok";s:3:"yes";s:4:"done";}}
001+ Fatal error: session_register(): Failed to initialize storage module. in
/usr/src/redhat/BUILD/php-4.3.2RC4/php-4.3.2RC4/ext/session/tests/001.php on line 16
================================================================================
================================================================================
/usr/src/redhat/BUILD/php-4.3.2RC4/php-4.3.2RC4/ext/session/tests/003.phpt
================================================================================
---- EXPECTED OUTPUT
object(foo)(2) {
["bar"]=>
string(2) "ok"
["yes"]=>
int(2)
}
array(1) {
[3]=>
&object(foo)(2) {
["bar"]=>
string(2) "ok"
["yes"]=>
int(2)
}
}
---- ACTUAL OUTPUT
Fatal error: session_start(): Failed to initialize storage module. in
/usr/src/redhat/BUILD/php-4.3.2RC4/php-4.3.2RC4/ext/session/tests/003.php on line 10
---- FAILED
================================================================================
001- object(foo)(2) {
001+ Fatal error: session_start(): Failed to initialize storage module. in
/usr/src/redhat/BUILD/php-4.3.2RC4/php-4.3.2RC4/ext/session/tests/003.php on line 10
002- ["bar"]=>
003- string(2) "ok"
004- ["yes"]=>
005- int(2)
006- }
007- array(1) {
008- [3]=>
009- &object(foo)(2) {
010- ["bar"]=>
011- string(2) "ok"
012- ["yes"]=>
013- int(2)
014- }
015- }
================================================================================
================================================================================
/usr/src/redhat/BUILD/php-4.3.2RC4/php-4.3.2RC4/ext/session/tests/006.phpt
================================================================================
---- EXPECTED OUTPUT
original values:
object(a)(1) {
["test"]=>
string(5) "hallo"
}
object(b)(1) {
["a"]=>
&object(a)(1) {
["test"]=>
string(5) "hallo"
}
}
values after session:
object(a)(1) {
["test"]=>
string(5) "hallo"
}
object(b)(1) {
["a"]=>
&object(a)(1) {
["test"]=>
string(5) "hallo"
}
}
---- ACTUAL OUTPUT
Fatal error: session_start(): Failed to initialize storage module. in
/usr/src/redhat/BUILD/php-4.3.2RC4/php-4.3.2RC4/ext/session/tests/006.php on line 5
---- FAILED
================================================================================
001- original values:
001+ Fatal error: session_start(): Failed to initialize storage module. in
/usr/src/redhat/BUILD/php-4.3.2RC4/php-4.3.2RC4/ext/session/tests/006.php on line 5
002- object(a)(1) {
003- ["test"]=>
004- string(5) "hallo"
005- }
006- object(b)(1) {
007- ["a"]=>
008- &object(a)(1) {
009- ["test"]=>
010- string(5) "hallo"
011- }
012- }
013- values after session:
014- object(a)(1) {
015- ["test"]=>
016- string(5) "hallo"
017- }
018- object(b)(1) {
019- ["a"]=>
020- &object(a)(1) {
021- ["test"]=>
022- string(5) "hallo"
023- }
024- }
================================================================================
================================================================================
/usr/src/redhat/BUILD/php-4.3.2RC4/php-4.3.2RC4/ext/session/tests/007.phpt
================================================================================
---- EXPECTED OUTPUT
float(3.14)
array(1) {
["c"]=>
&float(3.14)
}
float(3.14)
array(1) {
["c"]=>
&float(3.14)
}
---- ACTUAL OUTPUT
Fatal error: session_start(): Failed to initialize storage module. in
/usr/src/redhat/BUILD/php-4.3.2RC4/php-4.3.2RC4/ext/session/tests/007.php on line 7
---- FAILED
================================================================================
001- float(3.14)
001+ Fatal error: session_start(): Failed to initialize storage module. in
/usr/src/redhat/BUILD/php-4.3.2RC4/php-4.3.2RC4/ext/session/tests/007.php on line 7
002- array(1) {
003- ["c"]=>
004- &float(3.14)
005- }
006- float(3.14)
007- array(1) {
008- ["c"]=>
009- &float(3.14)
010- }
================================================================================
================================================================================
/usr/src/redhat/BUILD/php-4.3.2RC4/php-4.3.2RC4/ext/session/tests/008-php4.2.3.phpt
================================================================================
---- EXPECTED OUTPUT
NULL
Your script possibly relies on a session side-effect which existed until PHP 4.2.3. Please be
advised that the session extension does not consider global variables as a source of data, unless
register_globals is enabled. You can disable this functionality and this warning by setting
session.bug_compat_42 or session.bug_compat_warn to off, respectively.
array(1) {
["c"]=>
float(3.14)
}
NULL
array(1) {
["c"]=>
float(3.14)
}
---- ACTUAL OUTPUT
Fatal error: session_start(): Failed to initialize storage module. in
/usr/src/redhat/BUILD/php-4.3.2RC4/php-4.3.2RC4/ext/session/tests/008-php4.2.3.php on line 5
---- FAILED
================================================================================
001- NULL
001+ Fatal error: session_start(): Failed to initialize storage module. in
/usr/src/redhat/BUILD/php-4.3.2RC4/php-4.3.2RC4/ext/session/tests/008-php4.2.3.php on line 5
002- Your script possibly relies on a session side-effect which existed until PHP 4.2.3. Please be
advised that the session extension does not consider global variables as a source of data, unless
register_globals is enabled. You can disable this functionality and this warning by setting
session.bug_compat_42 or session.bug_compat_warn to off, respectively.
003- array(1) {
004- ["c"]=>
005- float(3.14)
006- }
007- NULL
008- array(1) {
009- ["c"]=>
010- float(3.14)
011- }
================================================================================
================================================================================
/usr/src/redhat/BUILD/php-4.3.2RC4/php-4.3.2RC4/ext/session/tests/009.phpt
================================================================================
---- EXPECTED OUTPUT
array(0) {
}
array(1) {
["name"]=>
string(3) "foo"
}
array(1) {
["name"]=>
string(3) "foo"
}
array(0) {
}
array(0) {
}
---- ACTUAL OUTPUT
Fatal error: session_start(): Failed to initialize storage module. in
/usr/src/redhat/BUILD/php-4.3.2RC4/php-4.3.2RC4/ext/session/tests/009.php on line 7
---- FAILED
================================================================================
001- array(0) {
001+ Fatal error: session_start(): Failed to initialize storage module. in
/usr/src/redhat/BUILD/php-4.3.2RC4/php-4.3.2RC4/ext/session/tests/009.php on line 7
002- }
003- array(1) {
004- ["name"]=>
005- string(3) "foo"
006- }
007- array(1) {
008- ["name"]=>
009- string(3) "foo"
010- }
011- array(0) {
012- }
013- array(0) {
014- }
================================================================================
================================================================================
/usr/src/redhat/BUILD/php-4.3.2RC4/php-4.3.2RC4/ext/session/tests/012.phpt
================================================================================
---- EXPECTED OUTPUT
I live
---- ACTUAL OUTPUT
Fatal error: session_start(): Failed to initialize storage module. in
/usr/src/redhat/BUILD/php-4.3.2RC4/php-4.3.2RC4/ext/session/tests/012.php on line 7
---- FAILED
================================================================================
001- I live
001+ Fatal error: session_start(): Failed to initialize storage module. in
/usr/src/redhat/BUILD/php-4.3.2RC4/php-4.3.2RC4/ext/session/tests/012.php on line 7
================================================================================
================================================================================
/usr/src/redhat/BUILD/php-4.3.2RC4/php-4.3.2RC4/ext/session/tests/013.phpt
================================================================================
---- EXPECTED OUTPUT
I live
---- ACTUAL OUTPUT
Fatal error: session_start(): Failed to initialize storage module. in
/usr/src/redhat/BUILD/php-4.3.2RC4/php-4.3.2RC4/ext/session/tests/013.php on line 5
---- FAILED
================================================================================
001- I live
001+ Fatal error: session_start(): Failed to initialize storage module. in
/usr/src/redhat/BUILD/php-4.3.2RC4/php-4.3.2RC4/ext/session/tests/013.php on line 5
================================================================================
================================================================================
/usr/src/redhat/BUILD/php-4.3.2RC4/php-4.3.2RC4/ext/session/tests/014.phpt
================================================================================
---- EXPECTED OUTPUT
<a href="/link?PHPSESSID=abtest">
<a href="/link?PHPSESSID=abtest">
<a href="/link?PHPSESSID=abtest">
---- ACTUAL OUTPUT
Fatal error: session_start(): Failed to initialize storage module. in
/usr/src/redhat/BUILD/php-4.3.2RC4/php-4.3.2RC4/ext/session/tests/014.php on line 5
---- FAILED
================================================================================
001- <a href="/link?PHPSESSID=abtest">
001+ Fatal error: session_start(): Failed to initialize storage module. in
/usr/src/redhat/BUILD/php-4.3.2RC4/php-4.3.2RC4/ext/session/tests/014.php on line 5
002- <a href="/link?PHPSESSID=abtest">
003- <a href="/link?PHPSESSID=abtest">
================================================================================
================================================================================
/usr/src/redhat/BUILD/php-4.3.2RC4/php-4.3.2RC4/ext/session/tests/015.phpt
================================================================================
---- EXPECTED OUTPUT
<a href="/link?PHPSESSID=abtest&PHPSESSID=abtest">
---- ACTUAL OUTPUT
Fatal error: session_start(): Failed to initialize storage module. in
/usr/src/redhat/BUILD/php-4.3.2RC4/php-4.3.2RC4/ext/session/tests/015.php on line 5
---- FAILED
================================================================================
001- <a href="/link?PHPSESSID=abtest&PHPSESSID=abtest">
001+ Fatal error: session_start(): Failed to initialize storage module. in
/usr/src/redhat/BUILD/php-4.3.2RC4/php-4.3.2RC4/ext/session/tests/015.php on line 5
================================================================================
================================================================================
/usr/src/redhat/BUILD/php-4.3.2RC4/php-4.3.2RC4/ext/session/tests/016.phpt
================================================================================
---- EXPECTED OUTPUT
I live
---- ACTUAL OUTPUT
---- FAILED
================================================================================
001- I live
001+
================================================================================
================================================================================
/usr/src/redhat/BUILD/php-4.3.2RC4/php-4.3.2RC4/ext/session/tests/017.phpt
================================================================================
---- EXPECTED OUTPUT
I live
---- ACTUAL OUTPUT
Fatal error: session_start(): Failed to initialize storage module. in
/usr/src/redhat/BUILD/php-4.3.2RC4/php-4.3.2RC4/ext/session/tests/017.php on line 8
---- FAILED
================================================================================
001- I live
001+ Fatal error: session_start(): Failed to initialize storage module. in
/usr/src/redhat/BUILD/php-4.3.2RC4/php-4.3.2RC4/ext/session/tests/017.php on line 8
================================================================================
================================================================================
/usr/src/redhat/BUILD/php-4.3.2RC4/php-4.3.2RC4/ext/session/tests/018.phpt
================================================================================
---- EXPECTED OUTPUT
<form accept-charset="ISO-8859-15, ISO-8859-1" action=url.php><input
type="hidden" name="PHPSESSID" value="abtest" />
---- ACTUAL OUTPUT
Fatal error: session_start(): Failed to initialize storage module. in
/usr/src/redhat/BUILD/php-4.3.2RC4/php-4.3.2RC4/ext/session/tests/018.php on line 6
---- FAILED
================================================================================
001- <form accept-charset="ISO-8859-15, ISO-8859-1" action=url.php><input
type="hidden" name="PHPSESSID" value="abtest" />
001+ Fatal error: session_start(): Failed to initialize storage module. in
/usr/src/redhat/BUILD/php-4.3.2RC4/php-4.3.2RC4/ext/session/tests/018.php on line 6
================================================================================
================================================================================
/usr/src/redhat/BUILD/php-4.3.2RC4/php-4.3.2RC4/ext/session/tests/019.phpt
================================================================================
---- EXPECTED OUTPUT
array(2) {
["o1"]=>
&object(tfoo)(1) {
["c"]=>
int(42)
}
["o2"]=>
&object(tfoo)(1) {
["c"]=>
int(42)
}
}
array(2) {
["o1"]=>
&object(tfoo)(1) {
["c"]=>
int(44)
}
["o2"]=>
&object(tfoo)(1) {
["c"]=>
int(44)
}
}
---- ACTUAL OUTPUT
Fatal error: session_register(): Failed to initialize storage module. in
/usr/src/redhat/BUILD/php-4.3.2RC4/php-4.3.2RC4/ext/session/tests/019.php on line 16
---- FAILED
================================================================================
001- array(2) {
001+ Fatal error: session_register(): Failed to initialize storage module. in
/usr/src/redhat/BUILD/php-4.3.2RC4/php-4.3.2RC4/ext/session/tests/019.php on line 16
002- ["o1"]=>
003- &object(tfoo)(1) {
004- ["c"]=>
005- int(42)
006- }
007- ["o2"]=>
008- &object(tfoo)(1) {
009- ["c"]=>
010- int(42)
011- }
012- }
013- array(2) {
014- ["o1"]=>
015- &object(tfoo)(1) {
016- ["c"]=>
017- int(44)
018- }
019- ["o2"]=>
020- &object(tfoo)(1) {
021- ["c"]=>
022- int(44)
023- }
024- }
================================================================================
================================================================================
/usr/src/redhat/BUILD/php-4.3.2RC4/php-4.3.2RC4/ext/session/tests/020.phpt
================================================================================
---- EXPECTED OUTPUT
<a href="link.php?a=b&PHPSESSID=abtest">
---- ACTUAL OUTPUT
Fatal error: session_start(): Failed to initialize storage module. in
/usr/src/redhat/BUILD/php-4.3.2RC4/php-4.3.2RC4/ext/session/tests/020.php on line 6
---- FAILED
================================================================================
001- <a href="link.php?a=b&PHPSESSID=abtest">
001+ Fatal error: session_start(): Failed to initialize storage module. in
/usr/src/redhat/BUILD/php-4.3.2RC4/php-4.3.2RC4/ext/session/tests/020.php on line 6
================================================================================
================================================================================
/usr/src/redhat/BUILD/php-4.3.2RC4/php-4.3.2RC4/ext/session/tests/021.phpt
================================================================================
---- EXPECTED OUTPUT
<form><input type="hidden" name="PHPSESSID" value="abtest"
/>
<fieldset><input type="hidden" name="PHPSESSID"
value="abtest" />
<form><input type="hidden" name="PHPSESSID" value="abtest"
/>
<fieldset>
<form><input type="hidden" name="PHPSESSID" value="abtest"
/>
<fieldset>
<form>
<fieldset><input type="hidden" name="PHPSESSID"
value="abtest" />
---- ACTUAL OUTPUT
Fatal error: session_start(): Failed to initialize storage module. in
/usr/src/redhat/BUILD/php-4.3.2RC4/php-4.3.2RC4/ext/session/tests/021.php on line 6
---- FAILED
================================================================================
001- <form><input type="hidden" name="PHPSESSID"
value="abtest" />
001+ Fatal error: session_start(): Failed to initialize storage module. in
/usr/src/redhat/BUILD/php-4.3.2RC4/php-4.3.2RC4/ext/session/tests/021.php on line 6
002- <fieldset><input type="hidden" name="PHPSESSID"
value="abtest" />
003- <form><input type="hidden" name="PHPSESSID"
value="abtest" />
004- <fieldset>
005- <form><input type="hidden" name="PHPSESSID"
value="abtest" />
006- <fieldset>
007- <form>
008- <fieldset><input type="hidden" name="PHPSESSID"
value="abtest" />
================================================================================
================================================================================
BUILD ENVIRONMENT
================================================================================
OS:
Linux
Automake:
automake (GNU automake) 1.5
Written by Tom Tromey <tromey@cygnus.com>.
Copyright 1994, 1995, 1996, 1997, 1998, 1999, 2000, 2001
Free Software Foundation, Inc.
This is free software; see the source for copying conditions. There is NO
warranty; not even for MERCHANTABILITY or FITNESS FOR A PARTICULAR PURPOSE.
Autoconf:
Autoconf version 2.13
Libtool:
ltmain.sh (GNU libtool) 1.4.3 (1.922.2.110 2002/10/23 01:39:54)
Compiler:
Reading specs from /usr/lib/gcc-lib/i386-redhat-linux/2.96/specs
gcc version 2.96 20000731 (Red Hat Linux 7.2 2.96-112.7.2)
Bison:
GNU Bison version 1.28
Libraries:
libcrypt.so.1 => /lib/libcrypt.so.1 (0x40022000)
libnsl.so.1 => /lib/libnsl.so.1 (0x4004f000)
libexpat.so.0 => /usr/lib/libexpat.so.0 (0x40065000)
libsybtcl.so => /opt/sybase-12.5/OCS/lib/libsybtcl.so (0x40082000)
libintl.so => /opt/sybase-12.5/OCS/lib/libintl.so (0x400c8000)
libcomn.so => /opt/sybase-12.5/OCS/lib/libcomn.so (0x400d3000)
libct.so => /opt/sybase-12.5/OCS/lib/libct.so (0x40132000)
libcs.so => /opt/sybase-12.5/OCS/lib/libcs.so (0x401a1000)
libpspell.so.4 => /usr/lib/libpspell.so.4 (0x401ae000)
libltdl.so.3 => /usr/lib/libltdl.so.3 (0x401c8000)
libdl.so.2 => /lib/libdl.so.2 (0x401cf000)
libpspell-modules.so.1 => /usr/lib/libpspell-modules.so.1 (0x401d4000)
libstdc++-libc6.2-2.so.3 => /usr/lib/libstdc++-libc6.2-2.so.3 (0x401d6000)
libc.so.6 => /lib/i686/libc.so.6 (0x40219000)
libpng.so.2 => /usr/lib/libpng.so.2 (0x40355000)
libz.so.1 => /usr/lib/libz.so.1 (0x40376000)
libdb-3.2.so => /lib/libdb-3.2.so (0x40384000)
libgdbm.so.2 => /usr/lib/libgdbm.so.2 (0x4042c000)
libbz2.so.1 => /usr/lib/libbz2.so.1 (0x40433000)
libssl.so.2 => /lib/libssl.so.2 (0x40443000)
libcrypto.so.2 => /lib/libcrypto.so.2 (0x40470000)
libresolv.so.2 => /lib/libresolv.so.2 (0x40536000)
libttf.so.2 => /usr/lib/libttf.so.2 (0x40548000)
libm.so.6 => /lib/i686/libm.so.6 (0x40573000)
libfreetype.so.6 => /usr/lib/libfreetype.so.6 (0x40596000)
libjpeg.so.62 => /usr/lib/libjpeg.so.62 (0x405ca000)
libcurl.so.2 => /usr/lib/libcurl.so.2 (0x405e9000)
/lib/ld-linux.so.2 => /lib/ld-linux.so.2 (0x40000000)
User's E-mail: fago at venere dot com
================================================================================
PHPINFO
================================================================================
phpinfo()
PHP Version => 4.3.2RC4
System => Linux cherokee.venere.it 2.4.18-18.7.xsmp #1 SMP Wed Nov 13 19:01:42 EST 2002 i686
Build Date => May 22 2003 18:08:33
Configure Command => './configure' 'i386-redhat-linux'
'--prefix=/usr' '--exec-prefix=/usr' '--bindir=/usr/bin'
'--sbindir=/usr/sbin' '--sysconfdir=/etc' '--datadir=/usr/share'
'--includedir=/usr/include' '--libdir=/usr/lib'
'--libexecdir=/usr/libexec' '--localstatedir=/var'
'--sharedstatedir=/usr/com' '--mandir=/usr/share/man'
'--infodir=/usr/share/info' '--prefix=/usr' '--disable-debug'
'--enable-pic' '--enable-inline-optimization'
'--with-apxs=/usr/sbin/apxs' '--with-config-file-path=/etc'
'--with-sybase-ct=/opt/sybase-12.5/OCS' '--enable-apc=shared'
'--with-bz2' '--with-db3' '--with-exec-dir=/usr/bin'
'--with-gd' '--with-jpeg-dir=/usr' '--with-ttf' '--with-png'
'--with-png-dir=/usr' '--enable-gd-imgstrttf' '--with-gdbm'
'--with-gettext' '--with-regex=system' '--with-zlib'
'--with-layout=GNU' '--with-pear=/usr/lib/php/php' '--enable-bcmath'
'--enable-calendar' '--enable-ftp' '--enable-magic-quotes'
'--enable-sockets' '--enable-sysvsem' '--enable-sysvshm'
'--enable-track-vars' '--enable-trans-sid' '--enable-venere_strings'
'--enable-yp' '--enable-wddx' '--without-mysql'
'--without-unixODBC' '--without-oracle' '--without-oci8'
'--with-pspell' '--with-openssl' '--with-curl'
'--with-xmlrpc' '--with-xml' '--enable-xslt=shared'
'--with-xslt-sablot' '--with-sablot-js=/usr'
Server API => Command Line Interface
Virtual Directory Support => disabled
Configuration File (php.ini) Path => /etc/php.ini
PHP API => 20020918
PHP Extension => 20020429
Zend Extension => 20021010
Debug Build => no
Thread Safety => disabled
Registered PHP Streams => php, http, ftp, https, ftps, compress.bzip2, compress.zlib
This program makes use of the Zend Scripting Language Engine:
Zend Engine v1.3.0, Copyright (c) 1998-2003 Zend Technologies
_______________________________________________________________________
Configuration
PHP Core
Directive => Local Value => Master Value
allow_call_time_pass_reference => On => On
allow_url_fopen => On => On
always_populate_raw_post_data => Off => Off
arg_separator.input => & => &
arg_separator.output => & => &
asp_tags => Off => Off
auto_append_file => /home/httpd/sviluppo/shared-lib/ihr/Debug/append.inc =>
/home/httpd/sviluppo/shared-lib/ihr/Debug/append.inc
auto_prepend_file => /home/httpd/sviluppo/shared-lib/ihr/Debug/prepend.inc =>
/home/httpd/sviluppo/shared-lib/ihr/Debug/prepend.inc
browscap => no value => no value
default_charset => no value => no value
default_mimetype => text/html => text/html
define_syslog_variables => Off => Off
disable_classes => no value => no value
disable_functions => no value => no value
display_errors => On => On
display_startup_errors => Off => Off
doc_root => no value => no value
docref_ext => no value => no value
docref_root => no value => no value
enable_dl => On => On
error_append_string => no value => no value
error_log => /var/log/httpd/php_errors => /var/log/httpd/php_errors
error_prepend_string => no value => no value
error_reporting => 1 => 1
expose_php => On => On
extension_dir => /usr/lib/php/ext/ => /usr/lib/php/ext/
file_uploads => On => On
gpc_order => GPC => GPC
highlight.bg => #FFFFFF => #FFFFFF
highlight.comment => #FF8000 => #FF8000
highlight.default => #0000BB => #0000BB
highlight.html => #000000 => #000000
highlight.keyword => #007700 => #007700
highlight.string => #DD0000 => #DD0000
html_errors => Off => On
ignore_repeated_errors => Off => Off
ignore_repeated_source => Off => Off
ignore_user_abort => Off => Off
implicit_flush => On => On
include_path => .:/home/httpd/sviluppo/shared-lib/php:/home/httpd/sviluppo/shared-lib/ihr =>
.:/home/httpd/sviluppo/shared-lib/php:/home/httpd/sviluppo/shared-lib/ihr
log_errors => On => On
log_errors_max_len => 1024 => 1024
magic_quotes_gpc => Off => Off
magic_quotes_runtime => Off => Off
magic_quotes_sybase => Off => Off
max_execution_time => 0 => 60
max_input_time => -1 => -1
open_basedir => no value => no value
output_buffering => 0 => 0
output_handler => no value => no value
post_max_size => 10M => 10M
precision => 14 => 14
register_argc_argv => On => On
register_globals => On => On
report_memleaks => On => On
safe_mode => Off => Off
safe_mode_exec_dir => /usr/bin => /usr/bin
safe_mode_gid => Off => Off
safe_mode_include_dir => no value => no value
sendmail_from => no value => no value
sendmail_path => /usr/sbin/sendmail -t -i => /usr/sbin/sendmail -t -i
serialize_precision => 100 => 100
short_open_tag => On => On
SMTP => localhost => localhost
smtp_port => 25 => 25
sql.safe_mode => Off => Off
track_errors => On => On
unserialize_callback_func => no value => no value
upload_max_filesize => 2M => 2M
upload_tmp_dir => no value => no value
user_dir => no value => no value
variables_order => GPCS => GPCS
xmlrpc_error_number => 0 => 0
xmlrpc_errors => Off => Off
y2k_compliance => On => On
bcmath
BCMath support => enabled
bz2
BZip2 Support => Enabled
BZip2 Version => 1.0.1, 23-June-2000
calendar
Calendar support => enabled
ctype
ctype functions => enabled
curl
CURL support => enabled
CURL Information => libcurl/7.10.3 zlib/1.1.3
dba
DBA support => enabled
Supported handlers => gdbm cdb cdb_make db3 flatfile
ftp
FTP support => enabled
gd
GD Support => enabled
GD Version => bundled (2.0.12 compatible)
FreeType Support => enabled
FreeType Linkage => with TTF library
GIF Read Support => enabled
JPG Support => enabled
PNG Support => enabled
WBMP Support => enabled
XBM Support => enabled
gettext
GetText Support => enabled
mysql
MySQL Support => enabled
Active Persistent Links => 0
Active Links => 0
Client API version => 3.23.41
MYSQL_MODULE_TYPE => none
MYSQL_SOCKET => /var/lib/mysql/mysql.sock
MYSQL_INCLUDE =>
MYSQL_LIBS =>
Directive => Local Value => Master Value
mysql.allow_persistent => On => On
mysql.connect_timeout => -1 => -1
mysql.default_host => no value => no value
mysql.default_password => no value => no value
mysql.default_port => no value => no value
mysql.default_socket => no value => no value
mysql.default_user => no value => no value
mysql.max_links => Unlimited => Unlimited
mysql.max_persistent => Unlimited => Unlimited
mysql.trace_mode => Off => Off
openssl
OpenSSL support => enabled
OpenSSL Version => OpenSSL 0.9.6b [engine] 9 Jul 2001
overload
User-Space Object Overloading Support => enabled
pcre
PCRE (Perl Compatible Regular Expressions) Support => enabled
PCRE Library Version => 3.92 11-Sep-2002
pgsql
PostgreSQL Support => enabled
Active Persistent Links => 0
Active Links => 0
Directive => Local Value => Master Value
pgsql.allow_persistent => On => On
pgsql.auto_reset_persistent => Off => Off
pgsql.ignore_notice => Off => Off
pgsql.log_notice => Off => Off
pgsql.max_links => Unlimited => Unlimited
pgsql.max_persistent => Unlimited => Unlimited
posix
Revision => $Revision: 1.51.2.2 $
pspell
PSpell Support => enabled
session
Session Support => enabled
Registered save handlers => files user
Directive => Local Value => Master Value
session.auto_start => Off => Off
session.bug_compat_42 => On => On
session.bug_compat_warn => On => On
session.cache_expire => 180 => 180
session.cache_limiter => no value => no value
session.cookie_domain => no value => no value
session.cookie_lifetime => 31536000 => 31536000
session.cookie_path => / => /
session.cookie_secure => Off => Off
session.entropy_file => no value => no value
session.entropy_length => 0 => 0
session.gc_divisor => 100 => 100
session.gc_maxlifetime => 86400 => 86400
session.gc_probability => 100 => 100
session.name => PHPSESSID => PHPSESSID
session.referer_check => no value => no value
session.save_handler => user => user
session.save_path => /var/state/php => /var/state/php
session.serialize_handler => php => php
session.use_cookies => On => On
session.use_only_cookies => Off => Off
session.use_trans_sid => Off => Off
soap
Soap Client => enabled
Soap Server => enabled
Soap Serializer => enabled
sockets
Sockets Support => enabled
standard
Regex Library => Bundled library enabled
Dynamic Library Support => enabled
Path to sendmail => /usr/sbin/sendmail -t -i
Directive => Local Value => Master Value
assert.active => 1 => 1
assert.bail => 0 => 0
assert.callback => no value => no value
assert.quiet_eval => 0 => 0
assert.warning => 1 => 1
auto_detect_line_endings => 0 => 0
default_socket_timeout => 60 => 60
safe_mode_allowed_env_vars => PHP_ => PHP_
safe_mode_protected_env_vars => LD_LIBRARY_PATH => LD_LIBRARY_PATH
url_rewriter.tags => a=href,area=href,frame=src,form=,fieldset= =>
a=href,area=href,frame=src,form=,fieldset=
user_agent => no value => no value
sybase_ct
Sybase_CT Support => enabled
Active Persistent Links => 0
Active Links => 0
Min server severity => 12
Min client severity => 12
Application Name => PHP 4.0
Deadlock retry count => -1
Directive => Local Value => Master Value
sybct.allow_persistent => On => On
sybct.deadlock_retry_count => Unlimited => Unlimited
sybct.hostname => cherokee-debug => cherokee-debug
sybct.max_links => Unlimited => Unlimited
sybct.max_persistent => Unlimited => Unlimited
sybct.min_client_severity => 12 => 12
sybct.min_server_severity => 12 => 12
tokenizer
Tokenizer Support => enabled
wddx
WDDX Support => enabled
WDDX Session Serializer => enabled
xml
XML Support => active
XML Namespace Support => active
EXPAT Version => 1.95.2
xmlrpc
core library version => xmlrpc-epi v. 0.51
php extension version => 0.51
author => Dan Libby
homepage => http://xmlrpc-epi.sourceforge.net
open sourced by => Epinions.com
xslt
XSLT support => enabled
Backend => Sablotron
Sablotron Version => 0.97
yp
YP Support => enabled
zlib
ZLib Support => enabled
Compiled Version => 1.1.3
Linked Version => 1.1.3
Directive => Local Value => Master Value
zlib.output_compression => Off => Off
zlib.output_compression_level => -1 => -1
zlib.output_handler => no value => no value
Additional Modules
Module Name
sysvsem
sysvshm
Environment
Variable => Value
PWD => /usr/src/redhat/BUILD/php-4.3.2RC4/php-4.3.2RC4
MAKEFLAGS =>
SCRIPT_FILENAME =>
PAGER => /usr/bin/less -is
MFLAGS =>
HOSTNAME => cherokee.venere.it
LD_LIBRARY_PATH =>
/opt/sybase-12.5/ASE/lib:/opt/sybase-12.5/FTS/lib:/opt/sybase-12.5/OCS/lib:/opt/sybase-12.5/SQLRemote/lib:
SYBASE_FTS => FTS
SYBASE_SYSAM => SYSAM
LESSOPEN => |/usr/bin/lesspipe.sh %s
CC => gcc
SYBASE_ASE => ASE
SYBASE => /opt/sybase-12.5
REQUEST_METHOD =>
LS_COLORS =>
no=00:fi=00:di=01;34:ln=01;36:pi=40;33:so=01;35:bd=40;33;01:cd=40;33;01:or=01;05;37;41:mi=01;05;37;41:ex=01;32:*.cmd=01;32:*.exe=01;32:*.com=01;32:*.btm=01;32:*.bat=01;32:*.sh=01;32:*.csh=01;32:*.tar=01;31:*.tgz=01;31:*.arj=01;31:*.taz=01;31:*.lzh=01;31:*.zip=01;31:*.z=01;31:*.Z=01;31:*.gz=01;31:*.bz2=01;31:*.bz=01;31:*.tz=01;31:*.rpm=01;31:*.cpio=01;31:*.jpg=01;35:*.gif=01;35:*.bmp=01;35:*.xbm=01;35:*.xpm=01;35:*.png=01;35:*.tif=01;35:
USER => root
MACHTYPE => i386-redhat-linux-gnu
TEST_PHP_SRCDIR => /usr/src/redhat/BUILD/php-4.3.2RC4/php-4.3.2RC4
LM_LICENSE_FILE => /opt/sybase-12.5/SYSAM/licenses/license.dat:
MAIL => /var/spool/mail/root
INPUTRC => /etc/inputrc
BASH_ENV => /root/.bashrc
PATH_TRANSLATED =>
SYBASE_OCS => OCS
LANG => en_US
QUERY_STRING =>
CONTENT_LENGTH =>
JAVA_HOME => /usr/java/j2sdk1.4.0
MAKELEVEL => 1
SHLVL => 3
LOGNAME => root
REDIRECT_STATUS =>
_ => /usr/src/redhat/BUILD/php-4.3.2RC4/php-4.3.2RC4/sapi/cli/php
TEST_PHP_EXECUTABLE => /usr/src/redhat/BUILD/php-4.3.2RC4/php-4.3.2RC4/sapi/cli/php
SHELL => /bin/sh
USERNAME => root
HOSTTYPE => i386
HISTSIZE => 1000
OSTYPE => linux-gnu
TERM => vt100
HOME => /root
PATH =>
/opt/sybase-12.5/ASE/bin:/opt/sybase-12.5/OCS/bin:/opt/sybase-12.5/SYSAM/bin:/usr/kerberos/sbin:/usr/kerberos/bin:/usr/local/sbin:/usr/local/bin:/sbin:/bin:/usr/sbin:/usr/bin:/usr/X11R6/bin:/usr/java/j2sdk1.4.0/bin:/usr/java/ant/bin:/root/bin
SSH_TTY => /dev/pts/2
CONTENT_TYPE =>
PHP Variables
Variable => Value
PHP_SELF =>
_SERVER["PWD"] => /usr/src/redhat/BUILD/php-4.3.2RC4/php-4.3.2RC4
_SERVER["MAKEFLAGS"] =>
_SERVER["SCRIPT_FILENAME"] =>
_SERVER["PAGER"] => /usr/bin/less -is
_SERVER["MFLAGS"] =>
_SERVER["HOSTNAME"] => cherokee.venere.it
_SERVER["LD_LIBRARY_PATH"] =>
/opt/sybase-12.5/ASE/lib:/opt/sybase-12.5/FTS/lib:/opt/sybase-12.5/OCS/lib:/opt/sybase-12.5/SQLRemote/lib:
_SERVER["SYBASE_FTS"] => FTS
_SERVER["SYBASE_SYSAM"] => SYSAM
_SERVER["LESSOPEN"] => |/usr/bin/lesspipe.sh %s
_SERVER["CC"] => gcc
_SERVER["SYBASE_ASE"] => ASE
_SERVER["SYBASE"] => /opt/sybase-12.5
_SERVER["REQUEST_METHOD"] =>
_SERVER["LS_COLORS"] =>
no=00:fi=00:di=01;34:ln=01;36:pi=40;33:so=01;35:bd=40;33;01:cd=40;33;01:or=01;05;37;41:mi=01;05;37;41:ex=01;32:*.cmd=01;32:*.exe=01;32:*.com=01;32:*.btm=01;32:*.bat=01;32:*.sh=01;32:*.csh=01;32:*.tar=01;31:*.tgz=01;31:*.arj=01;31:*.taz=01;31:*.lzh=01;31:*.zip=01;31:*.z=01;31:*.Z=01;31:*.gz=01;31:*.bz2=01;31:*.bz=01;31:*.tz=01;31:*.rpm=01;31:*.cpio=01;31:*.jpg=01;35:*.gif=01;35:*.bmp=01;35:*.xbm=01;35:*.xpm=01;35:*.png=01;35:*.tif=01;35:
_SERVER["USER"] => root
_SERVER["MACHTYPE"] => i386-redhat-linux-gnu
_SERVER["TEST_PHP_SRCDIR"] => /usr/src/redhat/BUILD/php-4.3.2RC4/php-4.3.2RC4
_SERVER["LM_LICENSE_FILE"] => /opt/sybase-12.5/SYSAM/licenses/license.dat:
_SERVER["MAIL"] => /var/spool/mail/root
_SERVER["INPUTRC"] => /etc/inputrc
_SERVER["BASH_ENV"] => /root/.bashrc
_SERVER["PATH_TRANSLATED"] =>
_SERVER["SYBASE_OCS"] => OCS
_SERVER["LANG"] => en_US
_SERVER["QUERY_STRING"] =>
_SERVER["CONTENT_LENGTH"] =>
_SERVER["JAVA_HOME"] => /usr/java/j2sdk1.4.0
_SERVER["MAKELEVEL"] => 1
_SERVER["SHLVL"] => 3
_SERVER["LOGNAME"] => root
_SERVER["REDIRECT_STATUS"] =>
_SERVER["_"] => /usr/src/redhat/BUILD/php-4.3.2RC4/php-4.3.2RC4/sapi/cli/php
_SERVER["TEST_PHP_EXECUTABLE"] =>
/usr/src/redhat/BUILD/php-4.3.2RC4/php-4.3.2RC4/sapi/cli/php
_SERVER["SHELL"] => /bin/sh
_SERVER["USERNAME"] => root
_SERVER["HOSTTYPE"] => i386
_SERVER["HISTSIZE"] => 1000
_SERVER["OSTYPE"] => linux-gnu
_SERVER["TERM"] => vt100
_SERVER["HOME"] => /root
_SERVER["PATH"] =>
/opt/sybase-12.5/ASE/bin:/opt/sybase-12.5/OCS/bin:/opt/sybase-12.5/SYSAM/bin:/usr/kerberos/sbin:/usr/kerberos/bin:/usr/local/sbin:/usr/local/bin:/sbin:/bin:/usr/sbin:/usr/bin:/usr/X11R6/bin:/usr/java/j2sdk1.4.0/bin:/usr/java/ant/bin:/root/bin
_SERVER["SSH_TTY"] => /dev/pts/2
_SERVER["CONTENT_TYPE"] =>
_SERVER["PHP_SELF"] =>
_SERVER["SCRIPT_NAME"] =>
_SERVER["DOCUMENT_ROOT"] =>
_SERVER["argv"] => Array
(
)
_SERVER["argc"] => 0
PHP License
This program is free software; you can redistribute it and/or modify
it under the terms of the PHP License as published by the PHP Group
and included in the distribution in the file: LICENSE
This program is distributed in the hope that it will be useful,
but WITHOUT ANY WARRANTY; without even the implied warranty of
MERCHANTABILITY or FITNESS FOR A PARTICULAR PURPOSE.
If you did not receive a copy of the PHP license, or have any
questions about PHP licensing, please contact license@php.net.