Test results for 4.3.2RC4 [failed]

From: Date: Sat, 24 May 2003 02:26:54 +0000
Subject: Test results for 4.3.2RC4 [failed]
Groups: php.qa 
Request: Send a blank email to php-qa+get-12993@lists.php.net to get a copy of this message
===================================================================== FAILED TEST SUMMARY --------------------------------------------------------------------- session object serialization [ext/session/tests/001.phpt] session object deserialization [ext/session/tests/003.phpt] session_set_save_handler test [ext/session/tests/004.phpt] custom save handler, multiple session_start()s, complex data structure test. [ext/session/tests/005.phpt] correct instantiation of references between variables in sessions [ext/session/tests/006.phpt] bug compatibility: unset($c) with enabled register_globals [ext/session/tests/007.phpt] bug compatibility: global is used albeit register_globals=0 [ext/session/tests/008-php4.2.3.phpt] unset($_SESSION["name"]); should work with register_globals=off [ext/session/tests/009.phpt] session_decode(); should not segfault [ext/session/tests/011.phpt] registering $_SESSION should not segfault [ext/session/tests/012.phpt] redefining SID should not cause warnings [ext/session/tests/013.phpt] a script should not be able to modify session.use_trans_sid [ext/session/tests/014.phpt] use_trans_sid should not affect SID [ext/session/tests/015.phpt] rewriter correctly handles attribute names which contain dashes [ext/session/tests/018.phpt] serializing references test case using globals [ext/session/tests/019.phpt] rewriter uses arg_seperator.output for modifying URLs [ext/session/tests/020.phpt] rewriter handles form and fieldset tags correctly [ext/session/tests/021.phpt] ===================================================================== ===================================================================== TEST RESULT SUMMARY --------------------------------------------------------------------- Exts skipped : 76 Exts tested : 12 --------------------------------------------------------------------- Number of tests : 476 Tests skipped : 221 (46.4%) Tests failed : 17 ( 3.6%) Tests passed : 238 (50.0%) --------------------------------------------------------------------- Time taken : 23 seconds ===================================================================== ================================================================================ /data/src/php-4.3.2RC4/ext/session/tests/001.phpt ================================================================================ ---- EXPECTED OUTPUT baz|O:3:"foo":2:{s:3:"bar";s:2:"ok";s:3:"yes";s:4:"done";}arr|a:1:{i:3;O:3:"foo":2:{s:3:"bar";s:2:"ok";s:3:"yes";s:4:"done";}} ---- ACTUAL OUTPUT ---- FAILED ================================================================================ 001- baz|O:3:"foo":2:{s:3:"bar";s:2:"ok";s:3:"yes";s:4:"done";}arr|a:1:{i:3;O:3:"foo":2:{s:3:"bar";s:2:"ok";s:3:"yes";s:4:"done";}} 001+ ================================================================================ ================================================================================ /data/src/php-4.3.2RC4/ext/session/tests/003.phpt ================================================================================ ---- EXPECTED OUTPUT object(foo)(2) { ["bar"]=> string(2) "ok" ["yes"]=> int(2) } array(1) { [3]=> &object(foo)(2) { ["bar"]=> string(2) "ok" ["yes"]=> int(2) } } ---- ACTUAL OUTPUT ---- FAILED ================================================================================ 001- object(foo)(2) { 001+ 002- ["bar"]=> 003- string(2) "ok" 004- ["yes"]=> 005- int(2) 006- } 007- array(1) { 008- [3]=> 009- &object(foo)(2) { 010- ["bar"]=> 011- string(2) "ok" 012- ["yes"]=> 013- int(2) 014- } 015- } ================================================================================ ================================================================================ /data/src/php-4.3.2RC4/ext/session/tests/004.phpt ================================================================================ ---- EXPECTED OUTPUT OPEN: PHPSESSID READ: abtest object(foo)(2) { ["bar"]=> string(2) "ok" ["yes"]=> int(2) } array(1) { [3]=> &object(foo)(2) { ["bar"]=> string(2) "ok" ["yes"]=> int(2) } } WRITE: abtest, baz|O:3:"foo":2:{s:3:"bar";s:2:"ok";s:3:"yes";i:2;}arr|a:1:{i:3;O:3:"foo":2:{s:3:"bar";s:2:"ok";s:3:"yes";i:2;}} OPEN: PHPSESSID READ: abtest object(foo)(2) { ["bar"]=> string(2) "ok" ["yes"]=> int(2) } array(1) { [3]=> object(foo)(2) { ["bar"]=> string(2) "ok" ["yes"]=> int(2) } } DESTROY: abtest ---- ACTUAL OUTPUT Fatal error: Call to a member function on a non-object in /data/src/php-4.3.2RC4/ext/session/tests/004.php on line 48 ---- FAILED ================================================================================ 001- OPEN: PHPSESSID 001+ Fatal error: Call to a member function on a non-object in /data/src/php-4.3.2RC4/ext/session/tests/004.php on line 48 002- READ: abtest 003- object(foo)(2) { 004- ["bar"]=> 005- string(2) "ok" 006- ["yes"]=> 007- int(2) 008- } 009- array(1) { 010- [3]=> 011- &object(foo)(2) { 012- ["bar"]=> 013- string(2) "ok" 014- ["yes"]=> 015- int(2) 016- } 017- } 018- WRITE: abtest, baz|O:3:"foo":2:{s:3:"bar";s:2:"ok";s:3:"yes";i:2;}arr|a:1:{i:3;O:3:"foo":2:{s:3:"bar";s:2:"ok";s:3:"yes";i:2;}} 019- OPEN: PHPSESSID 020- READ: abtest 021- object(foo)(2) { 022- ["bar"]=> 023- string(2) "ok" 024- ["yes"]=> 025- int(2) 026- } 027- array(1) { 028- [3]=> 029- object(foo)(2) { 030- ["bar"]=> 031- string(2) "ok" 032- ["yes"]=> 033- int(2) 034- } 035- } 036- DESTROY: abtest ================================================================================ ================================================================================ /data/src/php-4.3.2RC4/ext/session/tests/005.phpt ================================================================================ ---- EXPECTED OUTPUT OPEN: PHPSESSID READ: abtest object(foo)(2) { ["bar"]=> string(2) "ok" ["yes"]=> int(2) } array(1) { [3]=> &object(foo)(2) { ["bar"]=> string(2) "ok" ["yes"]=> int(2) } } WRITE: abtest, baz|O:3:"foo":2:{s:3:"bar";s:2:"ok";s:3:"yes";i:2;}arr|a:1:{i:3;O:3:"foo":2:{s:3:"bar";s:2:"ok";s:3:"yes";i:2;}} CLOSE OPEN: PHPSESSID READ: abtest object(foo)(2) { ["bar"]=> string(2) "ok" ["yes"]=> int(3) } array(1) { [3]=> &object(foo)(2) { ["bar"]=> string(2) "ok" ["yes"]=> int(3) } } int(123) WRITE: abtest, baz|O:3:"foo":2:{s:3:"bar";s:2:"ok";s:3:"yes";i:3;}arr|a:1:{i:3;O:3:"foo":2:{s:3:"bar";s:2:"ok";s:3:"yes";i:3;}}c|i:123; CLOSE OPEN: PHPSESSID READ: abtest object(foo)(2) { ["bar"]=> string(2) "ok" ["yes"]=> int(3) } array(1) { [3]=> object(foo)(2) { ["bar"]=> string(2) "ok" ["yes"]=> int(3) } } int(123) DESTROY: abtest CLOSE ---- ACTUAL OUTPUT Fatal error: Call to a member function on a non-object in /data/src/php-4.3.2RC4/ext/session/tests/005.php on line 50 ---- FAILED ================================================================================ 001- OPEN: PHPSESSID 001+ Fatal error: Call to a member function on a non-object in /data/src/php-4.3.2RC4/ext/session/tests/005.php on line 50 002- READ: abtest 003- object(foo)(2) { 004- ["bar"]=> 005- string(2) "ok" 006- ["yes"]=> 007- int(2) 008- } 009- array(1) { 010- [3]=> 011- &object(foo)(2) { 012- ["bar"]=> 013- string(2) "ok" 014- ["yes"]=> 015- int(2) 016- } 017- } 018- WRITE: abtest, baz|O:3:"foo":2:{s:3:"bar";s:2:"ok";s:3:"yes";i:2;}arr|a:1:{i:3;O:3:"foo":2:{s:3:"bar";s:2:"ok";s:3:"yes";i:2;}} 019- CLOSE 020- OPEN: PHPSESSID 021- READ: abtest 022- object(foo)(2) { 023- ["bar"]=> 024- string(2) "ok" 025- ["yes"]=> 026- int(3) 027- } 028- array(1) { 029- [3]=> 030- &object(foo)(2) { 031- ["bar"]=> 032- string(2) "ok" 033- ["yes"]=> 034- int(3) 035- } 036- } 037- int(123) 038- WRITE: abtest, baz|O:3:"foo":2:{s:3:"bar";s:2:"ok";s:3:"yes";i:3;}arr|a:1:{i:3;O:3:"foo":2:{s:3:"bar";s:2:"ok";s:3:"yes";i:3;}}c|i:123; 039- CLOSE 040- OPEN: PHPSESSID 041- READ: abtest 042- object(foo)(2) { 043- ["bar"]=> 044- string(2) "ok" 045- ["yes"]=> 046- int(3) 047- } 048- array(1) { 049- [3]=> 050- object(foo)(2) { 051- ["bar"]=> 052- string(2) "ok" 053- ["yes"]=> 054- int(3) 055- } 056- } 057- int(123) 058- DESTROY: abtest 059- CLOSE ================================================================================ ================================================================================ /data/src/php-4.3.2RC4/ext/session/tests/006.phpt ================================================================================ ---- EXPECTED OUTPUT original values: object(a)(1) { ["test"]=> string(5) "hallo" } object(b)(1) { ["a"]=> &object(a)(1) { ["test"]=> string(5) "hallo" } } values after session: object(a)(1) { ["test"]=> string(5) "hallo" } object(b)(1) { ["a"]=> &object(a)(1) { ["test"]=> string(5) "hallo" } } ---- ACTUAL OUTPUT original values: object(a)(1) { ["test"]=> string(5) "hallo" } object(b)(1) { ["a"]=> &object(a)(1) { ["test"]=> string(5) "hallo" } } ---- FAILED ================================================================================ 013- values after session: 014- object(a)(1) { 015- ["test"]=> 016- string(5) "hallo" 017- } 018- object(b)(1) { 019- ["a"]=> 020- &object(a)(1) { 021- ["test"]=> 022- string(5) "hallo" 023- } 024- } ================================================================================ ================================================================================ /data/src/php-4.3.2RC4/ext/session/tests/007.phpt ================================================================================ ---- EXPECTED OUTPUT float(3.14) array(1) { ["c"]=> &float(3.14) } float(3.14) array(1) { ["c"]=> &float(3.14) } ---- ACTUAL OUTPUT Warning: session_destroy(): Trying to destroy uninitialized session in /data/src/php-4.3.2RC4/ext/session/tests/007.php on line 8 ---- FAILED ================================================================================ 001- float(3.14) 001+ Warning: session_destroy(): Trying to destroy uninitialized session in /data/src/php-4.3.2RC4/ext/session/tests/007.php on line 8 002- array(1) { 003- ["c"]=> 004- &float(3.14) 005- } 006- float(3.14) 007- array(1) { 008- ["c"]=> 009- &float(3.14) 010- } ================================================================================ ================================================================================ /data/src/php-4.3.2RC4/ext/session/tests/008-php4.2.3.phpt ================================================================================ ---- EXPECTED OUTPUT NULL Your script possibly relies on a session side-effect which existed until PHP 4.2.3. Please be advised that the session extension does not consider global variables as a source of data, unless register_globals is enabled. You can disable this functionality and this warning by setting session.bug_compat_42 or session.bug_compat_warn to off, respectively. array(1) { ["c"]=> float(3.14) } NULL array(1) { ["c"]=> float(3.14) } ---- ACTUAL OUTPUT Warning: session_destroy(): Trying to destroy uninitialized session in /data/src/php-4.3.2RC4/ext/session/tests/008-php4.2.3.php on line 6 ---- FAILED ================================================================================ 001- NULL 001+ Warning: session_destroy(): Trying to destroy uninitialized session in /data/src/php-4.3.2RC4/ext/session/tests/008-php4.2.3.php on line 6 002- Your script possibly relies on a session side-effect which existed until PHP 4.2.3. Please be advised that the session extension does not consider global variables as a source of data, unless register_globals is enabled. You can disable this functionality and this warning by setting session.bug_compat_42 or session.bug_compat_warn to off, respectively. 003- array(1) { 004- ["c"]=> 005- float(3.14) 006- } 007- NULL 008- array(1) { 009- ["c"]=> 010- float(3.14) 011- } ================================================================================ ================================================================================ /data/src/php-4.3.2RC4/ext/session/tests/009.phpt ================================================================================ ---- EXPECTED OUTPUT array(0) { } array(1) { ["name"]=> string(3) "foo" } array(1) { ["name"]=> string(3) "foo" } array(0) { } array(0) { } ---- ACTUAL OUTPUT Warning: session_destroy(): Trying to destroy uninitialized session in /data/src/php-4.3.2RC4/ext/session/tests/009.php on line 8 Notice: Undefined variable: HTTP_SESSION_VARS in /data/src/php-4.3.2RC4/ext/session/tests/009.php on line 13 NULL array(1) { ["name"]=> string(3) "foo" } Fatal error: session_start(): No storage module chosen - failed to initialize session. in /data/src/php-4.3.2RC4/ext/session/tests/009.php on line 19 ---- FAILED ================================================================================ 001- array(0) { 001+ Warning: session_destroy(): Trying to destroy uninitialized session in /data/src/php-4.3.2RC4/ext/session/tests/009.php on line 8 002- } 002+ 003- array(1) { 003+ Notice: Undefined variable: HTTP_SESSION_VARS in /data/src/php-4.3.2RC4/ext/session/tests/009.php on line 13 004- ["name"]=> 004+ NULL 005- string(3) "foo" 005+ array(1) { 006- } 006+ ["name"]=> 007- array(1) { 007+ string(3) "foo" 008- ["name"]=> 008+ } 009- string(3) "foo" 009+ 010- } 010+ Fatal error: session_start(): No storage module chosen - failed to initialize session. in /data/src/php-4.3.2RC4/ext/session/tests/009.php on line 19 011- array(0) { 012- } 013- array(0) { 014- } ================================================================================ ================================================================================ /data/src/php-4.3.2RC4/ext/session/tests/011.phpt ================================================================================ ---- EXPECTED OUTPUT I live ---- ACTUAL OUTPUT ---- FAILED ================================================================================ 001- I live 001+ ================================================================================ ================================================================================ /data/src/php-4.3.2RC4/ext/session/tests/012.phpt ================================================================================ ---- EXPECTED OUTPUT I live ---- ACTUAL OUTPUT ---- FAILED ================================================================================ 001- I live 001+ ================================================================================ ================================================================================ /data/src/php-4.3.2RC4/ext/session/tests/013.phpt ================================================================================ ---- EXPECTED OUTPUT I live ---- ACTUAL OUTPUT Warning: session_destroy(): Trying to destroy uninitialized session in /data/src/php-4.3.2RC4/ext/session/tests/013.php on line 6 Warning: session_destroy(): Trying to destroy uninitialized session in /data/src/php-4.3.2RC4/ext/session/tests/013.php on line 9 I live ---- FAILED ================================================================================ 001- I live 001+ Warning: session_destroy(): Trying to destroy uninitialized session in /data/src/php-4.3.2RC4/ext/session/tests/013.php on line 6 002+ 003+ Warning: session_destroy(): Trying to destroy uninitialized session in /data/src/php-4.3.2RC4/ext/session/tests/013.php on line 9 004+ I live ================================================================================ ================================================================================ /data/src/php-4.3.2RC4/ext/session/tests/014.phpt ================================================================================ ---- EXPECTED OUTPUT <a href="/link?PHPSESSID=abtest"> <a href="/link?PHPSESSID=abtest"> <a href="/link?PHPSESSID=abtest"> ---- ACTUAL OUTPUT <a href="/link"> <a href="/link"> <a href="/link"> Warning: session_destroy(): Trying to destroy uninitialized session in /data/src/php-4.3.2RC4/ext/session/tests/014.php on line 18 ---- FAILED ================================================================================ 001- <a href="/link?PHPSESSID=abtest"> 001+ <a href="/link"> 002- <a href="/link?PHPSESSID=abtest"> 002+ <a href="/link"> 003- <a href="/link?PHPSESSID=abtest"> 003+ <a href="/link"> 004+ 005+ Warning: session_destroy(): Trying to destroy uninitialized session in /data/src/php-4.3.2RC4/ext/session/tests/014.php on line 18 ================================================================================ ================================================================================ /data/src/php-4.3.2RC4/ext/session/tests/015.phpt ================================================================================ ---- EXPECTED OUTPUT <a href="/link?PHPSESSID=abtest&PHPSESSID=abtest"> ---- ACTUAL OUTPUT <a href="/link? Notice: Use of undefined constant SID - assumed 'SID' in /data/src/php-4.3.2RC4/ext/session/tests/015.php on line 7 SID"> Warning: session_destroy(): Trying to destroy uninitialized session in /data/src/php-4.3.2RC4/ext/session/tests/015.php on line 9 ---- FAILED ================================================================================ 001- <a href="/link?PHPSESSID=abtest&PHPSESSID=abtest"> 001+ <a href="/link? 002+ Notice: Use of undefined constant SID - assumed 'SID' in /data/src/php-4.3.2RC4/ext/session/tests/015.php on line 7 003+ SID"> 004+ 005+ Warning: session_destroy(): Trying to destroy uninitialized session in /data/src/php-4.3.2RC4/ext/session/tests/015.php on line 9 ================================================================================ ================================================================================ /data/src/php-4.3.2RC4/ext/session/tests/018.phpt ================================================================================ ---- EXPECTED OUTPUT <form accept-charset="ISO-8859-15, ISO-8859-1" action=url.php><input type="hidden" name="PHPSESSID" value="abtest" /> ---- ACTUAL OUTPUT <form accept-charset="ISO-8859-15, ISO-8859-1" action=url.php> Warning: session_destroy(): Trying to destroy uninitialized session in /data/src/php-4.3.2RC4/ext/session/tests/018.php on line 10 ---- FAILED ================================================================================ 001- <form accept-charset="ISO-8859-15, ISO-8859-1" action=url.php><input type="hidden" name="PHPSESSID" value="abtest" /> 001+ <form accept-charset="ISO-8859-15, ISO-8859-1" action=url.php> 002+ 003+ Warning: session_destroy(): Trying to destroy uninitialized session in /data/src/php-4.3.2RC4/ext/session/tests/018.php on line 10 ================================================================================ ================================================================================ /data/src/php-4.3.2RC4/ext/session/tests/019.phpt ================================================================================ ---- EXPECTED OUTPUT array(2) { ["o1"]=> &object(tfoo)(1) { ["c"]=> int(42) } ["o2"]=> &object(tfoo)(1) { ["c"]=> int(42) } } array(2) { ["o1"]=> &object(tfoo)(1) { ["c"]=> int(44) } ["o2"]=> &object(tfoo)(1) { ["c"]=> int(44) } } ---- ACTUAL OUTPUT ---- FAILED ================================================================================ 001- array(2) { 001+ 002- ["o1"]=> 003- &object(tfoo)(1) { 004- ["c"]=> 005- int(42) 006- } 007- ["o2"]=> 008- &object(tfoo)(1) { 009- ["c"]=> 010- int(42) 011- } 012- } 013- array(2) { 014- ["o1"]=> 015- &object(tfoo)(1) { 016- ["c"]=> 017- int(44) 018- } 019- ["o2"]=> 020- &object(tfoo)(1) { 021- ["c"]=> 022- int(44) 023- } 024- } ================================================================================ ================================================================================ /data/src/php-4.3.2RC4/ext/session/tests/020.phpt ================================================================================ ---- EXPECTED OUTPUT <a href="link.php?a=b&amp;PHPSESSID=abtest"> ---- ACTUAL OUTPUT <a href="link.php?a=b"> Warning: session_destroy(): Trying to destroy uninitialized session in /data/src/php-4.3.2RC4/ext/session/tests/020.php on line 10 ---- FAILED ================================================================================ 001- <a href="link.php?a=b&amp;PHPSESSID=abtest"> 001+ <a href="link.php?a=b"> 002+ 003+ Warning: session_destroy(): Trying to destroy uninitialized session in /data/src/php-4.3.2RC4/ext/session/tests/020.php on line 10 ================================================================================ ================================================================================ /data/src/php-4.3.2RC4/ext/session/tests/021.phpt ================================================================================ ---- EXPECTED OUTPUT <form><input type="hidden" name="PHPSESSID" value="abtest" /> <fieldset><input type="hidden" name="PHPSESSID" value="abtest" /> <form><input type="hidden" name="PHPSESSID" value="abtest" /> <fieldset> <form><input type="hidden" name="PHPSESSID" value="abtest" /> <fieldset> <form> <fieldset><input type="hidden" name="PHPSESSID" value="abtest" /> ---- ACTUAL OUTPUT <form> <fieldset> Notice: ob_flush(): failed to flush buffer. No buffer to flush. in /data/src/php-4.3.2RC4/ext/session/tests/021.php on line 12 <form> <fieldset> Notice: ob_flush(): failed to flush buffer. No buffer to flush. in /data/src/php-4.3.2RC4/ext/session/tests/021.php on line 21 <form> <fieldset> Notice: ob_flush(): failed to flush buffer. No buffer to flush. in /data/src/php-4.3.2RC4/ext/session/tests/021.php on line 30 <form> <fieldset> Warning: session_destroy(): Trying to destroy uninitialized session in /data/src/php-4.3.2RC4/ext/session/tests/021.php on line 39 ---- FAILED ================================================================================ 001- <form><input type="hidden" name="PHPSESSID" value="abtest" /> 001+ <form> 002- <fieldset><input type="hidden" name="PHPSESSID" value="abtest" /> 002+ <fieldset> 003- <form><input type="hidden" name="PHPSESSID" value="abtest" /> 003+ 004- <fieldset> 004+ Notice: ob_flush(): failed to flush buffer. No buffer to flush. in /data/src/php-4.3.2RC4/ext/session/tests/021.php on line 12 005- <form><input type="hidden" name="PHPSESSID" value="abtest" /> 005+ <form> 007- <form> 007+ 008- <fieldset><input type="hidden" name="PHPSESSID" value="abtest" /> 008+ Notice: ob_flush(): failed to flush buffer. No buffer to flush. in /data/src/php-4.3.2RC4/ext/session/tests/021.php on line 21 009+ <form> 010+ <fieldset> 011+ 012+ Notice: ob_flush(): failed to flush buffer. No buffer to flush. in /data/src/php-4.3.2RC4/ext/session/tests/021.php on line 30 013+ <form> 014+ <fieldset> 015+ 016+ Warning: session_destroy(): Trying to destroy uninitialized session in /data/src/php-4.3.2RC4/ext/session/tests/021.php on line 39 ================================================================================ ================================================================================ BUILD ENVIRONMENT ================================================================================ OS: Linux Automake: automake (GNU automake) 1.6.3 Written by Tom Tromey <tromey@redhat.com>. Copyright 2002 Free Software Foundation, Inc. This is free software; see the source for copying conditions. There is NO warranty; not even for MERCHANTABILITY or FITNESS FOR A PARTICULAR PURPOSE. Autoconf: autoconf (GNU Autoconf) 2.53 Written by David J. MacKenzie and Akim Demaille. Copyright 2002 Free Software Foundation, Inc. This is free software; see the source for copying conditions. There is NO warranty; not even for MERCHANTABILITY or FITNESS FOR A PARTICULAR PURPOSE. Libtool: ltmain.sh (GNU libtool) 1.4.3 (1.922.2.110 2002/10/23 01:39:54) Compiler: Reading specs from /usr/lib/gcc-lib/i386-redhat-linux/3.2/specs Configured with: ../configure --prefix=/usr --mandir=/usr/share/man --infodir=/usr/share/info --enable-shared --enable-threads=posix --disable-checking --host=i386-redhat-linux --with-system-zlib --enable-__cxa_atexit Thread model: posix gcc version 3.2 20020903 (Red Hat Linux 8.0 3.2-7) Bison: bison (GNU Bison) 1.35 Copyright 1984, 1986, 1989, 1992, 2000, 2001, 2002 Free Software Foundation, Inc. This is free software; see the source for copying conditions. There is NO warranty; not even for MERCHANTABILITY or FITNESS FOR A PARTICULAR PURPOSE. Libraries: libcrypt.so.1 => /lib/libcrypt.so.1 (0x40019000) libpng12.so.0 => /usr/lib/libpng12.so.0 (0x40047000) libz.so.1 => /usr/lib/libz.so.1 (0x4006a000) libjpeg.so.62 => /usr/lib/libjpeg.so.62 (0x40078000) libresolv.so.2 => /lib/libresolv.so.2 (0x40096000) libm.so.6 => /lib/libm.so.6 (0x400a7000) libdl.so.2 => /lib/libdl.so.2 (0x400c8000) libnsl.so.1 => /lib/libnsl.so.1 (0x400cc000) libc.so.6 => /lib/libc.so.6 (0x400e0000) /lib/ld-linux.so.2 => /lib/ld-linux.so.2 (0x40000000) User's E-mail: kyle at junglist dot org ================================================================================ PHPINFO ================================================================================ phpinfo() PHP Version => 4.3.2RC4 System => Linux magnus.pbnation.com 2.4.19 #1 SMP Thu Nov 21 13:49:01 EST 2002 i686 Build Date => May 23 2003 22:06:58 Configure Command => './configure' '--with-apxs2=/home/httpd/apache/bin/apxs' '--enable-track-vars' '--enable-inline-optimization' '--with-jpeg-dir=/usr/lib/' '--with-zlib-dir=/usr/lib/' '--with-png-dir=/usr/lib/' '--disable-debug' '--with-gd' '--disable-mbstring' Server API => Command Line Interface Virtual Directory Support => disabled Configuration File (php.ini) Path => /usr/local/lib/php.ini PHP API => 20020918 PHP Extension => 20020429 Zend Extension => 20021010 Debug Build => no Thread Safety => disabled Registered PHP Streams => php, http, ftp, compress.zlib This program makes use of the Zend Scripting Language Engine: Zend Engine v1.3.0, Copyright (c) 1998-2003 Zend Technologies with Turck MMCache v2.3.12, Copyright (c) 2002-2003 TurckSoft, St. Petersburg, by Dmitry Stogov _______________________________________________________________________ Configuration PHP Core Directive => Local Value => Master Value allow_call_time_pass_reference => On => On allow_url_fopen => On => On always_populate_raw_post_data => Off => Off arg_separator.input => & => & arg_separator.output => & => & asp_tags => Off => Off auto_append_file => no value => no value auto_prepend_file => no value => no value browscap => no value => no value default_charset => no value => no value default_mimetype => text/html => text/html define_syslog_variables => Off => Off disable_classes => no value => no value disable_functions => no value => no value display_errors => On => On display_startup_errors => Off => Off doc_root => no value => no value docref_ext => no value => no value docref_root => no value => no value enable_dl => On => On error_append_string => no value => no value error_log => no value => no value error_prepend_string => no value => no value error_reporting => no value => no value expose_php => On => On extension_dir => /usr/local/lib/php/extensions/no-debug-non-zts-20020429 => /usr/local/lib/php/extensions/no-debug-non-zts-20020429 file_uploads => On => On gpc_order => GPC => GPC highlight.bg => #FFFFFF => #FFFFFF highlight.comment => #FF8000 => #FF8000 highlight.default => #0000BB => #0000BB highlight.html => #000000 => #000000 highlight.keyword => #007700 => #007700 highlight.string => #DD0000 => #DD0000 html_errors => Off => On ignore_repeated_errors => Off => Off ignore_repeated_source => Off => Off ignore_user_abort => Off => Off implicit_flush => On => Off include_path => .:/usr/local/lib/php => .:/usr/local/lib/php log_errors => Off => Off log_errors_max_len => 1024 => 1024 magic_quotes_gpc => Off => Off magic_quotes_runtime => Off => Off magic_quotes_sybase => Off => Off max_execution_time => 0 => 30 max_input_time => -1 => -1 open_basedir => no value => no value output_buffering => 0 => 0 output_handler => no value => no value post_max_size => 2M => 2M precision => 14 => 14 register_argc_argv => On => On register_globals => On => On report_memleaks => On => On safe_mode => Off => Off safe_mode_exec_dir => /usr/local/php/bin => /usr/local/php/bin safe_mode_gid => Off => Off safe_mode_include_dir => no value => no value sendmail_from => webmaster@pbnation.com => webmaster@pbnation.com sendmail_path => /var/qmail/bin/sendmail -t => /var/qmail/bin/sendmail -t serialize_precision => 100 => 100 short_open_tag => On => On SMTP => localhost => localhost smtp_port => 25 => 25 sql.safe_mode => Off => Off track_errors => Off => Off unserialize_callback_func => no value => no value upload_max_filesize => 2M => 2M upload_tmp_dir => no value => no value user_dir => no value => no value variables_order => no value => no value xmlrpc_error_number => 0 => 0 xmlrpc_errors => Off => Off y2k_compliance => On => On Turck MMCache MMCache support => enabled Caching Enabled => false Optimizer Enabled => false Directive => Local Value => Master Value mmcache.cache_dir => /home/httpd/apache/cache => /home/httpd/apache/cache mmcache.check_mtime => 1 => 1 mmcache.debug => 0 => 0 mmcache.enable => 1 => 1 mmcache.filter => no value => no value mmcache.optimizer => 1 => 1 mmcache.shm_size => 16 => 16 ctype ctype functions => enabled gd GD Support => enabled GD Version => bundled (2.0.12 compatible) GIF Read Support => enabled JPG Support => enabled PNG Support => enabled WBMP Support => enabled XBM Support => enabled mysql MySQL Support => enabled Active Persistent Links => 0 Active Links => 0 Client API version => 3.23.49 MYSQL_MODULE_TYPE => builtin MYSQL_SOCKET => /tmp/mysql.sock MYSQL_INCLUDE => MYSQL_LIBS => Directive => Local Value => Master Value mysql.allow_persistent => On => On mysql.connect_timeout => -1 => -1 mysql.default_host => no value => no value mysql.default_password => no value => no value mysql.default_port => no value => no value mysql.default_socket => no value => no value mysql.default_user => no value => no value mysql.max_links => Unlimited => Unlimited mysql.max_persistent => Unlimited => Unlimited mysql.trace_mode => Off => Off overload User-Space Object Overloading Support => enabled pcre PCRE (Perl Compatible Regular Expressions) Support => enabled PCRE Library Version => 3.92 11-Sep-2002 posix Revision => $Revision: 1.51.2.2 $ session Session Support => enabled Registered save handlers => files user Directive => Local Value => Master Value session.auto_start => Off => Off session.bug_compat_42 => On => On session.bug_compat_warn => On => On session.cache_expire => 180 => 180 session.cache_limiter => nocache => nocache session.cookie_domain => no value => no value session.cookie_lifetime => 0 => 0 session.cookie_path => / => / session.cookie_secure => Off => Off session.entropy_file => no value => no value session.entropy_length => 0 => 0 session.gc_divisor => 100 => 100 session.gc_maxlifetime => 1440 => 1440 session.gc_probability => 1 => 1 session.name => PHPSESSID => PHPSESSID session.referer_check => no value => no value session.save_handler => mm => mm session.save_path => /tmp => /tmp session.serialize_handler => php => php session.use_cookies => On => On session.use_only_cookies => Off => Off session.use_trans_sid => Off => Off standard Regex Library => Bundled library enabled Dynamic Library Support => enabled Path to sendmail => /var/qmail/bin/sendmail -t Directive => Local Value => Master Value assert.active => 1 => 1 assert.bail => 0 => 0 assert.callback => no value => no value assert.quiet_eval => 0 => 0 assert.warning => 1 => 1 auto_detect_line_endings => 0 => 0 default_socket_timeout => 60 => 60 safe_mode_allowed_env_vars => PHP_ => PHP_ safe_mode_protected_env_vars => LD_LIBRARY_PATH => LD_LIBRARY_PATH url_rewriter.tags => a=href,area=href,frame=src,form=,fieldset= => a=href,area=href,frame=src,form=,fieldset= user_agent => no value => no value tokenizer Tokenizer Support => enabled xml XML Support => active XML Namespace Support => active EXPAT Version => 1.95.2 zlib ZLib Support => enabled Compiled Version => 1.1.4 Linked Version => 1.1.4 Directive => Local Value => Master Value zlib.output_compression => Off => Off zlib.output_compression_level => -1 => -1 zlib.output_handler => no value => no value Additional Modules Module Name Environment Variable => Value HOSTNAME => magnus.pbnation.com TEST_PHP_SRCDIR => /data/src/php-4.3.2RC4 TERM => vt100 SHELL => /bin/sh HISTSIZE => 1000 MAKEFLAGS => SSH_CLIENT => 66.67.215.119 2082 22 CVSROOT => :pserver:anonymous@rhetoric.terahertz.net:/cvs/bitchx SSH_TTY => /dev/pts/0 USER => kyle LS_COLORS => no=00:fi=00:di=01;34:ln=01;36:pi=40;33:so=01;35:bd=40;33;01:cd=40;33;01:or=01;05;37;41:mi=01;05;37;41:ex=01;32:*.cmd=01;32:*.exe=01;32:*.com=01;32:*.btm=01;32:*.bat=01;32:*.sh=01;32:*.csh=01;32:*.tar=01;31:*.tgz=01;31:*.arj=01;31:*.taz=01;31:*.lzh=01;31:*.zip=01;31:*.z=01;31:*.Z=01;31:*.gz=01;31:*.bz2=01;31:*.bz=01;31:*.tz=01;31:*.rpm=01;31:*.cpio=01;31:*.jpg=01;35:*.gif=01;35:*.bmp=01;35:*.xbm=01;35:*.xpm=01;35:*.png=01;35:*.tif=01;35: SCRIPT_FILENAME => TERMCAP => SC|screen|VT 100/ANSI X3.64 virtual terminal:\ :DO=\E[%dB:LE=\E[%dD:RI=\E[%dC:UP=\E[%dA:bs:bt=\E[Z:\ :cd=\E[J:ce=\E[K:cl=\E[H\E[J:cm=\E[%i%d;%dH:ct=\E[3g:\ :do=^J:nd=\E[C:pt:rc=\E8:rs=\Ec:sc=\E7:st=\EH:up=\EM:\ :le=^H:bl=^G:cr=^M:it#8:ho=\E[H:nw=\EE:ta=^I:is=\E)0:\ :li#24:co#120:am:xn:xv:LP:sr=\EM:al=\E[L:AL=\E[%dL:\ :cs=\E[%i%d;%dr:dl=\E[M:DL=\E[%dM:dc=\E[P:DC=\E[%dP:\ :im=\E[4h:ei=\E[4l:mi:IC=\E[%d@:ks=\E[?1h\E=:\ :ke=\E[?1l\E>:vi=\E[?25l:ve=\E[34h\E[?25h:vs=\E[34l:\ :us=\E[4m:ue=\E[24m:so=\E[3m:se=\E[23m:mb=\E[5m:\ :md=\E[1m:mh=\E[2m:mr=\E[7m:me=\E[m:ms:\ :Co#8:pa#64:AF=\E[3%dm:AB=\E[4%dm:op=\E[39;49m:AX:\ :vb=\Eg:as=\E(0:ae=\E(B:\ :ac=\140\140aaffggjjkkllmmnnooppqqrrssttuuvvwwxxyyzz{{||}}~~..--++,,hhII00:\ :k0=\E[10~:k1=\EOP:k2=\EOQ:k3=\EOR:k4=\EOS:k5=\E[15~:\ :k6=\E[17~:k7=\E[18~:k8=\E[19~:k9=\E[20~:k;=\E[21~:\ :F1=\E[23~:F2=\E[24~:F3=\E[25~:F4=\E[26~:F5=\E[28~:\ :F6=\E[29~:F7=\E[31~:F8=\E[32~:F9=\E[33~:FA=\E[34~:\ :kb=^H:K2=\E[G:kB=\E[Z:kh=\E[1~:@1=\E[1~:kH=\E[4~:\ :@7=\E[4~:kN=\E[6~:kP=\E[5~:kI=\E[2~:kD=:ku=\EOA:\ :kd=\EOB:kr=\EOC:kl=\EOD: SSH_AUTH_SOCK => /tmp/ssh-XXx4iw0e/agent.21937 MAKELEVEL => 1 MFLAGS => PATH => /usr/bin:/bin:/usr/sbin:/sbin:/usr/local/bin:/usr/X11R6/bin:/home/kyle/bin:/var/qmail/bin MAIL => /var/spool/mail/kyle STY => 22078.pts-0.magnus _ => /data/src/php-4.3.2RC4/sapi/cli/php PWD => /data/src/php-4.3.2RC4 INPUTRC => /etc/inputrc LANG => en_US.UTF-8 TEST_PHP_EXECUTABLE => /data/src/php-4.3.2RC4/sapi/cli/php REDIRECT_STATUS => IRCNAME => sparkles, professional male model PATH_TRANSLATED => HOME => /root SHLVL => 5 IRCNICK => KrON CONTENT_LENGTH => LOGNAME => kyle QUERY_STRING => WINDOW => 2 SSH_CONNECTION => 66.67.215.119 2082 209.105.174.6 22 LESSOPEN => |/usr/bin/lesspipe.sh %s CONTENT_TYPE => CC => gcc REQUEST_METHOD => G_BROKEN_FILENAMES => 1 PHP Variables Variable => Value PHP_SELF => _SERVER["HOSTNAME"] => magnus.pbnation.com _SERVER["TEST_PHP_SRCDIR"] => /data/src/php-4.3.2RC4 _SERVER["TERM"] => vt100 _SERVER["SHELL"] => /bin/sh _SERVER["HISTSIZE"] => 1000 _SERVER["MAKEFLAGS"] => _SERVER["SSH_CLIENT"] => 66.67.215.119 2082 22 _SERVER["CVSROOT"] => :pserver:anonymous@rhetoric.terahertz.net:/cvs/bitchx _SERVER["SSH_TTY"] => /dev/pts/0 _SERVER["USER"] => kyle _SERVER["LS_COLORS"] => no=00:fi=00:di=01;34:ln=01;36:pi=40;33:so=01;35:bd=40;33;01:cd=40;33;01:or=01;05;37;41:mi=01;05;37;41:ex=01;32:*.cmd=01;32:*.exe=01;32:*.com=01;32:*.btm=01;32:*.bat=01;32:*.sh=01;32:*.csh=01;32:*.tar=01;31:*.tgz=01;31:*.arj=01;31:*.taz=01;31:*.lzh=01;31:*.zip=01;31:*.z=01;31:*.Z=01;31:*.gz=01;31:*.bz2=01;31:*.bz=01;31:*.tz=01;31:*.rpm=01;31:*.cpio=01;31:*.jpg=01;35:*.gif=01;35:*.bmp=01;35:*.xbm=01;35:*.xpm=01;35:*.png=01;35:*.tif=01;35: _SERVER["SCRIPT_FILENAME"] => _SERVER["TERMCAP"] => SC|screen|VT 100/ANSI X3.64 virtual terminal:\ :DO=\E[%dB:LE=\E[%dD:RI=\E[%dC:UP=\E[%dA:bs:bt=\E[Z:\ :cd=\E[J:ce=\E[K:cl=\E[H\E[J:cm=\E[%i%d;%dH:ct=\E[3g:\ :do=^J:nd=\E[C:pt:rc=\E8:rs=\Ec:sc=\E7:st=\EH:up=\EM:\ :le=^H:bl=^G:cr=^M:it#8:ho=\E[H:nw=\EE:ta=^I:is=\E)0:\ :li#24:co#120:am:xn:xv:LP:sr=\EM:al=\E[L:AL=\E[%dL:\ :cs=\E[%i%d;%dr:dl=\E[M:DL=\E[%dM:dc=\E[P:DC=\E[%dP:\ :im=\E[4h:ei=\E[4l:mi:IC=\E[%d@:ks=\E[?1h\E=:\ :ke=\E[?1l\E>:vi=\E[?25l:ve=\E[34h\E[?25h:vs=\E[34l:\ :us=\E[4m:ue=\E[24m:so=\E[3m:se=\E[23m:mb=\E[5m:\ :md=\E[1m:mh=\E[2m:mr=\E[7m:me=\E[m:ms:\ :Co#8:pa#64:AF=\E[3%dm:AB=\E[4%dm:op=\E[39;49m:AX:\ :vb=\Eg:as=\E(0:ae=\E(B:\ :ac=\140\140aaffggjjkkllmmnnooppqqrrssttuuvvwwxxyyzz{{||}}~~..--++,,hhII00:\ :k0=\E[10~:k1=\EOP:k2=\EOQ:k3=\EOR:k4=\EOS:k5=\E[15~:\ :k6=\E[17~:k7=\E[18~:k8=\E[19~:k9=\E[20~:k;=\E[21~:\ :F1=\E[23~:F2=\E[24~:F3=\E[25~:F4=\E[26~:F5=\E[28~:\ :F6=\E[29~:F7=\E[31~:F8=\E[32~:F9=\E[33~:FA=\E[34~:\ :kb=^H:K2=\E[G:kB=\E[Z:kh=\E[1~:@1=\E[1~:kH=\E[4~:\ :@7=\E[4~:kN=\E[6~:kP=\E[5~:kI=\E[2~:kD=:ku=\EOA:\ :kd=\EOB:kr=\EOC:kl=\EOD: _SERVER["SSH_AUTH_SOCK"] => /tmp/ssh-XXx4iw0e/agent.21937 _SERVER["MAKELEVEL"] => 1 _SERVER["MFLAGS"] => _SERVER["PATH"] => /usr/bin:/bin:/usr/sbin:/sbin:/usr/local/bin:/usr/X11R6/bin:/home/kyle/bin:/var/qmail/bin _SERVER["MAIL"] => /var/spool/mail/kyle _SERVER["STY"] => 22078.pts-0.magnus _SERVER["_"] => /data/src/php-4.3.2RC4/sapi/cli/php _SERVER["PWD"] => /data/src/php-4.3.2RC4 _SERVER["INPUTRC"] => /etc/inputrc _SERVER["LANG"] => en_US.UTF-8 _SERVER["TEST_PHP_EXECUTABLE"] => /data/src/php-4.3.2RC4/sapi/cli/php _SERVER["REDIRECT_STATUS"] => _SERVER["IRCNAME"] => sparkles, professional male model _SERVER["PATH_TRANSLATED"] => _SERVER["HOME"] => /root _SERVER["SHLVL"] => 5 _SERVER["IRCNICK"] => KrON _SERVER["CONTENT_LENGTH"] => _SERVER["LOGNAME"] => kyle _SERVER["QUERY_STRING"] => _SERVER["WINDOW"] => 2 _SERVER["SSH_CONNECTION"] => 66.67.215.119 2082 209.105.174.6 22 _SERVER["LESSOPEN"] => |/usr/bin/lesspipe.sh %s _SERVER["CONTENT_TYPE"] => _SERVER["CC"] => gcc _SERVER["REQUEST_METHOD"] => _SERVER["G_BROKEN_FILENAMES"] => 1 _SERVER["PHP_SELF"] => _SERVER["SCRIPT_NAME"] => _SERVER["DOCUMENT_ROOT"] => _SERVER["argv"] => Array ( ) _SERVER["argc"] => 0 _ENV["HOSTNAME"] => magnus.pbnation.com _ENV["TEST_PHP_SRCDIR"] => /data/src/php-4.3.2RC4 _ENV["TERM"] => vt100 _ENV["SHELL"] => /bin/sh _ENV["HISTSIZE"] => 1000 _ENV["MAKEFLAGS"] => _ENV["SSH_CLIENT"] => 66.67.215.119 2082 22 _ENV["CVSROOT"] => :pserver:anonymous@rhetoric.terahertz.net:/cvs/bitchx _ENV["SSH_TTY"] => /dev/pts/0 _ENV["USER"] => kyle _ENV["LS_COLORS"] => no=00:fi=00:di=01;34:ln=01;36:pi=40;33:so=01;35:bd=40;33;01:cd=40;33;01:or=01;05;37;41:mi=01;05;37;41:ex=01;32:*.cmd=01;32:*.exe=01;32:*.com=01;32:*.btm=01;32:*.bat=01;32:*.sh=01;32:*.csh=01;32:*.tar=01;31:*.tgz=01;31:*.arj=01;31:*.taz=01;31:*.lzh=01;31:*.zip=01;31:*.z=01;31:*.Z=01;31:*.gz=01;31:*.bz2=01;31:*.bz=01;31:*.tz=01;31:*.rpm=01;31:*.cpio=01;31:*.jpg=01;35:*.gif=01;35:*.bmp=01;35:*.xbm=01;35:*.xpm=01;35:*.png=01;35:*.tif=01;35: _ENV["SCRIPT_FILENAME"] => _ENV["TERMCAP"] => SC|screen|VT 100/ANSI X3.64 virtual terminal:\ :DO=\E[%dB:LE=\E[%dD:RI=\E[%dC:UP=\E[%dA:bs:bt=\E[Z:\ :cd=\E[J:ce=\E[K:cl=\E[H\E[J:cm=\E[%i%d;%dH:ct=\E[3g:\ :do=^J:nd=\E[C:pt:rc=\E8:rs=\Ec:sc=\E7:st=\EH:up=\EM:\ :le=^H:bl=^G:cr=^M:it#8:ho=\E[H:nw=\EE:ta=^I:is=\E)0:\ :li#24:co#120:am:xn:xv:LP:sr=\EM:al=\E[L:AL=\E[%dL:\ :cs=\E[%i%d;%dr:dl=\E[M:DL=\E[%dM:dc=\E[P:DC=\E[%dP:\ :im=\E[4h:ei=\E[4l:mi:IC=\E[%d@:ks=\E[?1h\E=:\ :ke=\E[?1l\E>:vi=\E[?25l:ve=\E[34h\E[?25h:vs=\E[34l:\ :us=\E[4m:ue=\E[24m:so=\E[3m:se=\E[23m:mb=\E[5m:\ :md=\E[1m:mh=\E[2m:mr=\E[7m:me=\E[m:ms:\ :Co#8:pa#64:AF=\E[3%dm:AB=\E[4%dm:op=\E[39;49m:AX:\ :vb=\Eg:as=\E(0:ae=\E(B:\ :ac=\140\140aaffggjjkkllmmnnooppqqrrssttuuvvwwxxyyzz{{||}}~~..--++,,hhII00:\ :k0=\E[10~:k1=\EOP:k2=\EOQ:k3=\EOR:k4=\EOS:k5=\E[15~:\ :k6=\E[17~:k7=\E[18~:k8=\E[19~:k9=\E[20~:k;=\E[21~:\ :F1=\E[23~:F2=\E[24~:F3=\E[25~:F4=\E[26~:F5=\E[28~:\ :F6=\E[29~:F7=\E[31~:F8=\E[32~:F9=\E[33~:FA=\E[34~:\ :kb=^H:K2=\E[G:kB=\E[Z:kh=\E[1~:@1=\E[1~:kH=\E[4~:\ :@7=\E[4~:kN=\E[6~:kP=\E[5~:kI=\E[2~:kD=:ku=\EOA:\ :kd=\EOB:kr=\EOC:kl=\EOD: _ENV["SSH_AUTH_SOCK"] => /tmp/ssh-XXx4iw0e/agent.21937 _ENV["MAKELEVEL"] => 1 _ENV["MFLAGS"] => _ENV["PATH"] => /usr/bin:/bin:/usr/sbin:/sbin:/usr/local/bin:/usr/X11R6/bin:/home/kyle/bin:/var/qmail/bin _ENV["MAIL"] => /var/spool/mail/kyle _ENV["STY"] => 22078.pts-0.magnus _ENV["_"] => /data/src/php-4.3.2RC4/sapi/cli/php _ENV["PWD"] => /data/src/php-4.3.2RC4 _ENV["INPUTRC"] => /etc/inputrc _ENV["LANG"] => en_US.UTF-8 _ENV["TEST_PHP_EXECUTABLE"] => /data/src/php-4.3.2RC4/sapi/cli/php _ENV["REDIRECT_STATUS"] => _ENV["IRCNAME"] => sparkles, professional male model _ENV["PATH_TRANSLATED"] => _ENV["HOME"] => /root _ENV["SHLVL"] => 5 _ENV["IRCNICK"] => KrON _ENV["CONTENT_LENGTH"] => _ENV["LOGNAME"] => kyle _ENV["QUERY_STRING"] => _ENV["WINDOW"] => 2 _ENV["SSH_CONNECTION"] => 66.67.215.119 2082 209.105.174.6 22 _ENV["LESSOPEN"] => |/usr/bin/lesspipe.sh %s _ENV["CONTENT_TYPE"] => _ENV["CC"] => gcc _ENV["REQUEST_METHOD"] => _ENV["G_BROKEN_FILENAMES"] => 1 PHP License This program is free software; you can redistribute it and/or modify it under the terms of the PHP License as published by the PHP Group and included in the distribution in the file: LICENSE This program is distributed in the hope that it will be useful, but WITHOUT ANY WARRANTY; without even the implied warranty of MERCHANTABILITY or FITNESS FOR A PARTICULAR PURPOSE. If you did not receive a copy of the PHP license, or have any questions about PHP licensing, please contact license@php.net.

« previous php.qa (#12993) next »