Test results for 5.0.0-dev [failed]
| From: | noreply@php.net | Date: | Sat, 24 May 2003 19:49:35 +0000 |
| Subject: | Test results for 5.0.0-dev [failed] | ||
| Groups: | php.qa | ||
| Request: | Send a blank email to php-qa+get-13012@lists.php.net to get a copy of this message | ||
=====================================================================
FAILED TEST SUMMARY
---------------------------------------------------------------------
Methods via variable name, bug #20120 [tests/classes/bug20120.phpt]
Bug #17115 (lambda functions produce segfault with static vars) [tests/lang/bug17115.phpt]
Bug #21800 (Segfault under interactive mode) [tests/lang/bug21800.phpt]
Bug #21849 (self::constant doesn't work as method's default parameter)
[tests/lang/bug21849.phpt]
Bug #22367 (weird zval allocation problem) [tests/lang/bug22367.phpt]
Bug #22592 (cascading assignments to strings with curly braces broken) [tests/lang/bug22592.phpt]
Bug #23624 (foreach leaves current array key as null) [tests/lang/bug23624.phpt]
session object deserialization [ext/session/tests/003.phpt]
session_set_save_handler test [ext/session/tests/004.phpt]
custom save handler, multiple session_start()s, complex data structure test.
[ext/session/tests/005.phpt]
correct instantiation of references between variables in sessions [ext/session/tests/006.phpt]
serializing references test case using globals [ext/session/tests/019.phpt]
rewriter uses arg_seperator.output for modifying URLs [ext/session/tests/020.phpt]
rewriter handles form and fieldset tags correctly [ext/session/tests/021.phpt]
aggregating everything [ext/standard/tests/aggregation/aggregate.phpt]
aggregating all methods [ext/standard/tests/aggregation/aggregate_methods.phpt]
aggregating methods specified in the list
[ext/standard/tests/aggregation/aggregate_methods_by_list.phpt]
aggregating methods matching regular expression
[ext/standard/tests/aggregation/aggregate_methods_by_regexp.phpt]
date_sunrise() and date_sunset() functions [ext/standard/tests/general_functions/sunfuncts.phpt]
XML parser test, function callbacks [ext/xml/tests/xml001.phpt]
XML parser test, object tuple callbacks [ext/xml/tests/xml002.phpt]
XML parser test, xml_set_object callbacks [ext/xml/tests/xml003.phpt]
Relative and absolute arg handling [ext/xslt/tests/bug20177.phpt]
Don't override xslt_set_base (bug #20518) [ext/xslt/tests/bug20518.phpt]
Various ways to provide xml and xslt arguments and params [ext/xslt/tests/xslt_process-001.phpt]
Crash xslt_process with reused handler (this test may take a while)
[ext/xslt/tests/xslt_process-002.phpt]
xslt_set_object function [ext/xslt/tests/xslt_set_object.phpt]
Set a non-existing scheme handler [ext/xslt/tests/xslt_set_scheme_handlers-001.phpt]
xslt_setopt function and public entities [ext/xslt/tests/xslt_setopt.phpt]
=====================================================================
=====================================================================
TEST RESULT SUMMARY
---------------------------------------------------------------------
Exts skipped : 66
Exts tested : 15
---------------------------------------------------------------------
Number of tests : 638
Tests skipped : 283 (44.4%)
Tests warned : 0 ( 0.0%)
Tests failed : 29 ( 4.5%)
Tests passed : 326 (51.1%)
---------------------------------------------------------------------
Time taken : 175 seconds
=====================================================================
=====================================================================
FAILED TEST SUMMARY
---------------------------------------------------------------------
Methods via variable name, bug #20120 [tests/classes/bug20120.phpt]
Bug #17115 (lambda functions produce segfault with static vars) [tests/lang/bug17115.phpt]
Bug #21800 (Segfault under interactive mode) [tests/lang/bug21800.phpt]
Bug #21849 (self::constant doesn't work as method's default parameter)
[tests/lang/bug21849.phpt]
Bug #22367 (weird zval allocation problem) [tests/lang/bug22367.phpt]
Bug #22592 (cascading assignments to strings with curly braces broken) [tests/lang/bug22592.phpt]
Bug #23624 (foreach leaves current array key as null) [tests/lang/bug23624.phpt]
session object deserialization [ext/session/tests/003.phpt]
session_set_save_handler test [ext/session/tests/004.phpt]
custom save handler, multiple session_start()s, complex data structure test.
[ext/session/tests/005.phpt]
correct instantiation of references between variables in sessions [ext/session/tests/006.phpt]
serializing references test case using globals [ext/session/tests/019.phpt]
rewriter uses arg_seperator.output for modifying URLs [ext/session/tests/020.phpt]
rewriter handles form and fieldset tags correctly [ext/session/tests/021.phpt]
aggregating everything [ext/standard/tests/aggregation/aggregate.phpt]
aggregating all methods [ext/standard/tests/aggregation/aggregate_methods.phpt]
aggregating methods specified in the list
[ext/standard/tests/aggregation/aggregate_methods_by_list.phpt]
aggregating methods matching regular expression
[ext/standard/tests/aggregation/aggregate_methods_by_regexp.phpt]
date_sunrise() and date_sunset() functions [ext/standard/tests/general_functions/sunfuncts.phpt]
XML parser test, function callbacks [ext/xml/tests/xml001.phpt]
XML parser test, object tuple callbacks [ext/xml/tests/xml002.phpt]
XML parser test, xml_set_object callbacks [ext/xml/tests/xml003.phpt]
Relative and absolute arg handling [ext/xslt/tests/bug20177.phpt]
Don't override xslt_set_base (bug #20518) [ext/xslt/tests/bug20518.phpt]
Various ways to provide xml and xslt arguments and params [ext/xslt/tests/xslt_process-001.phpt]
Crash xslt_process with reused handler (this test may take a while)
[ext/xslt/tests/xslt_process-002.phpt]
xslt_set_object function [ext/xslt/tests/xslt_set_object.phpt]
Set a non-existing scheme handler [ext/xslt/tests/xslt_set_scheme_handlers-001.phpt]
xslt_setopt function and public entities [ext/xslt/tests/xslt_setopt.phpt]
=====================================================================
================================================================================
/root/sources/php/php5-200305241130/tests/classes/bug20120.phpt
================================================================================
---- EXPECTED OUTPUT
test
test2
test2
---- ACTUAL OUTPUT
Parse error: parse error in /root/sources/php/php5-200305241130/tests/classes/bug20120.php on line
11
---- FAILED
================================================================================
001- test
001+ Parse error: parse error in /root/sources/php/php5-200305241130/tests/classes/bug20120.php on
line 11
002- test2
003- test2
================================================================================
================================================================================
/root/sources/php/php5-200305241130/tests/lang/bug17115.phpt
================================================================================
---- EXPECTED OUTPUT
int(0)
int(1)
int(2)
---- ACTUAL OUTPUT
NULL
NULL
NULL
---- FAILED
================================================================================
001- int(0)
001+ NULL
002- int(1)
002+ NULL
003- int(2)
003+ NULL
================================================================================
================================================================================
/root/sources/php/php5-200305241130/tests/lang/bug21800.phpt
================================================================================
---- EXPECTED OUTPUT
Interactive mode enabled
:test:
---- ACTUAL OUTPUT
---- FAILED
================================================================================
001- Interactive mode enabled
001+
002-
003- :test:
================================================================================
================================================================================
/root/sources/php/php5-200305241130/tests/lang/bug21849.phpt
================================================================================
---- EXPECTED OUTPUT
fubar
---- ACTUAL OUTPUT
---- FAILED
================================================================================
001- fubar
001+
================================================================================
================================================================================
/root/sources/php/php5-200305241130/tests/lang/bug22367.phpt
================================================================================
---- EXPECTED OUTPUT
int(5)
bool(false)
bool(false)
array(5) {
[0]=>
int(0)
[1]=>
int(1)
[2]=>
int(2)
[3]=>
int(3)
[4]=>
int(4)
}
array(5) {
[0]=>
int(0)
[1]=>
int(1)
[2]=>
int(2)
[3]=>
int(3)
[4]=>
int(4)
}
int(2)
bool(true)
bool(true)
array(5) {
[0]=>
int(0)
[1]=>
int(1)
[2]=>
int(2)
[3]=>
int(3)
[4]=>
int(4)
}
array(5) {
[0]=>
int(0)
[1]=>
int(1)
[2]=>
int(2)
[3]=>
int(3)
[4]=>
int(4)
}
---- ACTUAL OUTPUT
int(5)
bool(false)
bool(false)
array(5) {
[0]=>
int(4)
[1]=>
int(4)
[2]=>
int(4)
[3]=>
int(4)
[4]=>
int(4)
}
array(5) {
[0]=>
int(0)
[1]=>
int(1)
[2]=>
int(2)
[3]=>
int(3)
[4]=>
int(4)
}
int(2)
bool(true)
bool(true)
array(5) {
[0]=>
int(0)
[1]=>
int(1)
[2]=>
int(2)
[3]=>
int(3)
[4]=>
int(4)
}
array(5) {
[0]=>
int(0)
[1]=>
int(1)
[2]=>
&int(2)
[3]=>
int(3)
[4]=>
int(4)
}
---- FAILED
================================================================================
006- int(0)
006+ int(4)
008- int(1)
008+ int(4)
010- int(2)
010+ int(4)
012- int(3)
012+ int(4)
049- int(2)
049+ &int(2)
================================================================================
================================================================================
/root/sources/php/php5-200305241130/tests/lang/bug22592.phpt
================================================================================
---- EXPECTED OUTPUT
string(5) "* *-*"
string(7) "* *-* *"
string(7) "*4*-* *"
string(7) "*4*s* *"
string(8) "*4*s* *0"
string(8) "*-*-* *0"
string(8) "*-*s*s*0"
string(8) "4-4s4s*0"
string(9) "4-4s4s505"
string(9) "454s4s505"
string(1) "-"
string(6) "string"
int(4)
int(5)
string(1) "5"
[Illegal string offset: -1]
---- ACTUAL OUTPUT
string(5) "* *-*"
string(7) "* *-* *"
string(7) "*4*-* *"
string(7) "*4*s* *"
string(8) "*4*s* *0"
string(8) "*[0x0]*-* *0"
string(8) "*[0x0]*[0x0]*s*0"
string(8) "[0x0][0x0][0x0][0x0]4s*0"
string(9) "[0x0][0x0][0x0][0x0]4s[0x0]05"
string(9) "[0x0][0x0][0x0][0x0]4s[0x0]05"
NULL
NULL
NULL
NULL
NULL
[Illegal string offset: -1]
---- FAILED
================================================================================
006- string(8) "*-*-* *0"
006+ string(8) "*[0x0]*-* *0"
007- string(8) "*-*s*s*0"
007+ string(8) "*[0x0]*[0x0]*s*0"
008- string(8) "4-4s4s*0"
008+ string(8) "[0x0][0x0][0x0][0x0]4s*0"
009- string(9) "4-4s4s505"
009+ string(9) "[0x0][0x0][0x0][0x0]4s[0x0]05"
010- string(9) "454s4s505"
010+ string(9) "[0x0][0x0][0x0][0x0]4s[0x0]05"
011- string(1) "-"
011+ NULL
012- string(6) "string"
012+ NULL
013- int(4)
013+ NULL
014- int(5)
014+ NULL
015- string(1) "5"
015+ NULL
================================================================================
================================================================================
/root/sources/php/php5-200305241130/tests/lang/bug23624.phpt
================================================================================
---- EXPECTED OUTPUT
string(3) "one"
string(5) "three"
---- ACTUAL OUTPUT
string(3) "one"
bool(false)
---- FAILED
================================================================================
002- string(5) "three"
002+ bool(false)
================================================================================
================================================================================
/root/sources/php/php5-200305241130/ext/session/tests/003.phpt
================================================================================
---- EXPECTED OUTPUT
object(foo)(2) {
["bar"]=>
string(2) "ok"
["yes"]=>
int(2)
}
array(1) {
[3]=>
&object(foo)(2) {
["bar"]=>
string(2) "ok"
["yes"]=>
int(2)
}
}
---- ACTUAL OUTPUT
object(foo)#1 (2) {
["bar"]=>
string(2) "ok"
["yes"]=>
int(2)
}
array(1) {
[3]=>
object(foo)#2 (2) {
["bar"]=>
string(2) "ok"
["yes"]=>
int(2)
}
}
---- FAILED
================================================================================
001- object(foo)(2) {
001+ object(foo)#1 (2) {
009- &object(foo)(2) {
009+ object(foo)#2 (2) {
================================================================================
================================================================================
/root/sources/php/php5-200305241130/ext/session/tests/004.phpt
================================================================================
---- EXPECTED OUTPUT
OPEN: PHPSESSID
READ: abtest
object(foo)(2) {
["bar"]=>
string(2) "ok"
["yes"]=>
int(2)
}
array(1) {
[3]=>
&object(foo)(2) {
["bar"]=>
string(2) "ok"
["yes"]=>
int(2)
}
}
WRITE: abtest,
baz|O:3:"foo":2:{s:3:"bar";s:2:"ok";s:3:"yes";i:2;}arr|a:1:{i:3;O:3:"foo":2:{s:3:"bar";s:2:"ok";s:3:"yes";i:2;}}
OPEN: PHPSESSID
READ: abtest
object(foo)(2) {
["bar"]=>
string(2) "ok"
["yes"]=>
int(2)
}
array(1) {
[3]=>
object(foo)(2) {
["bar"]=>
string(2) "ok"
["yes"]=>
int(2)
}
}
DESTROY: abtest
---- ACTUAL OUTPUT
OPEN: PHPSESSID
READ: abtest
object(foo)#2 (2) {
["bar"]=>
string(2) "ok"
["yes"]=>
int(2)
}
array(1) {
[3]=>
object(foo)#3 (2) {
["bar"]=>
string(2) "ok"
["yes"]=>
int(2)
}
}
WRITE: abtest,
baz|O:3:"foo":2:{s:3:"bar";s:2:"ok";s:3:"yes";i:2;}arr|a:1:{i:3;O:3:"foo":2:{s:3:"bar";s:2:"ok";s:3:"yes";i:2;}}
OPEN: PHPSESSID
READ: abtest
object(foo)#4 (2) {
["bar"]=>
string(2) "ok"
["yes"]=>
int(2)
}
array(1) {
[3]=>
object(foo)#2 (2) {
["bar"]=>
string(2) "ok"
["yes"]=>
int(2)
}
}
DESTROY: abtest
---- FAILED
================================================================================
003- object(foo)(2) {
003+ object(foo)#2 (2) {
011- &object(foo)(2) {
011+ object(foo)#3 (2) {
021- object(foo)(2) {
021+ object(foo)#4 (2) {
029- object(foo)(2) {
029+ object(foo)#2 (2) {
================================================================================
================================================================================
/root/sources/php/php5-200305241130/ext/session/tests/005.phpt
================================================================================
---- EXPECTED OUTPUT
OPEN: PHPSESSID
READ: abtest
object(foo)(2) {
["bar"]=>
string(2) "ok"
["yes"]=>
int(2)
}
array(1) {
[3]=>
&object(foo)(2) {
["bar"]=>
string(2) "ok"
["yes"]=>
int(2)
}
}
WRITE: abtest,
baz|O:3:"foo":2:{s:3:"bar";s:2:"ok";s:3:"yes";i:2;}arr|a:1:{i:3;O:3:"foo":2:{s:3:"bar";s:2:"ok";s:3:"yes";i:2;}}
CLOSE
OPEN: PHPSESSID
READ: abtest
object(foo)(2) {
["bar"]=>
string(2) "ok"
["yes"]=>
int(3)
}
array(1) {
[3]=>
&object(foo)(2) {
["bar"]=>
string(2) "ok"
["yes"]=>
int(3)
}
}
int(123)
WRITE: abtest,
baz|O:3:"foo":2:{s:3:"bar";s:2:"ok";s:3:"yes";i:3;}arr|a:1:{i:3;O:3:"foo":2:{s:3:"bar";s:2:"ok";s:3:"yes";i:3;}}c|i:123;
CLOSE
OPEN: PHPSESSID
READ: abtest
object(foo)(2) {
["bar"]=>
string(2) "ok"
["yes"]=>
int(3)
}
array(1) {
[3]=>
object(foo)(2) {
["bar"]=>
string(2) "ok"
["yes"]=>
int(3)
}
}
int(123)
DESTROY: abtest
CLOSE
---- ACTUAL OUTPUT
OPEN: PHPSESSID
READ: abtest
object(foo)#2 (2) {
["bar"]=>
string(2) "ok"
["yes"]=>
int(2)
}
array(1) {
[3]=>
object(foo)#3 (2) {
["bar"]=>
string(2) "ok"
["yes"]=>
int(2)
}
}
WRITE: abtest,
baz|O:3:"foo":2:{s:3:"bar";s:2:"ok";s:3:"yes";i:2;}arr|a:1:{i:3;O:3:"foo":2:{s:3:"bar";s:2:"ok";s:3:"yes";i:2;}}
CLOSE
OPEN: PHPSESSID
READ: abtest
object(foo)#4 (2) {
["bar"]=>
string(2) "ok"
["yes"]=>
int(3)
}
array(1) {
[3]=>
object(foo)#2 (2) {
["bar"]=>
string(2) "ok"
["yes"]=>
int(3)
}
}
int(123)
WRITE: abtest,
baz|O:3:"foo":2:{s:3:"bar";s:2:"ok";s:3:"yes";i:3;}arr|a:1:{i:3;O:3:"foo":2:{s:3:"bar";s:2:"ok";s:3:"yes";i:3;}}c|i:123;
CLOSE
OPEN: PHPSESSID
READ: abtest
object(foo)#3 (2) {
["bar"]=>
string(2) "ok"
["yes"]=>
int(3)
}
array(1) {
[3]=>
object(foo)#4 (2) {
["bar"]=>
string(2) "ok"
["yes"]=>
int(3)
}
}
int(123)
DESTROY: abtest
CLOSE
---- FAILED
================================================================================
003- object(foo)(2) {
003+ object(foo)#2 (2) {
011- &object(foo)(2) {
011+ object(foo)#3 (2) {
022- object(foo)(2) {
022+ object(foo)#4 (2) {
030- &object(foo)(2) {
030+ object(foo)#2 (2) {
042- object(foo)(2) {
042+ object(foo)#3 (2) {
050- object(foo)(2) {
050+ object(foo)#4 (2) {
================================================================================
================================================================================
/root/sources/php/php5-200305241130/ext/session/tests/006.phpt
================================================================================
---- EXPECTED OUTPUT
original values:
object(a)(1) {
["test"]=>
string(5) "hallo"
}
object(b)(1) {
["a"]=>
&object(a)(1) {
["test"]=>
string(5) "hallo"
}
}
values after session:
object(a)(1) {
["test"]=>
string(5) "hallo"
}
object(b)(1) {
["a"]=>
&object(a)(1) {
["test"]=>
string(5) "hallo"
}
}
---- ACTUAL OUTPUT
original values:
object(a)#1 (1) {
["test"]=>
string(5) "hallo"
}
object(b)#2 (1) {
["a"]=>
&object(a)#1 (1) {
["test"]=>
string(5) "hallo"
}
}
values after session:
object(a)#3 (1) {
["test"]=>
string(5) "hallo"
}
object(b)#1 (1) {
["a"]=>
&object(a)#3 (1) {
["test"]=>
string(5) "hallo"
}
}
---- FAILED
================================================================================
002- object(a)(1) {
002+ object(a)#1 (1) {
006- object(b)(1) {
006+ object(b)#2 (1) {
008- &object(a)(1) {
008+ &object(a)#1 (1) {
014- object(a)(1) {
014+ object(a)#3 (1) {
018- object(b)(1) {
018+ object(b)#1 (1) {
020- &object(a)(1) {
020+ &object(a)#3 (1) {
================================================================================
================================================================================
/root/sources/php/php5-200305241130/ext/session/tests/019.phpt
================================================================================
---- EXPECTED OUTPUT
array(2) {
["o1"]=>
&object(tfoo)(1) {
["c"]=>
int(42)
}
["o2"]=>
&object(tfoo)(1) {
["c"]=>
int(42)
}
}
array(2) {
["o1"]=>
&object(tfoo)(1) {
["c"]=>
int(44)
}
["o2"]=>
&object(tfoo)(1) {
["c"]=>
int(44)
}
}
---- ACTUAL OUTPUT
---- FAILED
================================================================================
001- array(2) {
001+
002- ["o1"]=>
003- &object(tfoo)(1) {
004- ["c"]=>
005- int(42)
006- }
007- ["o2"]=>
008- &object(tfoo)(1) {
009- ["c"]=>
010- int(42)
011- }
012- }
013- array(2) {
014- ["o1"]=>
015- &object(tfoo)(1) {
016- ["c"]=>
017- int(44)
018- }
019- ["o2"]=>
020- &object(tfoo)(1) {
021- ["c"]=>
022- int(44)
023- }
024- }
================================================================================
================================================================================
/root/sources/php/php5-200305241130/ext/session/tests/020.phpt
================================================================================
---- EXPECTED OUTPUT
<a href="link.php?a=b&PHPSESSID=abtest">
---- ACTUAL OUTPUT
---- FAILED
================================================================================
001- <a href="link.php?a=b&PHPSESSID=abtest">
001+
================================================================================
================================================================================
/root/sources/php/php5-200305241130/ext/session/tests/021.phpt
================================================================================
---- EXPECTED OUTPUT
<form><input type="hidden" name="PHPSESSID" value="abtest"
/>
<fieldset><input type="hidden" name="PHPSESSID"
value="abtest" />
<form><input type="hidden" name="PHPSESSID" value="abtest"
/>
<fieldset>
<form><input type="hidden" name="PHPSESSID" value="abtest"
/>
<fieldset>
<form>
<fieldset><input type="hidden" name="PHPSESSID"
value="abtest" />
---- ACTUAL OUTPUT
---- FAILED
================================================================================
001- <form><input type="hidden" name="PHPSESSID"
value="abtest" />
001+
002- <fieldset><input type="hidden" name="PHPSESSID"
value="abtest" />
003- <form><input type="hidden" name="PHPSESSID"
value="abtest" />
004- <fieldset>
005- <form><input type="hidden" name="PHPSESSID"
value="abtest" />
006- <fieldset>
007- <form>
008- <fieldset><input type="hidden" name="PHPSESSID"
value="abtest" />
================================================================================
================================================================================
/root/sources/php/php5-200305241130/ext/standard/tests/aggregation/aggregate.phpt
================================================================================
---- EXPECTED OUTPUT
I'm alive!
I'm helping!
I'm aggregating!
****
---- ACTUAL OUTPUT
I'm alive!
Fatal error: Call to undefined method simple::do_this() in
/root/sources/php/php5-200305241130/ext/standard/tests/aggregation/aggregate.php on line 7
---- FAILED
================================================================================
002- I'm helping!
002+
003- I'm aggregating!
003+ Fatal error: Call to undefined method simple::do_this() in
/root/sources/php/php5-200305241130/ext/standard/tests/aggregation/aggregate.php on line 7
004- ****
================================================================================
================================================================================
/root/sources/php/php5-200305241130/ext/standard/tests/aggregation/aggregate_methods.phpt
================================================================================
---- EXPECTED OUTPUT
I'm alive!
mixing
100
simple,mix_it
simple_prop
mixing
---- ACTUAL OUTPUT
I'm alive!
Fatal error: Call to undefined method simple::mix_it() in
/root/sources/php/php5-200305241130/ext/standard/tests/aggregation/aggregate_methods.php on line 6
---- FAILED
================================================================================
002- mixing
002+
003- 100
003+ Fatal error: Call to undefined method simple::mix_it() in
/root/sources/php/php5-200305241130/ext/standard/tests/aggregation/aggregate_methods.php on line 6
004- simple,mix_it
005- simple_prop
006- mixing
================================================================================
================================================================================
/root/sources/php/php5-200305241130/ext/standard/tests/aggregation/aggregate_methods_by_list.phpt
================================================================================
---- EXPECTED OUTPUT
I'm alive!
simple,just_another_method
I'm alive!
simple,do_this,do_that
yep, that's me
---- ACTUAL OUTPUT
I'm alive!
simple
I'm alive!
simple
Fatal error: Call to undefined method simple::just_another_method() in
/root/sources/php/php5-200305241130/ext/standard/tests/aggregation/aggregate_methods_by_list.php on
line 10
---- FAILED
================================================================================
002- simple,just_another_method
002+ simple
004- simple,do_this,do_that
004+ simple
005- yep, that's me
005+
006+ Fatal error: Call to undefined method simple::just_another_method() in
/root/sources/php/php5-200305241130/ext/standard/tests/aggregation/aggregate_methods_by_list.php on
line 10
================================================================================
================================================================================
/root/sources/php/php5-200305241130/ext/standard/tests/aggregation/aggregate_methods_by_regexp.phpt
================================================================================
---- EXPECTED OUTPUT
I'm alive!
simple,do_this,do_that
I'm alive!
simple,just_another_method
---- ACTUAL OUTPUT
I'm alive!
simple
I'm alive!
simple
---- FAILED
================================================================================
002- simple,do_this,do_that
002+ simple
004- simple,just_another_method
004+ simple
================================================================================
================================================================================
/root/sources/php/php5-200305241130/ext/standard/tests/general_functions/sunfuncts.phpt
================================================================================
---- EXPECTED OUTPUT
1041293199 06:39 6.6524557618962
1041293806 16:46 16.769374867459
1043971592 06:32 6.5453702926602
1043972233 17:13 17.217524708736
1046390766 06:06 6.1156526756851
1046391456 17:36 17.6108549623
1049069128 05:28 5.4727420290691
1049069878 17:58 17.972552584375
1051661094 04:54 4.9012299828593
1051661898 18:18 18.313688769483
1054339474 04:34 4.5744292894498
1054340319 18:39 18.656400943241
1056931476 04:36 4.6161204505189
1056932328 18:48 18.808871657766
1059609894 04:54 4.9068825098365
1059610715 18:35 18.599286002028
1062288314 05:14 5.2368895570738
1062289083 18:03 18.060541787879
1064880332 05:32 5.542366581139
1064881044 17:24 17.411505614917
1067558754 05:54 5.9162088420581
1067559410 16:50 16.833698570628
1070150780 06:20 6.3462215520697
1070151395 16:35 16.583589055537
---- ACTUAL OUTPUT
1041293199 06:39 6.6524557618962
1041293806 16:46 16.769374867459
1043971592 06:32 6.5453702926602
1043972233 17:13 17.217524708736
1046390766 06:06 6.1156526756851
1046391456 17:36 17.6108549623
1049069128 05:28 5.4727420290691
1049069878 17:58 17.972552584375
1051661094 04:54 4.9012299828593
1051661898 18:18 18.313688769483
1054339474 04:34 4.5744292894498
1054340319 18:39 18.656400943241
1056931476 04:36 4.6161204505189
1056932328 18:48 18.808871657766
1059609894 04:54 4.9068825098364
1059610715 18:35 18.599286002028
1062288314 05:14 5.2368895570738
1062289083 18:03 18.060541787879
1064880332 05:32 5.542366581139
1064881044 17:24 17.411505614917
1067558754 05:54 5.9162088420581
1067559410 16:50 16.833698570628
1070150780 06:20 6.3462215520697
1070151395 16:35 16.583589055537
---- FAILED
================================================================================
015- 1059609894 04:54 4.9068825098365
015+ 1059609894 04:54 4.9068825098364
================================================================================
================================================================================
/root/sources/php/php5-200305241130/ext/xml/tests/xml001.phpt
================================================================================
---- EXPECTED OUTPUT
{?[<?xml version="1.0" encoding="ISO-8859-1"?>]}{?[
]}{?[<!DOCTYPE]}{?[ ]}{?[phptest]}{?[ ]}{?[SYSTEM]}{?[ ]}{?["notfound.dtd"]}{?[
]}{?[[]}{?[
]}{?[<!ENTITY]}{?[ ]}{?[%]}{?[ ]}{?[incent]}{?[ ]}{?[SYSTEM]}{?[
]}{?["inc.ent"]}{?[>]}{?[
]}{?[%incent;]}{?[
]}{?[]]}{?[>]}{?[
]}{ROOT ID="elem1"}{CDATA[
]}{CDATA[ Plain text.]}{CDATA[
]}{CDATA[ ]}{ELEM1}{CDATA[
]}{CDATA[ ]}{?[<!-- comment -->]}{CDATA[
]}{CDATA[ ]}{ELEM2}{CDATA[
]}{CDATA[ ]}{?[<![CDATA[]}{CDATA[CDATA block]}{?[]]>]}{CDATA[
]}{CDATA[ ]}{ELEM3}{CDATA[
]}{CDATA[ ]}{ENTREF[&included-entity;]}{CDATA[
]}{CDATA[ ]}{ELEM4}{CDATA[
]}{CDATA[ ]}{PI[test,processing instruction ]}{CDATA[
]}{CDATA[ ]}{/ELEM4}{CDATA[
]}{CDATA[ ]}{/ELEM3}{CDATA[
]}{CDATA[ ]}{/ELEM2}{CDATA[
]}{CDATA[ ]}{/ELEM1}{CDATA[
]}{/ROOT}{?[
]}parse complete
---- ACTUAL OUTPUT
{EXTENTREF[incent,,,inc.ent]}
{ROOT ID="elem1"}{CDATA[
Plain text.
]}{ELEM1}{CDATA[
]}{?[<-- comment -->]}{CDATA[
]}{ELEM2}{CDATA[
]}{CDATA[
]}{ELEM3}{CDATA[
]}{ENTREF[&included-entity;]}{CDATA[
]}{ELEM4}{CDATA[
]}{PI[test,processing instruction ]}{CDATA[
]}{/ELEM4}{CDATA[
]}{/ELEM3}{CDATA[
]}{/ELEM2}{CDATA[
]}{/ELEM1}{CDATA[
]}{/ROOT}XML error: XML_WAR_UNDECLARED_ENTITY at line 21
---- FAILED
================================================================================
001- {?[<?xml version="1.0" encoding="ISO-8859-1"?>]}{?[
001+ {EXTENTREF[incent,,,inc.ent]}
002- ]}{?[<!DOCTYPE]}{?[ ]}{?[phptest]}{?[ ]}{?[SYSTEM]}{?[ ]}{?["notfound.dtd"]}{?[
]}{?[[]}{?[
002+ {ROOT ID="elem1"}{CDATA[
003- ]}{?[<!ENTITY]}{?[ ]}{?[%]}{?[ ]}{?[incent]}{?[ ]}{?[SYSTEM]}{?[
]}{?["inc.ent"]}{?[>]}{?[
003+ Plain text.
004- ]}{?[%incent;]}{?[
004+ ]}{ELEM1}{CDATA[
005- ]}{?[]]}{?[>]}{?[
005+ ]}{?[<-- comment -->]}{CDATA[
006- ]}{ROOT ID="elem1"}{CDATA[
006+ ]}{ELEM2}{CDATA[
007- ]}{CDATA[ Plain text.]}{CDATA[
007+ ]}{CDATA[
008- ]}{CDATA[ ]}{ELEM1}{CDATA[
008+ ]}{ELEM3}{CDATA[
009- ]}{CDATA[ ]}{?[<!-- comment -->]}{CDATA[
009+ ]}{ENTREF[&included-entity;]}{CDATA[
010- ]}{CDATA[ ]}{ELEM2}{CDATA[
010+ ]}{ELEM4}{CDATA[
011- ]}{CDATA[ ]}{?[<![CDATA[]}{CDATA[CDATA block]}{?[]]>]}{CDATA[
011+ ]}{PI[test,processing instruction ]}{CDATA[
012- ]}{CDATA[ ]}{ELEM3}{CDATA[
012+ ]}{/ELEM4}{CDATA[
013- ]}{CDATA[ ]}{ENTREF[&included-entity;]}{CDATA[
013+ ]}{/ELEM3}{CDATA[
014- ]}{CDATA[ ]}{ELEM4}{CDATA[
014+ ]}{/ELEM2}{CDATA[
015- ]}{CDATA[ ]}{PI[test,processing instruction ]}{CDATA[
015+ ]}{/ELEM1}{CDATA[
016- ]}{CDATA[ ]}{/ELEM4}{CDATA[
016+ ]}{/ROOT}XML error: XML_WAR_UNDECLARED_ENTITY at line 21
017- ]}{CDATA[ ]}{/ELEM3}{CDATA[
018- ]}{CDATA[ ]}{/ELEM2}{CDATA[
019- ]}{CDATA[ ]}{/ELEM1}{CDATA[
020- ]}{/ROOT}{?[
021- ]}parse complete
================================================================================
================================================================================
/root/sources/php/php5-200305241130/ext/xml/tests/xml002.phpt
================================================================================
---- EXPECTED OUTPUT
{?[<?xml version="1.0" encoding="ISO-8859-1"?>]}{?[
]}{?[<!DOCTYPE]}{?[ ]}{?[phptest]}{?[ ]}{?[SYSTEM]}{?[ ]}{?["notfound.dtd"]}{?[
]}{?[[]}{?[
]}{?[<!ENTITY]}{?[ ]}{?[%]}{?[ ]}{?[incent]}{?[ ]}{?[SYSTEM]}{?[
]}{?["inc.ent"]}{?[>]}{?[
]}{?[%incent;]}{?[
]}{?[]]}{?[>]}{?[
]}{ROOT ID="elem1"}{CDATA[
]}{CDATA[ Plain text.]}{CDATA[
]}{CDATA[ ]}{ELEM1}{CDATA[
]}{CDATA[ ]}{?[<!-- comment -->]}{CDATA[
]}{CDATA[ ]}{ELEM2}{CDATA[
]}{CDATA[ ]}{?[<![CDATA[]}{CDATA[CDATA block]}{?[]]>]}{CDATA[
]}{CDATA[ ]}{ELEM3}{CDATA[
]}{CDATA[ ]}{ENTREF[&included-entity;]}{CDATA[
]}{CDATA[ ]}{ELEM4}{CDATA[
]}{CDATA[ ]}{PI[test,processing instruction ]}{CDATA[
]}{CDATA[ ]}{/ELEM4}{CDATA[
]}{CDATA[ ]}{/ELEM3}{CDATA[
]}{CDATA[ ]}{/ELEM2}{CDATA[
]}{CDATA[ ]}{/ELEM1}{CDATA[
]}{/ROOT}{?[
]}parse complete
---- ACTUAL OUTPUT
{EXTENTREF[incent,,,inc.ent]}
{ROOT ID="elem1"}{CDATA[
Plain text.
]}{ELEM1}{CDATA[
]}{?[<-- comment -->]}{CDATA[
]}{ELEM2}{CDATA[
]}{CDATA[
]}{ELEM3}{CDATA[
]}{ENTREF[&included-entity;]}{CDATA[
]}{ELEM4}{CDATA[
]}{PI[test,processing instruction ]}{CDATA[
]}{/ELEM4}{CDATA[
]}{/ELEM3}{CDATA[
]}{/ELEM2}{CDATA[
]}{/ELEM1}{CDATA[
]}{/ROOT}XML error: XML_WAR_UNDECLARED_ENTITY at line 21
---- FAILED
================================================================================
001- {?[<?xml version="1.0" encoding="ISO-8859-1"?>]}{?[
001+ {EXTENTREF[incent,,,inc.ent]}
002- ]}{?[<!DOCTYPE]}{?[ ]}{?[phptest]}{?[ ]}{?[SYSTEM]}{?[ ]}{?["notfound.dtd"]}{?[
]}{?[[]}{?[
002+ {ROOT ID="elem1"}{CDATA[
003- ]}{?[<!ENTITY]}{?[ ]}{?[%]}{?[ ]}{?[incent]}{?[ ]}{?[SYSTEM]}{?[
]}{?["inc.ent"]}{?[>]}{?[
003+ Plain text.
004- ]}{?[%incent;]}{?[
004+ ]}{ELEM1}{CDATA[
005- ]}{?[]]}{?[>]}{?[
005+ ]}{?[<-- comment -->]}{CDATA[
006- ]}{ROOT ID="elem1"}{CDATA[
006+ ]}{ELEM2}{CDATA[
007- ]}{CDATA[ Plain text.]}{CDATA[
007+ ]}{CDATA[
008- ]}{CDATA[ ]}{ELEM1}{CDATA[
008+ ]}{ELEM3}{CDATA[
009- ]}{CDATA[ ]}{?[<!-- comment -->]}{CDATA[
009+ ]}{ENTREF[&included-entity;]}{CDATA[
010- ]}{CDATA[ ]}{ELEM2}{CDATA[
010+ ]}{ELEM4}{CDATA[
011- ]}{CDATA[ ]}{?[<![CDATA[]}{CDATA[CDATA block]}{?[]]>]}{CDATA[
011+ ]}{PI[test,processing instruction ]}{CDATA[
012- ]}{CDATA[ ]}{ELEM3}{CDATA[
012+ ]}{/ELEM4}{CDATA[
013- ]}{CDATA[ ]}{ENTREF[&included-entity;]}{CDATA[
013+ ]}{/ELEM3}{CDATA[
014- ]}{CDATA[ ]}{ELEM4}{CDATA[
014+ ]}{/ELEM2}{CDATA[
015- ]}{CDATA[ ]}{PI[test,processing instruction ]}{CDATA[
015+ ]}{/ELEM1}{CDATA[
016- ]}{CDATA[ ]}{/ELEM4}{CDATA[
016+ ]}{/ROOT}XML error: XML_WAR_UNDECLARED_ENTITY at line 21
017- ]}{CDATA[ ]}{/ELEM3}{CDATA[
018- ]}{CDATA[ ]}{/ELEM2}{CDATA[
019- ]}{CDATA[ ]}{/ELEM1}{CDATA[
020- ]}{/ROOT}{?[
021- ]}parse complete
================================================================================
================================================================================
/root/sources/php/php5-200305241130/ext/xml/tests/xml003.phpt
================================================================================
---- EXPECTED OUTPUT
{?[<?xml version="1.0" encoding="ISO-8859-1"?>]}{?[
]}{?[<!DOCTYPE]}{?[ ]}{?[phptest]}{?[ ]}{?[SYSTEM]}{?[ ]}{?["notfound.dtd"]}{?[
]}{?[[]}{?[
]}{?[<!ENTITY]}{?[ ]}{?[%]}{?[ ]}{?[incent]}{?[ ]}{?[SYSTEM]}{?[
]}{?["inc.ent"]}{?[>]}{?[
]}{?[%incent;]}{?[
]}{?[]]}{?[>]}{?[
]}{ROOT ID="elem1"}{CDATA[
]}{CDATA[ Plain text.]}{CDATA[
]}{CDATA[ ]}{ELEM1}{CDATA[
]}{CDATA[ ]}{?[<!-- comment -->]}{CDATA[
]}{CDATA[ ]}{ELEM2}{CDATA[
]}{CDATA[ ]}{?[<![CDATA[]}{CDATA[CDATA block]}{?[]]>]}{CDATA[
]}{CDATA[ ]}{ELEM3}{CDATA[
]}{CDATA[ ]}{ENTREF[&included-entity;]}{CDATA[
]}{CDATA[ ]}{ELEM4}{CDATA[
]}{CDATA[ ]}{PI[test,processing instruction ]}{CDATA[
]}{CDATA[ ]}{/ELEM4}{CDATA[
]}{CDATA[ ]}{/ELEM3}{CDATA[
]}{CDATA[ ]}{/ELEM2}{CDATA[
]}{CDATA[ ]}{/ELEM1}{CDATA[
]}{/ROOT}{?[
]}parse complete
---- ACTUAL OUTPUT
{EXTENTREF[incent,,,inc.ent]}
{ROOT ID="elem1"}{CDATA[
Plain text.
]}{ELEM1}{CDATA[
]}{?[<-- comment -->]}{CDATA[
]}{ELEM2}{CDATA[
]}{CDATA[
]}{ELEM3}{CDATA[
]}{ENTREF[&included-entity;]}{CDATA[
]}{ELEM4}{CDATA[
]}{PI[test,processing instruction ]}{CDATA[
]}{/ELEM4}{CDATA[
]}{/ELEM3}{CDATA[
]}{/ELEM2}{CDATA[
]}{/ELEM1}{CDATA[
]}{/ROOT}XML error: XML_WAR_UNDECLARED_ENTITY at line 21
---- FAILED
================================================================================
001- {?[<?xml version="1.0" encoding="ISO-8859-1"?>]}{?[
001+ {EXTENTREF[incent,,,inc.ent]}
002- ]}{?[<!DOCTYPE]}{?[ ]}{?[phptest]}{?[ ]}{?[SYSTEM]}{?[ ]}{?["notfound.dtd"]}{?[
]}{?[[]}{?[
002+ {ROOT ID="elem1"}{CDATA[
003- ]}{?[<!ENTITY]}{?[ ]}{?[%]}{?[ ]}{?[incent]}{?[ ]}{?[SYSTEM]}{?[
]}{?["inc.ent"]}{?[>]}{?[
003+ Plain text.
004- ]}{?[%incent;]}{?[
004+ ]}{ELEM1}{CDATA[
005- ]}{?[]]}{?[>]}{?[
005+ ]}{?[<-- comment -->]}{CDATA[
006- ]}{ROOT ID="elem1"}{CDATA[
006+ ]}{ELEM2}{CDATA[
007- ]}{CDATA[ Plain text.]}{CDATA[
007+ ]}{CDATA[
008- ]}{CDATA[ ]}{ELEM1}{CDATA[
008+ ]}{ELEM3}{CDATA[
009- ]}{CDATA[ ]}{?[<!-- comment -->]}{CDATA[
009+ ]}{ENTREF[&included-entity;]}{CDATA[
010- ]}{CDATA[ ]}{ELEM2}{CDATA[
010+ ]}{ELEM4}{CDATA[
011- ]}{CDATA[ ]}{?[<![CDATA[]}{CDATA[CDATA block]}{?[]]>]}{CDATA[
011+ ]}{PI[test,processing instruction ]}{CDATA[
012- ]}{CDATA[ ]}{ELEM3}{CDATA[
012+ ]}{/ELEM4}{CDATA[
013- ]}{CDATA[ ]}{ENTREF[&included-entity;]}{CDATA[
013+ ]}{/ELEM3}{CDATA[
014- ]}{CDATA[ ]}{ELEM4}{CDATA[
014+ ]}{/ELEM2}{CDATA[
015- ]}{CDATA[ ]}{PI[test,processing instruction ]}{CDATA[
015+ ]}{/ELEM1}{CDATA[
016- ]}{CDATA[ ]}{/ELEM4}{CDATA[
016+ ]}{/ROOT}XML error: XML_WAR_UNDECLARED_ENTITY at line 21
017- ]}{CDATA[ ]}{/ELEM3}{CDATA[
018- ]}{CDATA[ ]}{/ELEM2}{CDATA[
019- ]}{CDATA[ ]}{/ELEM1}{CDATA[
020- ]}{/ROOT}{?[
021- ]}parse complete
================================================================================
================================================================================
/root/sources/php/php5-200305241130/ext/xslt/tests/bug20177.phpt
================================================================================
---- EXPECTED OUTPUT
Test has passed
Test has passed
---- ACTUAL OUTPUT
---- FAILED
================================================================================
001- Test has passed
001+
002- Test has passed
================================================================================
================================================================================
/root/sources/php/php5-200305241130/ext/xslt/tests/bug20518.phpt
================================================================================
---- EXPECTED OUTPUT
Test has passed
---- ACTUAL OUTPUT
---- FAILED
================================================================================
001- Test has passed
001+
================================================================================
================================================================================
/root/sources/php/php5-200305241130/ext/xslt/tests/xslt_process-001.phpt
================================================================================
---- EXPECTED OUTPUT
Test has passed
Test has passed
Test has passed
Test has passed
Test has passed
Test has passed
Test has passed
Test has passed
PHP QA®
PHP QA®
PHP QA®
PHP QA®
---- ACTUAL OUTPUT
---- FAILED
================================================================================
001- Test has passed
001+
002- Test has passed
003- Test has passed
004- Test has passed
005- Test has passed
006- Test has passed
007- Test has passed
008- Test has passed
009- PHP QA®
010- PHP QA®
011- PHP QA®
012- PHP QA®
================================================================================
================================================================================
/root/sources/php/php5-200305241130/ext/xslt/tests/xslt_process-002.phpt
================================================================================
---- EXPECTED OUTPUT
OK
---- ACTUAL OUTPUT
---- FAILED
================================================================================
001- OK
001+
================================================================================
================================================================================
/root/sources/php/php5-200305241130/ext/xslt/tests/xslt_set_object.phpt
================================================================================
---- EXPECTED OUTPUT
OK
OK
---- ACTUAL OUTPUT
---- FAILED
================================================================================
001- OK
001+
002- OK
================================================================================
================================================================================
/root/sources/php/php5-200305241130/ext/xslt/tests/xslt_set_scheme_handlers-001.phpt
================================================================================
---- EXPECTED OUTPUT
OK
---- ACTUAL OUTPUT
---- FAILED
================================================================================
001- OK
001+
================================================================================
================================================================================
/root/sources/php/php5-200305241130/ext/xslt/tests/xslt_setopt.phpt
================================================================================
---- EXPECTED OUTPUT
PHP QA®
string(95) "<html>
<head>
<title>foo</title>
</head>
<body>
<p>PHP QA®</p>
</body>
</html>
"
string(172) "<html>
<head>
<meta http-equiv="Content-Type" content="text/html;
charset=ISO-8859-1">
<title>foo</title>
</head>
<body>
<p>PHP QA®</p>
</body>
</html>
"
---- ACTUAL OUTPUT
---- FAILED
================================================================================
001- PHP QA®
001+
002- string(95) "<html>
003- <head>
004- <title>foo</title>
005- </head>
006- <body>
007- <p>PHP QA®</p>
008- </body>
009- </html>
010- "
011- string(172) "<html>
012- <head>
013- <meta http-equiv="Content-Type" content="text/html;
charset=ISO-8859-1">
014- <title>foo</title>
015- </head>
016- <body>
017- <p>PHP QA®</p>
018- </body>
019- </html>
020- "
================================================================================
================================================================================
BUILD ENVIRONMENT
================================================================================
OS:
Linux
Automake:
automake (GNU automake) 1.7.2
Written by Tom Tromey <tromey@redhat.com>.
Copyright 2002 Free Software Foundation, Inc.
This is free software; see the source for copying conditions. There is NO
warranty; not even for MERCHANTABILITY or FITNESS FOR A PARTICULAR PURPOSE.
Autoconf:
autoconf (GNU Autoconf) 2.57
Written by David J. MacKenzie and Akim Demaille.
Copyright 2002 Free Software Foundation, Inc.
This is free software; see the source for copying conditions. There is NO
warranty; not even for MERCHANTABILITY or FITNESS FOR A PARTICULAR PURPOSE.
Libtool:
ltmain.sh (GNU libtool) 1.4.3 (1.922.2.110 2002/10/23 01:39:54)
Compiler:
Reading specs from /usr/lib/gcc-lib/i486-suse-linux/3.3/specs
Configured with: ../configure --enable-threads=posix --prefix=/usr --with-local-prefix=/usr/local
--infodir=/usr/share/info --mandir=/usr/share/man --libdir=/usr/lib
--enable-languages=c,c++,f77,objc,java,ada --disable-checking --enable-libgcj
--with-gxx-include-dir=/usr/include/g++ --with-slibdir=/lib --with-system-zlib --enable-shared
--enable-__cxa_atexit i486-suse-linux
Thread model: posix
gcc version 3.3 20030226 (prerelease) (SuSE Linux)
Bison:
bison (GNU Bison) 1.75
Written by Robert Corbett and Richard Stallman.
Copyright (C) 2002 Free Software Foundation, Inc.
This is free software; see the source for copying conditions. There is NO
warranty; not even for MERCHANTABILITY or FITNESS FOR A PARTICULAR PURPOSE.
Libraries:
libstdc++.so.5 => /usr/lib/libstdc++.so.5 (0x40019000)
libm.so.6 => /lib/libm.so.6 (0x400d1000)
libgcc_s.so.1 => /lib/libgcc_s.so.1 (0x400f3000)
libc.so.6 => /lib/libc.so.6 (0x400fb000)
libcrypt.so.1 => /lib/libcrypt.so.1 (0x4022f000)
libsablot.so.0 => /usr/local/lib/libsablot.so.0 (0x40260000)
libexpat.so.0 => /usr/local/lib/libexpat.so.0 (0x4031e000)
libpdf.so.1 => /usr/local/lib/libpdf.so.1 (0x4033f000)
libresolv.so.2 => /lib/libresolv.so.2 (0x403fd000)
libdl.so.2 => /lib/libdl.so.2 (0x4040f000)
libnsl.so.1 => /lib/libnsl.so.1 (0x40413000)
libxml2.so.2 => /usr/local/lib/libxml2.so.2 (0x40428000)
libiconv.so.2 => /usr/local/lib/libiconv.so.2 (0x40521000)
/lib/ld-linux.so.2 => /lib/ld-linux.so.2 (0x40000000)
User's E-mail: yannl at istop dot com
================================================================================
PHPINFO
================================================================================
phpinfo()
PHP Version => 5.0.0-dev
System => Linux linux 2.4.20-4GB #1 Mon Mar 17 17:54:44 UTC 2003 i686
Build Date => May 24 2003 15:09:24
Configure Command => './configure' '--with-apache=../../apache_1.3.27'
'--with-mysql' '--enable-track-vars' '--with-dom'
'--enable-sockets' '--enable-wddx' '--with-xmlrpc'
'--enable-xslt' '--with-xslt-sablot=/usr/local/'
'--with-zlib-dir=/usr/local/include' '--with-expat-dir=/usr/local' ' '
'--with-pdflib=/usr/local/' '--with-freetype-dir=/usr/local/'
Server API => Command Line Interface
Virtual Directory Support => disabled
Configuration File (php.ini) Path => /usr/local/lib/php.ini
PHP API => 20030518
PHP Extension => 20020429
Zend Extension => 90021012
Debug Build => no
Thread Safety => disabled
Registered PHP Streams => php, http, ftp, compress.zlib
This program makes use of the Zend Scripting Language Engine:
Zend Engine v2.0.0-dev, Copyright (c) 1998-2003 Zend Technologies
_______________________________________________________________________
Configuration
PHP Core
Directive => Local Value => Master Value
allow_call_time_pass_reference => On => On
allow_url_fopen => On => On
always_populate_raw_post_data => Off => Off
arg_separator.input => & => &
arg_separator.output => & => &
asp_tags => Off => Off
auto_append_file => no value => no value
auto_prepend_file => no value => no value
browscap => no value => no value
default_charset => no value => no value
default_mimetype => text/html => text/html
define_syslog_variables => Off => Off
disable_classes => no value => no value
disable_functions => no value => no value
display_errors => On => On
display_startup_errors => Off => Off
doc_root => no value => no value
docref_ext => no value => no value
docref_root => no value => no value
enable_dl => On => On
error_append_string => no value => no value
error_log => no value => no value
error_prepend_string => no value => no value
error_reporting => 2039 => 2039
expose_php => On => On
extension_dir => ./ => ./
file_uploads => On => On
gpc_order => GPC => GPC
highlight.bg => #FFFFFF => #FFFFFF
highlight.comment => #FF8000 => #FF8000
highlight.default => #0000BB => #0000BB
highlight.html => #000000 => #000000
highlight.keyword => #007700 => #007700
highlight.string => #DD0000 => #DD0000
html_errors => On => On
ignore_repeated_errors => Off => Off
ignore_repeated_source => Off => Off
ignore_user_abort => Off => Off
implicit_flush => Off => Off
include_path => .:/usr/local/lib/php => .:/usr/local/lib/php
log_errors => Off => Off
log_errors_max_len => 1024 => 1024
magic_quotes_gpc => On => On
magic_quotes_runtime => Off => Off
magic_quotes_sybase => Off => Off
mail_force_extra_parameters => no value => no value
max_execution_time => 30 => 30
max_input_time => 60 => 60
open_basedir => no value => no value
output_buffering => no value => no value
output_handler => no value => no value
post_max_size => 8M => 8M
precision => 12 => 12
register_argc_argv => On => On
register_globals => Off => Off
register_long_arrays => On => On
report_memleaks => On => On
report_zend_debug => Off => Off
safe_mode => Off => Off
safe_mode_exec_dir => no value => no value
safe_mode_gid => Off => Off
safe_mode_include_dir => no value => no value
sendmail_from => me@localhost.com => me@localhost.com
sendmail_path => /usr/sbin/sendmail -t -i => /usr/sbin/sendmail -t -i
serialize_precision => 100 => 100
short_open_tag => On => On
SMTP => localhost => localhost
smtp_port => 25 => 25
sql.safe_mode => Off => Off
track_errors => Off => Off
unserialize_callback_func => no value => no value
upload_max_filesize => 2M => 2M
upload_tmp_dir => no value => no value
user_dir => no value => no value
variables_order => EGPCS => EGPCS
xmlrpc_error_number => 0 => 0
xmlrpc_errors => Off => Off
y2k_compliance => On => On
zend2.implicit_clone => no value => no value
ctype
ctype functions => enabled
domxml
DOM/XML => enabled
DOM/XML API Version => 20030407
libxml Version => 20506
HTML Support => enabled
XPath Support => enabled
XPointer Support => enabled
mysql
MySQL Support => enabled
Active Persistent Links => 0
Active Links => 0
Client API version => 3.23.49
MYSQL_MODULE_TYPE => builtin
MYSQL_SOCKET => /tmp/mysql.sock
MYSQL_INCLUDE =>
MYSQL_LIBS =>
Directive => Local Value => Master Value
mysql.allow_persistent => On => On
mysql.connect_timeout => -1 => -1
mysql.default_host => no value => no value
mysql.default_password => no value => no value
mysql.default_port => no value => no value
mysql.default_socket => no value => no value
mysql.default_user => no value => no value
mysql.max_links => Unlimited => Unlimited
mysql.max_persistent => Unlimited => Unlimited
mysql.trace_mode => Off => Off
pcre
PCRE (Perl Compatible Regular Expressions) Support => enabled
PCRE Library Version => 3.92 11-Sep-2002
pdf
PDF Support => enabled
PDFlib GmbH Version => 5.0.0
Revision => $Revision: 1.123 $
posix
Revision => $Revision: 1.55 $
session
Session Support => enabled
Registered save handlers => files user
Directive => Local Value => Master Value
session.auto_start => Off => Off
session.bug_compat_42 => On => On
session.bug_compat_warn => On => On
session.cache_expire => 180 => 180
session.cache_limiter => nocache => nocache
session.cookie_domain => no value => no value
session.cookie_lifetime => 0 => 0
session.cookie_path => / => /
session.cookie_secure => Off => Off
session.entropy_file => no value => no value
session.entropy_length => 0 => 0
session.gc_divisor => 100 => 100
session.gc_maxlifetime => 1440 => 1440
session.gc_probability => 1 => 1
session.hash_bits_per_character => 4 => 4
session.hash_function => 0 => 0
session.name => PHPSESSID => PHPSESSID
session.referer_check => no value => no value
session.save_handler => files => files
session.save_path => /tmp => /tmp
session.serialize_handler => php => php
session.use_cookies => On => On
session.use_only_cookies => Off => Off
session.use_trans_sid => Off => Off
sockets
Sockets Support => enabled
standard
Regex Library => Bundled library enabled
Dynamic Library Support => enabled
Path to sendmail => /usr/sbin/sendmail -t -i
Directive => Local Value => Master Value
assert.active => 1 => 1
assert.bail => 0 => 0
assert.callback => no value => no value
assert.quiet_eval => 0 => 0
assert.warning => 1 => 1
auto_detect_line_endings => 0 => 0
date.default_latitude => 31.7667 => 31.7667
date.default_longitude => 35.2333 => 35.2333
date.sunrise_zenith => 90.83 => 90.83
date.sunset_zenith => 90.83 => 90.83
default_socket_timeout => 60 => 60
safe_mode_allowed_env_vars => PHP_ => PHP_
safe_mode_protected_env_vars => LD_LIBRARY_PATH => LD_LIBRARY_PATH
url_rewriter.tags => a=href,area=href,frame=src,input=src,form=,fieldset= =>
a=href,area=href,frame=src,input=src,form=,fieldset=
user_agent => no value => no value
tokenizer
Tokenizer Support => enabled
wddx
WDDX Support => enabled
WDDX Session Serializer => enabled
xml
XML Support => active
XML Namespace Support => active
EXPAT Version => 1.0
xmlrpc
core library version => xmlrpc-epi v. 0.51
php extension version => 0.51
author => Dan Libby
homepage => http://xmlrpc-epi.sourceforge.net
open sourced by => Epinions.com
xslt
XSLT support => enabled
Backend => Sablotron
Sablotron Version => 0.98
Sablotron Information => Cflags: -g -O2
Libs: -L/usr/local/lib -liconv -lexpat
Prefix: /usr/local
zlib
ZLib Support => enabled
Compiled Version => 1.1.4
Linked Version => 1.1.4
Directive => Local Value => Master Value
zlib.output_compression => Off => Off
zlib.output_compression_level => -1 => -1
zlib.output_handler => no value => no value
Additional Modules
Module Name
Environment
Variable => Value
LESSKEY => /etc/lesskey.bin
LDFLAGS => -lstdc++
MANPATH => /usr/share/man:/usr/local/man:/usr/X11R6/man
INFODIR => /usr/local/info:/usr/share/info:/usr/info
NNTPSERVER => news
HOSTNAME => linux
TEST_PHP_SRCDIR => /root/sources/php/php5-200305241130
XKEYSYMDB => /usr/X11R6/lib/X11/XKeysymDB
SHELL => /bin/sh
TERM => xterm
HOST => linux
PROFILEREAD => true
MAKEFLAGS =>
HISTSIZE => 1000
SSH_CLIENT => deleted
SSH_TTY => deleted
USER => root
LS_COLORS =>
no=00:fi=00:di=01;34:ln=00;36:pi=40;33:so=01;35:do=01;35:bd=40;33;01:cd=40;33;01:or=40;31:ex=00;32:*.cmd=01;32:*.exe=01;32:*.com=01;32:*.bat=01;32:*.btm=01;32:*.dll=01;32:*.tar=00;31:*.tbz=00;31:*.tgz=00;31:*.rpm=00;31:*.deb=00;31:*.arj=00;31:*.taz=00;31:*.lzh=00;31:*.zip=00;31:*.zoo=00;31:*.z=00;31:*.Z=00;31:*.gz=00;31:*.bz2=00;31:*.tb2=00;31:*.tz2=00;31:*.tbz2=00;31:*.avi=01;35:*.bmp=01;35:*.fli=01;35:*.gif=01;35:*.jpg=01;35:*.jpeg=01;35:*.mng=01;35:*.mov=01;35:*.mpg=01;35:*.pcx=01;35:*.pbm=01;35:*.pgm=01;35:*.png=01;35:*.ppm=01;35:*.tga=01;35:*.tif=01;35:*.xbm=01;35:*.xpm=01;35:*.dl=01;35:*.gl=01;35:*.aiff=00;32:*.au=00;32:*.mid=00;32:*.mp3=00;32:*.ogg=00;32:*.voc=00;32:*.wav=00;32:
SCRIPT_FILENAME =>
XNLSPATH => /usr/X11R6/lib/X11/nls
SSH_AUTH_SOCK => deleted
HOSTTYPE => i386
MAKELEVEL => 1
PAGER => less
MFLAGS =>
MINICOM => -c on
PATH =>
/sbin:/usr/sbin:/usr/local/sbin:/root/bin:/usr/local/bin:/usr/bin:/usr/X11R6/bin:/bin:/usr/games
MAIL => /var/mail/root
CPU => i686
_ => /root/sources/php/php5-200305241130/sapi/cli/php
PWD => /root/sources/php/php5-200305241130
INPUTRC => /etc/inputrc
TEST_PHP_EXECUTABLE => /root/sources/php/php5-200305241130/sapi/cli/php
REDIRECT_STATUS =>
PATH_TRANSLATED =>
TEXINPUTS => :/root/.TeX:/usr/share/doc/.TeX:/usr/doc/.TeX
HOME => /root
SHLVL => 3
CONTENT_LENGTH =>
OSTYPE => linux
LESS_ADVANCED_PREPROCESSOR => no
no_proxy => localhost
LS_OPTIONS => -a -N --color=tty -T 0
RC_LC_COLLATE => POSIX
WINDOWMANAGER => /usr/X11R6/bin/kde
MACHTYPE => i686-suse-linux
LOGNAME => root
LESS => -M -I
QUERY_STRING =>
PRINTER => lp
RC_LANG => en_US
LC_CTYPE => en_US
SSH_CONNECTION => ::ffff:192.168.1.2 32858 ::ffff:192.168.1.3 22
LESSOPEN => lessopen.sh %s
INFOPATH => /usr/local/info:/usr/share/info:/usr/info
CONTENT_TYPE =>
CC => gcc
REQUEST_METHOD =>
LESSCLOSE => lessclose.sh %s %s
COLORTERM => 1
PHP Variables
Variable => Value
_SERVER["LESSKEY"] => /etc/lesskey.bin
_SERVER["LDFLAGS"] => -lstdc++
_SERVER["MANPATH"] => /usr/share/man:/usr/local/man:/usr/X11R6/man
_SERVER["INFODIR"] => /usr/local/info:/usr/share/info:/usr/info
_SERVER["NNTPSERVER"] => news
_SERVER["HOSTNAME"] => linux
_SERVER["TEST_PHP_SRCDIR"] => /root/sources/php/php5-200305241130
_SERVER["XKEYSYMDB"] => /usr/X11R6/lib/X11/XKeysymDB
_SERVER["SHELL"] => /bin/sh
_SERVER["TERM"] => xterm
_SERVER["HOST"] => linux
_SERVER["PROFILEREAD"] => true
_SERVER["MAKEFLAGS"] =>
_SERVER["HISTSIZE"] => 1000
_SERVER["SSH_CLIENT"] => deleted
_SERVER["SSH_TTY"] => deleted
_SERVER["USER"] => root
_SERVER["LS_COLORS"] =>
no=00:fi=00:di=01;34:ln=00;36:pi=40;33:so=01;35:do=01;35:bd=40;33;01:cd=40;33;01:or=40;31:ex=00;32:*.cmd=01;32:*.exe=01;32:*.com=01;32:*.bat=01;32:*.btm=01;32:*.dll=01;32:*.tar=00;31:*.tbz=00;31:*.tgz=00;31:*.rpm=00;31:*.deb=00;31:*.arj=00;31:*.taz=00;31:*.lzh=00;31:*.zip=00;31:*.zoo=00;31:*.z=00;31:*.Z=00;31:*.gz=00;31:*.bz2=00;31:*.tb2=00;31:*.tz2=00;31:*.tbz2=00;31:*.avi=01;35:*.bmp=01;35:*.fli=01;35:*.gif=01;35:*.jpg=01;35:*.jpeg=01;35:*.mng=01;35:*.mov=01;35:*.mpg=01;35:*.pcx=01;35:*.pbm=01;35:*.pgm=01;35:*.png=01;35:*.ppm=01;35:*.tga=01;35:*.tif=01;35:*.xbm=01;35:*.xpm=01;35:*.dl=01;35:*.gl=01;35:*.aiff=00;32:*.au=00;32:*.mid=00;32:*.mp3=00;32:*.ogg=00;32:*.voc=00;32:*.wav=00;32:
_SERVER["SCRIPT_FILENAME"] =>
_SERVER["XNLSPATH"] => /usr/X11R6/lib/X11/nls
_SERVER["SSH_AUTH_SOCK"] => deleted
_SERVER["HOSTTYPE"] => i386
_SERVER["MAKELEVEL"] => 1
_SERVER["PAGER"] => less
_SERVER["MFLAGS"] =>
_SERVER["MINICOM"] => -c on
_SERVER["PATH"] =>
/sbin:/usr/sbin:/usr/local/sbin:/root/bin:/usr/local/bin:/usr/bin:/usr/X11R6/bin:/bin:/usr/games
_SERVER["MAIL"] => /var/mail/root
_SERVER["CPU"] => i686
_SERVER["_"] => /root/sources/php/php5-200305241130/sapi/cli/php
_SERVER["PWD"] => /root/sources/php/php5-200305241130
_SERVER["INPUTRC"] => /etc/inputrc
_SERVER["TEST_PHP_EXECUTABLE"] => /root/sources/php/php5-200305241130/sapi/cli/php
_SERVER["REDIRECT_STATUS"] =>
_SERVER["PATH_TRANSLATED"] =>
_SERVER["TEXINPUTS"] => :/root/.TeX:/usr/share/doc/.TeX:/usr/doc/.TeX
_SERVER["HOME"] => /root
_SERVER["SHLVL"] => 3
_SERVER["CONTENT_LENGTH"] =>
_SERVER["OSTYPE"] => linux
_SERVER["LESS_ADVANCED_PREPROCESSOR"] => no
_SERVER["no_proxy"] => localhost
_SERVER["LS_OPTIONS"] => -a -N --color=tty -T 0
_SERVER["RC_LC_COLLATE"] => POSIX
_SERVER["WINDOWMANAGER"] => /usr/X11R6/bin/kde
_SERVER["MACHTYPE"] => i686-suse-linux
_SERVER["LOGNAME"] => root
_SERVER["LESS"] => -M -I
_SERVER["QUERY_STRING"] =>
_SERVER["PRINTER"] => lp
_SERVER["RC_LANG"] => en_US
_SERVER["LC_CTYPE"] => en_US
_SERVER["SSH_CONNECTION"] => ::ffff:192.168.1.2 32858 ::ffff:192.168.1.3 22
_SERVER["LESSOPEN"] => lessopen.sh %s
_SERVER["INFOPATH"] => /usr/local/info:/usr/share/info:/usr/info
_SERVER["CONTENT_TYPE"] =>
_SERVER["CC"] => gcc
_SERVER["REQUEST_METHOD"] =>
_SERVER["LESSCLOSE"] => lessclose.sh %s %s
_SERVER["COLORTERM"] => 1
_SERVER["PHP_SELF"] =>
_SERVER["SCRIPT_NAME"] =>
_SERVER["DOCUMENT_ROOT"] =>
_SERVER["argv"] => Array
(
)
_SERVER["argc"] => 0
_ENV["LESSKEY"] => /etc/lesskey.bin
_ENV["LDFLAGS"] => -lstdc++
_ENV["MANPATH"] => /usr/share/man:/usr/local/man:/usr/X11R6/man
_ENV["INFODIR"] => /usr/local/info:/usr/share/info:/usr/info
_ENV["NNTPSERVER"] => news
_ENV["HOSTNAME"] => linux
_ENV["TEST_PHP_SRCDIR"] => /root/sources/php/php5-200305241130
_ENV["XKEYSYMDB"] => /usr/X11R6/lib/X11/XKeysymDB
_ENV["SHELL"] => /bin/sh
_ENV["TERM"] => xterm
_ENV["HOST"] => linux
_ENV["PROFILEREAD"] => true
_ENV["MAKEFLAGS"] =>
_ENV["HISTSIZE"] => 1000
_ENV["SSH_CLIENT"] => deleted
_ENV["SSH_TTY"] => deleted
_ENV["USER"] => root
_ENV["LS_COLORS"] =>
no=00:fi=00:di=01;34:ln=00;36:pi=40;33:so=01;35:do=01;35:bd=40;33;01:cd=40;33;01:or=40;31:ex=00;32:*.cmd=01;32:*.exe=01;32:*.com=01;32:*.bat=01;32:*.btm=01;32:*.dll=01;32:*.tar=00;31:*.tbz=00;31:*.tgz=00;31:*.rpm=00;31:*.deb=00;31:*.arj=00;31:*.taz=00;31:*.lzh=00;31:*.zip=00;31:*.zoo=00;31:*.z=00;31:*.Z=00;31:*.gz=00;31:*.bz2=00;31:*.tb2=00;31:*.tz2=00;31:*.tbz2=00;31:*.avi=01;35:*.bmp=01;35:*.fli=01;35:*.gif=01;35:*.jpg=01;35:*.jpeg=01;35:*.mng=01;35:*.mov=01;35:*.mpg=01;35:*.pcx=01;35:*.pbm=01;35:*.pgm=01;35:*.png=01;35:*.ppm=01;35:*.tga=01;35:*.tif=01;35:*.xbm=01;35:*.xpm=01;35:*.dl=01;35:*.gl=01;35:*.aiff=00;32:*.au=00;32:*.mid=00;32:*.mp3=00;32:*.ogg=00;32:*.voc=00;32:*.wav=00;32:
_ENV["SCRIPT_FILENAME"] =>
_ENV["XNLSPATH"] => /usr/X11R6/lib/X11/nls
_ENV["SSH_AUTH_SOCK"] => deleted
_ENV["HOSTTYPE"] => i386
_ENV["MAKELEVEL"] => 1
_ENV["PAGER"] => less
_ENV["MFLAGS"] =>
_ENV["MINICOM"] => -c on
_ENV["PATH"] =>
/sbin:/usr/sbin:/usr/local/sbin:/root/bin:/usr/local/bin:/usr/bin:/usr/X11R6/bin:/bin:/usr/games
_ENV["MAIL"] => /var/mail/root
_ENV["CPU"] => i686
_ENV["_"] => /root/sources/php/php5-200305241130/sapi/cli/php
_ENV["PWD"] => /root/sources/php/php5-200305241130
_ENV["INPUTRC"] => /etc/inputrc
_ENV["TEST_PHP_EXECUTABLE"] => /root/sources/php/php5-200305241130/sapi/cli/php
_ENV["REDIRECT_STATUS"] =>
_ENV["PATH_TRANSLATED"] =>
_ENV["TEXINPUTS"] => :/root/.TeX:/usr/share/doc/.TeX:/usr/doc/.TeX
_ENV["HOME"] => /root
_ENV["SHLVL"] => 3
_ENV["CONTENT_LENGTH"] =>
_ENV["OSTYPE"] => linux
_ENV["LESS_ADVANCED_PREPROCESSOR"] => no
_ENV["no_proxy"] => localhost
_ENV["LS_OPTIONS"] => -a -N --color=tty -T 0
_ENV["RC_LC_COLLATE"] => POSIX
_ENV["WINDOWMANAGER"] => /usr/X11R6/bin/kde
_ENV["MACHTYPE"] => i686-suse-linux
_ENV["LOGNAME"] => root
_ENV["LESS"] => -M -I
_ENV["QUERY_STRING"] =>
_ENV["PRINTER"] => lp
_ENV["RC_LANG"] => en_US
_ENV["LC_CTYPE"] => en_US
_ENV["SSH_CONNECTION"] => ::ffff:192.168.1.2 32858 ::ffff:192.168.1.3 22
_ENV["LESSOPEN"] => lessopen.sh %s
_ENV["INFOPATH"] => /usr/local/info:/usr/share/info:/usr/info
_ENV["CONTENT_TYPE"] =>
_ENV["CC"] => gcc
_ENV["REQUEST_METHOD"] =>
_ENV["LESSCLOSE"] => lessclose.sh %s %s
_ENV["COLORTERM"] => 1
PHP License
This program is free software; you can redistribute it and/or modify
it under the terms of the PHP License as published by the PHP Group
and included in the distribution in the file: LICENSE
This program is distributed in the hope that it will be useful,
but WITHOUT ANY WARRANTY; without even the implied warranty of
MERCHANTABILITY or FITNESS FOR A PARTICULAR PURPOSE.
If you did not receive a copy of the PHP license, or have any
questions about PHP licensing, please contact license@php.net.