Test results for 4.3.3RC1 [failed]

From: Date: Mon, 30 Jun 2003 09:49:40 +0000
Subject: Test results for 4.3.3RC1 [failed]
Groups: php.qa 
Request: Send a blank email to php-qa+get-14620@lists.php.net to get a copy of this message
===================================================================== FAILED TEST SUMMARY --------------------------------------------------------------------- PostgreSQL notice function [ext/pgsql/tests/09notice.phpt] strtotime() function [ext/standard/tests/time/002.phpt] Check for mktime with out-of-range parameters [ext/standard/tests/time/003.phpt] mktime() [ext/standard/tests/time/mktime.phpt] ===================================================================== ===================================================================== TEST RESULT SUMMARY --------------------------------------------------------------------- Exts skipped : 75 Exts tested : 12 --------------------------------------------------------------------- Number of tests : 490 Tests skipped : 200 (40.8%) Tests warned : 0 ( 0.0%) Tests failed : 4 ( 0.8%) Tests passed : 286 (58.4%) --------------------------------------------------------------------- Time taken : 52 seconds ===================================================================== ================================================================================ /home/nanasess/src/php-4.3.3RC1/ext/pgsql/tests/09notice.phpt ================================================================================ ---- EXPECTED OUTPUT Notice: pg_query(): NOTICE: BEGIN: already a transaction in progress in %s on line %d NOTICE: BEGIN: already a transaction in progress pg_last_notice() is Ok ---- ACTUAL OUTPUT Notice: pg_query(): WARNING: BEGIN: already a transaction in progress in /home/nanasess/src/php-4.3.3RC1/ext/pgsql/tests/09notice.php on line 6 WARNING: BEGIN: already a transaction in progress pg_last_notice() is Ok ---- FAILED ================================================================================ 001- Notice: pg_query(): NOTICE: BEGIN: already a transaction in progress in %s on line %d 001+ Notice: pg_query(): WARNING: BEGIN: already a transaction in progress in /home/nanasess/src/php-4.3.3RC1/ext/pgsql/tests/09notice.php on line 6 002- NOTICE: BEGIN: already a transaction in progress 002+ WARNING: BEGIN: already a transaction in progress ================================================================================ ================================================================================ /home/nanasess/src/php-4.3.3RC1/ext/standard/tests/time/002.phpt ================================================================================ ---- EXPECTED OUTPUT 1999-10-13 00:00:00 1999-10-13 00:00:00 2000-01-19 00:00:00 2000-01-19 00:00:00 2001-12-21 00:00:00 2001-12-21 00:00:00 2001-12-21 12:16:00 2001-12-21 12:16:00 1969-12-31 23:59:59 2001-10-22 21:19:58 2001-10-22 23:19:58 2001-10-22 23:32:58 2001-10-22 19:19:58 2001-10-22 19:06:58 1999-10-13 00:00:00 1999-10-13 00:00:00 2000-01-19 00:00:00 2000-01-19 00:00:00 2001-12-21 00:00:00 2001-12-21 00:00:00 2001-12-21 12:16:00 2001-12-21 12:16:00 1969-12-31 18:59:59 2001-10-22 21:19:58 2001-10-22 19:19:58 2001-10-22 19:32:58 2001-10-22 15:19:58 2001-10-22 15:06:58 ---- ACTUAL OUTPUT 1999-10-13 00:00:00 1999-10-13 00:00:00 2000-01-19 00:00:00 2000-01-19 00:00:00 2001-12-21 00:00:00 2001-12-21 00:00:00 2001-12-21 12:16:00 2001-12-21 12:16:00 1969-12-31 23:59:59 2001-10-22 21:19:58 2001-10-22 23:19:58 2001-10-22 23:32:58 2001-10-22 19:19:58 2001-10-22 19:06:58 1999-10-13 00:00:00 1999-10-13 00:00:00 2000-01-19 00:00:00 2000-01-19 00:00:00 2001-12-21 00:00:00 2001-12-21 00:00:00 2001-12-21 12:16:00 2001-12-21 12:16:00 1969-12-31 23:59:59 2001-10-22 21:19:58 2001-10-22 23:19:58 2001-10-22 23:32:58 2001-10-22 19:19:58 2001-10-22 19:06:58 ---- FAILED ================================================================================ 023- 1969-12-31 18:59:59 023+ 1969-12-31 23:59:59 025- 2001-10-22 19:19:58 025+ 2001-10-22 23:19:58 026- 2001-10-22 19:32:58 026+ 2001-10-22 23:32:58 027- 2001-10-22 15:19:58 027+ 2001-10-22 19:19:58 028- 2001-10-22 15:06:58 028+ 2001-10-22 19:06:58 ================================================================================ ================================================================================ /home/nanasess/src/php-4.3.3RC1/ext/standard/tests/time/003.phpt ================================================================================ ---- EXPECTED OUTPUT 2000-02-29 2000-02-28 2000-02-29 2001-02-28 2001-03-01 1999-11-30 2000-05-29 12:00:00 2000-05-29 13:00:00 2000-05-29 12:00:00 2000-01-31 12:00:00 2000-01-31 12:00:00 2000-01-31 11:00:00 2000-04-29 12:00:00 2000-04-29 13:00:00 2000-04-29 12:00:00 ---- ACTUAL OUTPUT 2000-02-29 2000-02-28 2000-02-29 2001-02-28 2001-03-01 1999-11-30 2000-05-29 12:00:00 2000-05-29 07:00:00 2000-05-29 12:00:00 2000-01-31 12:00:00 2000-01-31 06:00:00 2000-01-31 11:00:00 2000-04-29 12:00:00 2000-04-29 07:00:00 2000-04-29 12:00:00 ---- FAILED ================================================================================ 008- 2000-05-29 13:00:00 008+ 2000-05-29 07:00:00 011- 2000-01-31 12:00:00 011+ 2000-01-31 06:00:00 014- 2000-04-29 13:00:00 014+ 2000-04-29 07:00:00 ================================================================================ ================================================================================ /home/nanasess/src/php-4.3.3RC1/ext/standard/tests/time/mktime.phpt ================================================================================ ---- EXPECTED OUTPUT int(1009843200) int(1009843200) int(1009843200) int(1009843200) int(1025481600) int(1025481600) int(1025481600) int(1025481600) int(1009839600) int(1009839600) int(1009839600) int(1009836000) int(1025474400) int(1025474400) int(1025478000) int(1025474400) ---- ACTUAL OUTPUT int(1009843200) int(1009843200) int(1009843200) int(-3662) int(1025481600) int(1025481600) int(1025481600) int(-3662) int(1009839600) int(1009839600) int(1009839600) int(1009857600) int(1025474400) int(1025474400) int(1025456400) int(1025474400) ---- FAILED ================================================================================ 004- int(1009843200) 004+ int(-3662) 008- int(1025481600) 008+ int(-3662) 012- int(1009836000) 012+ int(1009857600) 015- int(1025478000) 015+ int(1025456400) ================================================================================ ================================================================================ BUILD ENVIRONMENT ================================================================================ OS: FreeBSD - FreeBSD az.loop-az.jp 4.8-STABLE FreeBSD 4.8-STABLE #0: Thu May i386 Automake: automake (GNU automake) 1.4-p5 Copyright (C) 1999, 2001 Free Software Foundation, Inc. This is free software; see the source for copying conditions. There is NO warranty; not even for MERCHANTABILITY or FITNESS FOR A PARTICULAR PURPOSE. Written by Tom Tromey <tromey@cygnus.com> Autoconf: autoconf (GNU Autoconf) 2.53 Written by David J. MacKenzie and Akim Demaille. Copyright 2002 Free Software Foundation, Inc. This is free software; see the source for copying conditions. There is NO warranty; not even for MERCHANTABILITY or FITNESS FOR A PARTICULAR PURPOSE. Libtool: ltmain.sh (GNU libtool) 1.4.3 (1.922.2.110 2002/10/23 01:39:54) Compiler: Using builtin specs. gcc version 2.95.4 20020320 [FreeBSD] Bison: bison (GNU Bison) 1.75 Written by Robert Corbett and Richard Stallman. Copyright (C) 2002 Free Software Foundation, Inc. This is free software; see the source for copying conditions. There is NO warranty; not even for MERCHANTABILITY or FITNESS FOR A PARTICULAR PURPOSE. Libraries: /home/nanasess/src/php-4.3.3RC1/sapi/cli/php: libcrypt.so.2 => /usr/lib/libcrypt.so.2 (0x281b6000) libpq.so.3 => /usr/local/lib/libpq.so.3 (0x281cf000) libfreetype.so.9 => /usr/local/lib/libfreetype.so.9 (0x281e3000) libX11.so.6 => /usr/X11R6/lib/libX11.so.6 (0x28233000) libXpm.so.4 => /usr/X11R6/lib/libXpm.so.4 (0x282ef000) libpng.so.5 => /usr/local/lib/libpng.so.5 (0x282fd000) libz.so.2 => /usr/lib/libz.so.2 (0x28320000) libjpeg.so.9 => /usr/local/lib/libjpeg.so.9 (0x2832d000) libm.so.2 => /usr/lib/libm.so.2 (0x2834b000) libc.so.4 => /usr/lib/libc.so.4 (0x28366000) libintl.so.4 => /usr/local/lib/libintl.so.4 (0x283ff000) libssl.so.3 => /usr/lib/libssl.so.3 (0x28407000) libcrypto.so.3 => /usr/lib/libcrypto.so.3 (0x28436000) libXThrStub.so.6 => /usr/X11R6/lib/libXThrStub.so.6 (0x2852d000) libXext.so.6 => /usr/X11R6/lib/libXext.so.6 (0x2852f000) libiconv.so.3 => /usr/local/lib/libiconv.so.3 (0x2853d000) User's E-mail: nanasess at fsm dot ne dot jp ================================================================================ PHPINFO ================================================================================ phpinfo() PHP Version => 4.3.3RC1 System => FreeBSD az.loop-az.jp 4.8-STABLE FreeBSD 4.8-STABLE #0: Thu May i386 Build Date => Jun 30 2003 18:40:39 Configure Command => './configure' '--with-apxs=/usr/local/sbin/apxs' '--with-gd' '--enable-gd-native-ttf' '--with-freetype-dir=/usr/local' '--with-jpeg-dir=/usr/local' 'with-png-dir=/usr/local' '--with-xpm-dir=/usr/local' '--with-pcre-regex=yes' '--enable-posix' '--with-pgsql=/usr/local' '--with-zlib=yes' '--prefix=/usr/local' Server API => Command Line Interface Virtual Directory Support => disabled Configuration File (php.ini) Path => /usr/local/lib PHP API => 20020918 PHP Extension => 20020429 Zend Extension => 20021010 Debug Build => no Thread Safety => disabled Registered PHP Streams => php, http, ftp, compress.zlib This program makes use of the Zend Scripting Language Engine: Zend Engine v1.3.0, Copyright (c) 1998-2003 Zend Technologies _______________________________________________________________________ Configuration PHP Core Directive => Local Value => Master Value allow_call_time_pass_reference => On => On allow_url_fopen => On => On always_populate_raw_post_data => Off => Off arg_separator.input => & => & arg_separator.output => & => & asp_tags => Off => Off auto_append_file => no value => no value auto_prepend_file => no value => no value browscap => no value => no value default_charset => no value => no value default_mimetype => text/html => text/html define_syslog_variables => Off => Off disable_classes => no value => no value disable_functions => no value => no value display_errors => On => On display_startup_errors => Off => Off doc_root => no value => no value docref_ext => no value => no value docref_root => no value => no value enable_dl => On => On error_append_string => no value => no value error_log => no value => no value error_prepend_string => no value => no value error_reporting => no value => no value expose_php => On => On extension_dir => /usr/local/lib/php/extensions/no-debug-non-zts-20020429 => /usr/local/lib/php/extensions/no-debug-non-zts-20020429 file_uploads => On => On gpc_order => GPC => GPC highlight.bg => #FFFFFF => #FFFFFF highlight.comment => #FF8000 => #FF8000 highlight.default => #0000BB => #0000BB highlight.html => #000000 => #000000 highlight.keyword => #007700 => #007700 highlight.string => #DD0000 => #DD0000 html_errors => On => On ignore_repeated_errors => Off => Off ignore_repeated_source => Off => Off ignore_user_abort => Off => Off implicit_flush => Off => Off include_path => .:/usr/local/lib/php => .:/usr/local/lib/php log_errors => Off => Off log_errors_max_len => 1024 => 1024 magic_quotes_gpc => On => On magic_quotes_runtime => Off => Off magic_quotes_sybase => Off => Off max_execution_time => 30 => 30 max_input_time => -1 => -1 open_basedir => no value => no value output_buffering => 0 => 0 output_handler => no value => no value post_max_size => 8M => 8M precision => 14 => 14 register_argc_argv => On => On register_globals => Off => Off report_memleaks => On => On safe_mode => Off => Off safe_mode_exec_dir => /usr/local/php/bin => /usr/local/php/bin safe_mode_gid => Off => Off safe_mode_include_dir => no value => no value sendmail_from => no value => no value sendmail_path => /usr/sbin/sendmail -t -i => /usr/sbin/sendmail -t -i serialize_precision => 100 => 100 short_open_tag => On => On SMTP => localhost => localhost smtp_port => 25 => 25 sql.safe_mode => Off => Off track_errors => Off => Off unserialize_callback_func => no value => no value upload_max_filesize => 2M => 2M upload_tmp_dir => no value => no value user_dir => no value => no value variables_order => no value => no value xmlrpc_error_number => 0 => 0 xmlrpc_errors => Off => Off y2k_compliance => On => On ctype ctype functions => enabled gd GD Support => enabled GD Version => bundled (2.0.15 compatible) FreeType Support => enabled FreeType Linkage => with freetype GIF Read Support => enabled JPG Support => enabled PNG Support => enabled WBMP Support => enabled XBM Support => enabled mysql MySQL Support => enabled Active Persistent Links => 0 Active Links => 0 Client API version => 3.23.49 MYSQL_MODULE_TYPE => builtin MYSQL_SOCKET => /tmp/mysql.sock MYSQL_INCLUDE => MYSQL_LIBS => Directive => Local Value => Master Value mysql.allow_persistent => On => On mysql.connect_timeout => 60 => 60 mysql.default_host => no value => no value mysql.default_password => no value => no value mysql.default_port => no value => no value mysql.default_socket => no value => no value mysql.default_user => no value => no value mysql.max_links => Unlimited => Unlimited mysql.max_persistent => Unlimited => Unlimited mysql.trace_mode => Off => Off overload User-Space Object Overloading Support => enabled pcre PCRE (Perl Compatible Regular Expressions) Support => enabled PCRE Library Version => 3.92 11-Sep-2002 pgsql PostgreSQL Support => enabled PostgreSQL(libpq) Version => 7.3.3 Multibyte character support => enabled SSL support => enabled Active Persistent Links => 0 Active Links => 0 Directive => Local Value => Master Value pgsql.allow_persistent => On => On pgsql.auto_reset_persistent => Off => Off pgsql.ignore_notice => Off => Off pgsql.log_notice => Off => Off pgsql.max_links => Unlimited => Unlimited pgsql.max_persistent => Unlimited => Unlimited posix Revision => $Revision: 1.51.2.2 $ session Session Support => enabled Registered save handlers => files user Directive => Local Value => Master Value session.auto_start => Off => Off session.bug_compat_42 => On => On session.bug_compat_warn => On => On session.cache_expire => 180 => 180 session.cache_limiter => nocache => nocache session.cookie_domain => no value => no value session.cookie_lifetime => 0 => 0 session.cookie_path => / => / session.cookie_secure => Off => Off session.entropy_file => no value => no value session.entropy_length => 0 => 0 session.gc_divisor => 100 => 100 session.gc_maxlifetime => 1440 => 1440 session.gc_probability => 1 => 1 session.name => PHPSESSID => PHPSESSID session.referer_check => no value => no value session.save_handler => files => files session.save_path => /tmp => /tmp session.serialize_handler => php => php session.use_cookies => On => On session.use_only_cookies => Off => Off session.use_trans_sid => Off => Off standard Regex Library => Bundled library enabled Dynamic Library Support => enabled Path to sendmail => /usr/sbin/sendmail -t -i Directive => Local Value => Master Value assert.active => 1 => 1 assert.bail => 0 => 0 assert.callback => no value => no value assert.quiet_eval => 0 => 0 assert.warning => 1 => 1 auto_detect_line_endings => 0 => 0 default_socket_timeout => 60 => 60 safe_mode_allowed_env_vars => PHP_ => PHP_ safe_mode_protected_env_vars => LD_LIBRARY_PATH => LD_LIBRARY_PATH url_rewriter.tags => a=href,area=href,frame=src,form=,fieldset= => a=href,area=href,frame=src,form=,fieldset= user_agent => no value => no value tokenizer Tokenizer Support => enabled xml XML Support => active XML Namespace Support => active EXPAT Version => 1.95.2 zlib ZLib Support => enabled Compiled Version => 1.1.4 Linked Version => 1.1.4 Directive => Local Value => Master Value zlib.output_compression => Off => Off zlib.output_compression_level => -1 => -1 zlib.output_handler => no value => no value Additional Modules Module Name Environment Variable => Value CONTENT_TYPE => USER => nanasess SSH_CLIENT => 192.168.0.200 65425 22 MACHTYPE => i386 POSTGRES_HOME => /usr/local/pgsql CVS_RSH => ssh MAIL => /var/mail/nanasess VENDOR => intel SHLVL => 2 BROWSER => w3m LD_LIBRARY_PATH => /usr/local/pgsql/lib:/usr/local/pgsql/lib QUERY_STRING => HOME => /home/nanasess TEST_PHP_SRCDIR => /home/nanasess/src/php-4.3.3RC1 SSH_TTY => /dev/ttyp3 PGLIB => /usr/local/pgsql/lib TOMCAT_HOME => /usr/local/jakarta-tomcat4.1 PAGER => lv CONTENT_LENGTH => SCRIPT_FILENAME => PATH_TRANSLATED => GROUP => nanasess JSERVER => 192.168.0.10 LOGNAME => nanasess TEST_PHP_EXECUTABLE => /home/nanasess/src/php-4.3.3RC1/sapi/cli/php WWW_HOME => http://az.loop-az.jp/~kouichi/ TERM => vt100 BLOCKSIZE => K PATH => /sbin:/bin:/usr/sbin:/usr/bin:/usr/games:/usr/local/sbin:/usr/local/bin:/usr/X11R6/bin:/usr/local/jdk1.4.1/bin:/home/nanasess/bin REMOTEHOST => apple2.loop-az.jp LANG => C JLESSCHARSET => japanese-euc CANNASERVER => 192.168.0.10 XMODIFIERS => @im=_XWNMO SHELL => /bin/tcsh HOST => az.loop-az.jp REDIRECT_STATUS => REQUEST_METHOD => CLASSPATH => /usr/local/share/postgresql/java/postgresql.jar OSTYPE => FreeBSD PWD => /home/nanasess/src/php-4.3.3RC1 JAVA_HOME => /usr/local/jdk1.4.1 CVSROOT => nanasess@az.loop-az.jp:/home/cvs SSH_CONNECTION => 192.168.0.200 65425 192.168.0.10 22 FTP_PASSIVE_MODE => YES PGDATA => /usr/local/pgsql/data CC => gcc HOSTTYPE => FreeBSD MANPATH => /usr/share/man:/usr/X11R6/man:/usr/local/man PHP Variables Variable => Value _SERVER["CONTENT_TYPE"] => _SERVER["USER"] => nanasess _SERVER["SSH_CLIENT"] => 192.168.0.200 65425 22 _SERVER["MACHTYPE"] => i386 _SERVER["POSTGRES_HOME"] => /usr/local/pgsql _SERVER["CVS_RSH"] => ssh _SERVER["MAIL"] => /var/mail/nanasess _SERVER["VENDOR"] => intel _SERVER["SHLVL"] => 2 _SERVER["BROWSER"] => w3m _SERVER["LD_LIBRARY_PATH"] => /usr/local/pgsql/lib:/usr/local/pgsql/lib _SERVER["QUERY_STRING"] => _SERVER["HOME"] => /home/nanasess _SERVER["TEST_PHP_SRCDIR"] => /home/nanasess/src/php-4.3.3RC1 _SERVER["SSH_TTY"] => /dev/ttyp3 _SERVER["PGLIB"] => /usr/local/pgsql/lib _SERVER["TOMCAT_HOME"] => /usr/local/jakarta-tomcat4.1 _SERVER["PAGER"] => lv _SERVER["CONTENT_LENGTH"] => _SERVER["SCRIPT_FILENAME"] => _SERVER["PATH_TRANSLATED"] => _SERVER["GROUP"] => nanasess _SERVER["JSERVER"] => 192.168.0.10 _SERVER["LOGNAME"] => nanasess _SERVER["TEST_PHP_EXECUTABLE"] => /home/nanasess/src/php-4.3.3RC1/sapi/cli/php _SERVER["WWW_HOME"] => http://az.loop-az.jp/~kouichi/ _SERVER["TERM"] => vt100 _SERVER["BLOCKSIZE"] => K _SERVER["PATH"] => /sbin:/bin:/usr/sbin:/usr/bin:/usr/games:/usr/local/sbin:/usr/local/bin:/usr/X11R6/bin:/usr/local/jdk1.4.1/bin:/home/nanasess/bin _SERVER["REMOTEHOST"] => apple2.loop-az.jp _SERVER["LANG"] => C _SERVER["JLESSCHARSET"] => japanese-euc _SERVER["CANNASERVER"] => 192.168.0.10 _SERVER["XMODIFIERS"] => @im=_XWNMO _SERVER["SHELL"] => /bin/tcsh _SERVER["HOST"] => az.loop-az.jp _SERVER["REDIRECT_STATUS"] => _SERVER["REQUEST_METHOD"] => _SERVER["CLASSPATH"] => /usr/local/share/postgresql/java/postgresql.jar _SERVER["OSTYPE"] => FreeBSD _SERVER["PWD"] => /home/nanasess/src/php-4.3.3RC1 _SERVER["JAVA_HOME"] => /usr/local/jdk1.4.1 _SERVER["CVSROOT"] => nanasess@az.loop-az.jp:/home/cvs _SERVER["SSH_CONNECTION"] => 192.168.0.200 65425 192.168.0.10 22 _SERVER["FTP_PASSIVE_MODE"] => YES _SERVER["PGDATA"] => /usr/local/pgsql/data _SERVER["CC"] => gcc _SERVER["HOSTTYPE"] => FreeBSD _SERVER["MANPATH"] => /usr/share/man:/usr/X11R6/man:/usr/local/man _SERVER["PHP_SELF"] => _SERVER["SCRIPT_NAME"] => _SERVER["DOCUMENT_ROOT"] => _SERVER["argv"] => Array ( ) _SERVER["argc"] => 0 _ENV["CONTENT_TYPE"] => _ENV["USER"] => nanasess _ENV["SSH_CLIENT"] => 192.168.0.200 65425 22 _ENV["MACHTYPE"] => i386 _ENV["POSTGRES_HOME"] => /usr/local/pgsql _ENV["CVS_RSH"] => ssh _ENV["MAIL"] => /var/mail/nanasess _ENV["VENDOR"] => intel _ENV["SHLVL"] => 2 _ENV["BROWSER"] => w3m _ENV["LD_LIBRARY_PATH"] => /usr/local/pgsql/lib:/usr/local/pgsql/lib _ENV["QUERY_STRING"] => _ENV["HOME"] => /home/nanasess _ENV["TEST_PHP_SRCDIR"] => /home/nanasess/src/php-4.3.3RC1 _ENV["SSH_TTY"] => /dev/ttyp3 _ENV["PGLIB"] => /usr/local/pgsql/lib _ENV["TOMCAT_HOME"] => /usr/local/jakarta-tomcat4.1 _ENV["PAGER"] => lv _ENV["CONTENT_LENGTH"] => _ENV["SCRIPT_FILENAME"] => _ENV["PATH_TRANSLATED"] => _ENV["GROUP"] => nanasess _ENV["JSERVER"] => 192.168.0.10 _ENV["LOGNAME"] => nanasess _ENV["TEST_PHP_EXECUTABLE"] => /home/nanasess/src/php-4.3.3RC1/sapi/cli/php _ENV["WWW_HOME"] => http://az.loop-az.jp/~kouichi/ _ENV["TERM"] => vt100 _ENV["BLOCKSIZE"] => K _ENV["PATH"] => /sbin:/bin:/usr/sbin:/usr/bin:/usr/games:/usr/local/sbin:/usr/local/bin:/usr/X11R6/bin:/usr/local/jdk1.4.1/bin:/home/nanasess/bin _ENV["REMOTEHOST"] => apple2.loop-az.jp _ENV["LANG"] => C _ENV["JLESSCHARSET"] => japanese-euc _ENV["CANNASERVER"] => 192.168.0.10 _ENV["XMODIFIERS"] => @im=_XWNMO _ENV["SHELL"] => /bin/tcsh _ENV["HOST"] => az.loop-az.jp _ENV["REDIRECT_STATUS"] => _ENV["REQUEST_METHOD"] => _ENV["CLASSPATH"] => /usr/local/share/postgresql/java/postgresql.jar _ENV["OSTYPE"] => FreeBSD _ENV["PWD"] => /home/nanasess/src/php-4.3.3RC1 _ENV["JAVA_HOME"] => /usr/local/jdk1.4.1 _ENV["CVSROOT"] => nanasess@az.loop-az.jp:/home/cvs _ENV["SSH_CONNECTION"] => 192.168.0.200 65425 192.168.0.10 22 _ENV["FTP_PASSIVE_MODE"] => YES _ENV["PGDATA"] => /usr/local/pgsql/data _ENV["CC"] => gcc _ENV["HOSTTYPE"] => FreeBSD _ENV["MANPATH"] => /usr/share/man:/usr/X11R6/man:/usr/local/man PHP License This program is free software; you can redistribute it and/or modify it under the terms of the PHP License as published by the PHP Group and included in the distribution in the file: LICENSE This program is distributed in the hope that it will be useful, but WITHOUT ANY WARRANTY; without even the implied warranty of MERCHANTABILITY or FITNESS FOR A PARTICULAR PURPOSE. If you did not receive a copy of the PHP license, or have any questions about PHP licensing, please contact license@php.net.

« previous php.qa (#14620) next »