Test results for 5.0.0b1 [failed]
| From: | noreply@php.net | Date: | Mon, 30 Jun 2003 13:31:26 +0000 |
| Subject: | Test results for 5.0.0b1 [failed] | ||
| Groups: | php.qa | ||
| Request: | Send a blank email to php-qa+get-14631@lists.php.net to get a copy of this message | ||
=====================================================================
FAILED TEST SUMMARY
---------------------------------------------------------------------
Methods via variable name, bug #20120 [tests/classes/bug20120.phpt]
Bug #22367 (weird zval allocation problem) [tests/lang/bug22367.phpt]
Bug #23624 (foreach leaves current array key as null) [tests/lang/bug23624.phpt]
aggregating everything [ext/standard/tests/aggregation/aggregate.phpt]
aggregating all methods [ext/standard/tests/aggregation/aggregate_methods.phpt]
aggregating methods specified in the list
[ext/standard/tests/aggregation/aggregate_methods_by_list.phpt]
aggregating methods matching regular expression
[ext/standard/tests/aggregation/aggregate_methods_by_regexp.phpt]
aggregating all default properties [ext/standard/tests/aggregation/aggregate_properties.phpt]
aggregating default properties specified in the list
[ext/standard/tests/aggregation/aggregate_properties_by_list.phpt]
retrieving aggregation info [ext/standard/tests/aggregation/aggregation_info.phpt]
deaggreating [ext/standard/tests/aggregation/deaggregate.phpt]
date_sunrise() and date_sunset() functions [ext/standard/tests/general_functions/sunfuncts.phpt]
=====================================================================
=====================================================================
TEST RESULT SUMMARY
---------------------------------------------------------------------
Exts skipped : 70
Exts tested : 12
---------------------------------------------------------------------
Number of tests : 631
Tests skipped : 271 (42.9%)
Tests warned : 0 ( 0.0%)
Tests failed : 12 ( 1.9%)
Tests passed : 348 (55.2%)
---------------------------------------------------------------------
Time taken : 82 seconds
=====================================================================
=====================================================================
FAILED TEST SUMMARY
---------------------------------------------------------------------
Methods via variable name, bug #20120 [tests/classes/bug20120.phpt]
Bug #22367 (weird zval allocation problem) [tests/lang/bug22367.phpt]
Bug #23624 (foreach leaves current array key as null) [tests/lang/bug23624.phpt]
aggregating everything [ext/standard/tests/aggregation/aggregate.phpt]
aggregating all methods [ext/standard/tests/aggregation/aggregate_methods.phpt]
aggregating methods specified in the list
[ext/standard/tests/aggregation/aggregate_methods_by_list.phpt]
aggregating methods matching regular expression
[ext/standard/tests/aggregation/aggregate_methods_by_regexp.phpt]
aggregating all default properties [ext/standard/tests/aggregation/aggregate_properties.phpt]
aggregating default properties specified in the list
[ext/standard/tests/aggregation/aggregate_properties_by_list.phpt]
retrieving aggregation info [ext/standard/tests/aggregation/aggregation_info.phpt]
deaggreating [ext/standard/tests/aggregation/deaggregate.phpt]
date_sunrise() and date_sunset() functions [ext/standard/tests/general_functions/sunfuncts.phpt]
=====================================================================
================================================================================
/home/oden/RPM/BUILD/php-5.0.0b1/tests/classes/bug20120.phpt
================================================================================
---- EXPECTED OUTPUT
test
test2
test2
---- ACTUAL OUTPUT
Parse error: parse error in /home/oden/RPM/BUILD/php-5.0.0b1/tests/classes/bug20120.php on line 11
---- FAILED
================================================================================
001- test
001+ Parse error: parse error in /home/oden/RPM/BUILD/php-5.0.0b1/tests/classes/bug20120.php on line
11
002- test2
003- test2
================================================================================
================================================================================
/home/oden/RPM/BUILD/php-5.0.0b1/tests/lang/bug22367.phpt
================================================================================
---- EXPECTED OUTPUT
int(5)
bool(false)
bool(false)
array(5) {
[0]=>
int(0)
[1]=>
int(1)
[2]=>
int(2)
[3]=>
int(3)
[4]=>
int(4)
}
array(5) {
[0]=>
int(0)
[1]=>
int(1)
[2]=>
int(2)
[3]=>
int(3)
[4]=>
int(4)
}
int(2)
bool(true)
bool(true)
array(5) {
[0]=>
int(0)
[1]=>
int(1)
[2]=>
int(2)
[3]=>
int(3)
[4]=>
int(4)
}
array(5) {
[0]=>
int(0)
[1]=>
int(1)
[2]=>
int(2)
[3]=>
int(3)
[4]=>
int(4)
}
---- ACTUAL OUTPUT
int(5)
bool(false)
bool(false)
array(5) {
[0]=>
int(4)
[1]=>
int(4)
[2]=>
int(4)
[3]=>
int(4)
[4]=>
int(4)
}
array(5) {
[0]=>
int(0)
[1]=>
int(1)
[2]=>
int(2)
[3]=>
int(3)
[4]=>
int(4)
}
int(2)
bool(true)
bool(true)
array(5) {
[0]=>
int(0)
[1]=>
int(1)
[2]=>
int(2)
[3]=>
int(3)
[4]=>
int(4)
}
array(5) {
[0]=>
int(0)
[1]=>
int(1)
[2]=>
&int(2)
[3]=>
int(3)
[4]=>
int(4)
}
---- FAILED
================================================================================
006- int(0)
006+ int(4)
008- int(1)
008+ int(4)
010- int(2)
010+ int(4)
012- int(3)
012+ int(4)
049- int(2)
049+ &int(2)
================================================================================
================================================================================
/home/oden/RPM/BUILD/php-5.0.0b1/tests/lang/bug23624.phpt
================================================================================
---- EXPECTED OUTPUT
string(3) "one"
string(5) "three"
---- ACTUAL OUTPUT
string(3) "one"
bool(false)
---- FAILED
================================================================================
002- string(5) "three"
002+ bool(false)
================================================================================
================================================================================
/home/oden/RPM/BUILD/php-5.0.0b1/ext/standard/tests/aggregation/aggregate.phpt
================================================================================
---- EXPECTED OUTPUT
I'm alive!
I'm helping!
I'm aggregating!
****
---- ACTUAL OUTPUT
I'm alive!
Fatal error: Call to undefined function: aggregate() in
/home/oden/RPM/BUILD/php-5.0.0b1/ext/standard/tests/aggregation/aggregate.php on line 6
---- FAILED
================================================================================
002- I'm helping!
002+
003- I'm aggregating!
003+ Fatal error: Call to undefined function: aggregate() in
/home/oden/RPM/BUILD/php-5.0.0b1/ext/standard/tests/aggregation/aggregate.php on line 6
004- ****
================================================================================
================================================================================
/home/oden/RPM/BUILD/php-5.0.0b1/ext/standard/tests/aggregation/aggregate_methods.phpt
================================================================================
---- EXPECTED OUTPUT
I'm alive!
mixing
100
simple,mix_it
simple_prop
mixing
---- ACTUAL OUTPUT
I'm alive!
Fatal error: Call to undefined function: aggregate_methods() in
/home/oden/RPM/BUILD/php-5.0.0b1/ext/standard/tests/aggregation/aggregate_methods.php on line 5
---- FAILED
================================================================================
002- mixing
002+
003- 100
003+ Fatal error: Call to undefined function: aggregate_methods() in
/home/oden/RPM/BUILD/php-5.0.0b1/ext/standard/tests/aggregation/aggregate_methods.php on line 5
004- simple,mix_it
005- simple_prop
006- mixing
================================================================================
================================================================================
/home/oden/RPM/BUILD/php-5.0.0b1/ext/standard/tests/aggregation/aggregate_methods_by_list.phpt
================================================================================
---- EXPECTED OUTPUT
I'm alive!
simple,just_another_method
I'm alive!
simple,do_this,do_that
yep, that's me
---- ACTUAL OUTPUT
I'm alive!
Fatal error: Call to undefined function: aggregate_methods_by_list() in
/home/oden/RPM/BUILD/php-5.0.0b1/ext/standard/tests/aggregation/aggregate_methods_by_list.php on
line 5
---- FAILED
================================================================================
002- simple,just_another_method
002+
003- I'm alive!
003+ Fatal error: Call to undefined function: aggregate_methods_by_list() in
/home/oden/RPM/BUILD/php-5.0.0b1/ext/standard/tests/aggregation/aggregate_methods_by_list.php on
line 5
004- simple,do_this,do_that
005- yep, that's me
================================================================================
================================================================================
/home/oden/RPM/BUILD/php-5.0.0b1/ext/standard/tests/aggregation/aggregate_methods_by_regexp.phpt
================================================================================
---- EXPECTED OUTPUT
I'm alive!
simple,do_this,do_that
I'm alive!
simple,just_another_method
---- ACTUAL OUTPUT
I'm alive!
Fatal error: Call to undefined function: aggregate_methods_by_regexp() in
/home/oden/RPM/BUILD/php-5.0.0b1/ext/standard/tests/aggregation/aggregate_methods_by_regexp.php on
line 5
---- FAILED
================================================================================
002- simple,do_this,do_that
002+
003- I'm alive!
003+ Fatal error: Call to undefined function: aggregate_methods_by_regexp() in
/home/oden/RPM/BUILD/php-5.0.0b1/ext/standard/tests/aggregation/aggregate_methods_by_regexp.php on
line 5
004- simple,just_another_method
================================================================================
================================================================================
/home/oden/RPM/BUILD/php-5.0.0b1/ext/standard/tests/aggregation/aggregate_properties.phpt
================================================================================
---- EXPECTED OUTPUT
I'm alive!
simple_prop,mix
100
simple
---- ACTUAL OUTPUT
I'm alive!
Fatal error: Call to undefined function: aggregate_properties() in
/home/oden/RPM/BUILD/php-5.0.0b1/ext/standard/tests/aggregation/aggregate_properties.php on line 5
---- FAILED
================================================================================
002- simple_prop,mix
002+
003- 100
003+ Fatal error: Call to undefined function: aggregate_properties() in
/home/oden/RPM/BUILD/php-5.0.0b1/ext/standard/tests/aggregation/aggregate_properties.php on line 5
004- simple
================================================================================
================================================================================
/home/oden/RPM/BUILD/php-5.0.0b1/ext/standard/tests/aggregation/aggregate_properties_by_list.phpt
================================================================================
---- EXPECTED OUTPUT
I'm alive!
simple_prop,my_prop,our_prop
I'm alive!
simple_prop,your_prop,our_prop
---- ACTUAL OUTPUT
I'm alive!
Fatal error: Call to undefined function: aggregate_properties_by_list() in
/home/oden/RPM/BUILD/php-5.0.0b1/ext/standard/tests/aggregation/aggregate_properties_by_list.php on
line 5
---- FAILED
================================================================================
002- simple_prop,my_prop,our_prop
002+
003- I'm alive!
003+ Fatal error: Call to undefined function: aggregate_properties_by_list() in
/home/oden/RPM/BUILD/php-5.0.0b1/ext/standard/tests/aggregation/aggregate_properties_by_list.php on
line 5
004- simple_prop,your_prop,our_prop
================================================================================
================================================================================
/home/oden/RPM/BUILD/php-5.0.0b1/ext/standard/tests/aggregation/aggregation_info.phpt
================================================================================
---- EXPECTED OUTPUT
I'm alive!
Array
(
[mixin] => Array
(
[methods] => Array
(
[0] => mix_it
)
[properties] => Array
(
[0] => mix
)
)
)
---- ACTUAL OUTPUT
I'm alive!
Fatal error: Call to undefined function: aggregate() in
/home/oden/RPM/BUILD/php-5.0.0b1/ext/standard/tests/aggregation/aggregation_info.php on line 5
---- FAILED
================================================================================
002- Array
002+
003- (
003+ Fatal error: Call to undefined function: aggregate() in
/home/oden/RPM/BUILD/php-5.0.0b1/ext/standard/tests/aggregation/aggregation_info.php on line 5
004- [mixin] => Array
005- (
006- [methods] => Array
007- (
008- [0] => mix_it
009- )
010-
011- [properties] => Array
012- (
013- [0] => mix
014- )
015-
016- )
017-
018- )
================================================================================
================================================================================
/home/oden/RPM/BUILD/php-5.0.0b1/ext/standard/tests/aggregation/deaggregate.phpt
================================================================================
---- EXPECTED OUTPUT
I'm alive!
Array
(
[helper] => Array
(
[methods] => Array
(
[0] => do_this
[1] => do_that
[2] => just_another_method
)
[properties] => Array
(
[0] => my_prop
[1] => your_prop
[2] => our_prop
)
)
[mixin] => Array
(
[methods] => Array
(
[0] => mix_it
)
[properties] => Array
(
[0] => mix
)
)
)
Array
(
[mixin] => Array
(
[methods] => Array
(
[0] => mix_it
)
[properties] => Array
(
[0] => mix
)
)
)
bool(false)
---- ACTUAL OUTPUT
I'm alive!
Fatal error: Call to undefined function: aggregate() in
/home/oden/RPM/BUILD/php-5.0.0b1/ext/standard/tests/aggregation/deaggregate.php on line 5
---- FAILED
================================================================================
002- Array
002+
003- (
003+ Fatal error: Call to undefined function: aggregate() in
/home/oden/RPM/BUILD/php-5.0.0b1/ext/standard/tests/aggregation/deaggregate.php on line 5
004- [helper] => Array
005- (
006- [methods] => Array
007- (
008- [0] => do_this
009- [1] => do_that
010- [2] => just_another_method
011- )
012-
013- [properties] => Array
014- (
015- [0] => my_prop
016- [1] => your_prop
017- [2] => our_prop
018- )
019-
020- )
021-
022- [mixin] => Array
023- (
024- [methods] => Array
025- (
026- [0] => mix_it
027- )
028-
029- [properties] => Array
030- (
031- [0] => mix
032- )
033-
034- )
035-
036- )
037- Array
038- (
039- [mixin] => Array
040- (
041- [methods] => Array
042- (
043- [0] => mix_it
044- )
045-
046- [properties] => Array
047- (
048- [0] => mix
049- )
050-
051- )
052-
053- )
054- bool(false)
================================================================================
================================================================================
/home/oden/RPM/BUILD/php-5.0.0b1/ext/standard/tests/general_functions/sunfuncts.phpt
================================================================================
---- EXPECTED OUTPUT
1041293199 06:39 6.6524557618962
1041293806 16:46 16.769374867459
1043971592 06:32 6.5453702926602
1043972233 17:13 17.217524708736
1046390766 06:06 6.1156526756851
1046391456 17:36 17.6108549623
1049069128 05:28 5.4727420290691
1049069878 17:58 17.972552584375
1051661094 04:54 4.9012299828593
1051661898 18:18 18.313688769483
1054339474 04:34 4.5744292894498
1054340319 18:39 18.656400943241
1056931476 04:36 4.6161204505189
1056932328 18:48 18.808871657766
1059609894 04:54 4.9068825098365
1059610715 18:35 18.599286002028
1062288314 05:14 5.2368895570738
1062289083 18:03 18.060541787879
1064880332 05:32 5.542366581139
1064881044 17:24 17.411505614917
1067558754 05:54 5.9162088420581
1067559410 16:50 16.833698570628
1070150780 06:20 6.3462215520697
1070151395 16:35 16.583589055537
---- ACTUAL OUTPUT
1041293199 06:39 6.6524557618962
1041293806 16:46 16.769374867459
1043971592 06:32 6.5453702926602
1043972233 17:13 17.217524708736
1046390766 06:06 6.1156526756851
1046391456 17:36 17.6108549623
1049069128 05:28 5.4727420290691
1049069878 17:58 17.972552584375
1051661094 04:54 4.9012299828593
1051661898 18:18 18.313688769483
1054339474 04:34 4.5744292894498
1054340319 18:39 18.656400943241
1056931476 04:36 4.6161204505189
1056932328 18:48 18.808871657766
1059609894 04:54 4.9068825098364
1059610715 18:35 18.599286002028
1062288314 05:14 5.2368895570738
1062289083 18:03 18.060541787879
1064880332 05:32 5.542366581139
1064881044 17:24 17.411505614917
1067558754 05:54 5.9162088420581
1067559410 16:50 16.833698570628
1070150780 06:20 6.3462215520697
1070151395 16:35 16.583589055537
---- FAILED
================================================================================
015- 1059609894 04:54 4.9068825098365
015+ 1059609894 04:54 4.9068825098364
================================================================================
================================================================================
BUILD ENVIRONMENT
================================================================================
OS:
Linux - Linux klama.mandrake.org 2.4.19-16mdkenterprise #1 SMP Fri Sep 20 17:34:59 CEST 2002 i686
Automake:
automake (GNU automake) 1.4-p6
Copyright (C) 1999, 2001 Free Software Foundation, Inc.
This is free software; see the source for copying conditions. There is NO
warranty; not even for MERCHANTABILITY or FITNESS FOR A PARTICULAR PURPOSE.
Written by Tom Tromey <tromey@redhat.com>
Autoconf:
autoconf (GNU Autoconf) 2.57
Written by David J. MacKenzie and Akim Demaille.
Copyright 2002 Free Software Foundation, Inc.
This is free software; see the source for copying conditions. There is NO
warranty; not even for MERCHANTABILITY or FITNESS FOR A PARTICULAR PURPOSE.
Libtool:
ltmain.sh (GNU libtool) 1.4.3 (1.922.2.110 2002/10/23 01:39:54)
Compiler:
Reading specs from /usr/lib/gcc-lib/i586-mandrake-linux-gnu/3.3/specs
Configured with: ../configure --prefix=/usr --libdir=/usr/lib --with-slibdir=/lib
--mandir=/usr/share/man --infodir=/usr/share/info --enable-shared --enable-threads=posix
--disable-checking --enable-long-long --enable-__cxa_atexit
--enable-languages=c,c++,ada,f77,objc,java --host=i586-mandrake-linux-gnu
--target=i586-mandrake-linux-gnu --with-system-zlib
Thread model: posix
gcc version 3.3 (Mandrake Linux 9.2 3.3-2mdk)
Bison:
bison (GNU Bison) 1.875
Written by Robert Corbett and Richard Stallman.
Copyright (C) 2002 Free Software Foundation, Inc.
This is free software; see the source for copying conditions. There is NO
warranty; not even for MERCHANTABILITY or FITNESS FOR A PARTICULAR PURPOSE.
Libraries:
libphp_common.so.5 => ./libphp_common.so.5 (0x40015000)
libcrypt.so.1 => /lib/libcrypt.so.1 (0x4018c000)
libnsl.so.1 => /lib/libnsl.so.1 (0x401b9000)
libintl.so.2 => /lib/libintl.so.2 (0x401cd000)
libc.so.6 => /lib/i686/libc.so.6 (0x401d6000)
libz.so.1 => /lib/libz.so.1 (0x40316000)
libssl.so.0.9.7 => /usr/lib/libssl.so.0.9.7 (0x40324000)
libcrypto.so.0.9.7 => /usr/lib/libcrypto.so.0.9.7 (0x40352000)
libresolv.so.2 => /lib/libresolv.so.2 (0x40440000)
libm.so.6 => /lib/i686/libm.so.6 (0x40451000)
libdl.so.2 => /lib/libdl.so.2 (0x40475000)
/lib/ld-linux.so.2 => /lib/ld-linux.so.2 (0x40000000)
User's E-mail: oden dot eriksson at linux-mandrake dot com
================================================================================
PHPINFO
================================================================================
phpinfo()
PHP Version => 5.0.0b1
System => Linux klama.mandrake.org 2.4.19-16mdkenterprise #1 SMP Fri Sep 20 17:34:59 CEST 2002
i686
Build Date => Jun 30 2003 15:13:42
Configure Command => './configure' '--build=i586-mandrake-linux-gnu'
'--prefix=/usr' '--exec-prefix=/usr' '--bindir=/usr/bin'
'--sbindir=/usr/sbin' '--sysconfdir=/etc' '--datadir=/usr/share'
'--includedir=/usr/include' '--libdir=/usr/lib'
'--libexecdir=/usr/lib' '--localstatedir=/var/lib'
'--sharedstatedir=/usr/com' '--mandir=/usr/share/man'
'--infodir=/usr/share/info' '--prefix=/usr' '--libdir=/usr/lib'
'--enable-discard-path' '--disable-force-cgi-redirect'
'--enable-shared' '--disable-static' '--disable-debug'
'--disable-rpath' '--enable-pic' '--enable-inline-optimization'
'--enable-memory-limit' '--with-config-file-path=/etc'
'--with-config-file-scan-dir=/etc/php' '--with-pear=/usr/share/pear'
'--enable-magic-quotes' '--enable-debugger' '--enable-track-vars'
'--with-exec-dir=/usr/bin' '--with-versioning' '--with-mod_charset'
'--with-regex=php' '--enable-track-vars' '--enable-trans-sid'
'--enable-safe-mode' '--enable-ctype' '--enable-ftp'
'--with-gettext=/usr' '--enable-posix' '--enable-session'
'--enable-sysvsem' '--enable-sysvshm' '--enable-yp'
'--with-openssl=/usr' '--without-kerberos' '--with-ttf'
'--with-freetype-dir=/usr' '--with-zlib=/usr' '--with-zlib=/usr'
'--with-zlib-dir=/usr'
Extensions listed here are (or will be soon) available as external modules. To install one or all of
these, use "urpmi" php-EXTENSION_NAME => mysql pgsql gd imap ldap bcmath bz2 calendar
cpdf crack curl cyrus db dba dba_bundle dbase dbx dio domxml exif fbsql fdf filepro fribidi gmp
hwapi hyperwave iconv imagick informix ingres_ii interbase ircg java mbstring mcal mcrypt mcve mhash
mime_magic ming mnogosearch msession msql mssql ncurses notes oci8 odbc oracle overload ovrimos
pam_auth pcntl pdf pfpro pgsql pspell qtdom readline recode rrdtool shmop snmp smbauth sockets swf
sybase sybase_ct sysvmsg tokenizer wddx xml xmlrpc xslt yaz zip adodb mmcache apd cybercash cybermut
cyrus mono mqseries netools python spplus spread curlwrappers inifile fam ldap-sasl mono simplexml
sqlite xsl dom
Server API => Command Line Interface
Virtual Directory Support => disabled
Configuration File (php.ini) Path => /home/oden/RPM/BUILD/php-5.0.0b1/php.ini
Scan this dir for additional .ini files => /etc/php
PHP API => 20030518
PHP Extension => 20020429
Zend Extension => 90021012
Debug Build => no
Thread Safety => disabled
Registered PHP Streams => php, http, ftp, compress.zlib, https, ftps
This program makes use of the Zend Scripting Language Engine:
Zend Engine v2.0.0-dev, Copyright (c) 1998-2003 Zend Technologies
_______________________________________________________________________
Configuration
PHP Core
Directive => Local Value => Master Value
allow_call_time_pass_reference => On => On
allow_url_fopen => On => On
always_populate_raw_post_data => Off => Off
arg_separator.input => & => &
arg_separator.output => & => &
asp_tags => Off => Off
auto_append_file => no value => no value
auto_prepend_file => no value => no value
browscap => no value => no value
default_charset => no value => no value
default_mimetype => text/html => text/html
define_syslog_variables => Off => Off
disable_classes => no value => no value
disable_functions => no value => no value
display_errors => On => On
display_startup_errors => Off => Off
doc_root => no value => no value
docref_ext => no value => no value
docref_root => no value => no value
enable_dl => On => On
error_append_string => no value => no value
error_log => no value => no value
error_prepend_string => no value => no value
error_reporting => no value => no value
expose_php => On => On
extension_dir => /usr/lib/php/extensions => /usr/lib/php/extensions
file_uploads => On => On
gpc_order => GPC => GPC
highlight.bg => #FFFFFF => #FFFFFF
highlight.comment => #FF8000 => #FF8000
highlight.default => #0000BB => #0000BB
highlight.html => #000000 => #000000
highlight.keyword => #007700 => #007700
highlight.string => #DD0000 => #DD0000
html_errors => On => On
ignore_repeated_errors => Off => Off
ignore_repeated_source => Off => Off
ignore_user_abort => Off => Off
implicit_flush => Off => Off
include_path => .:/usr/share/pear => .:/usr/share/pear
log_errors => Off => Off
log_errors_max_len => 1024 => 1024
magic_quotes_gpc => On => On
magic_quotes_runtime => Off => Off
magic_quotes_sybase => Off => Off
mail.force_extra_parameters => no value => no value
max_execution_time => 30 => 30
max_input_time => -1 => -1
memory_limit => 8M => 8M
open_basedir => no value => no value
output_buffering => 0 => 0
output_handler => 0 => 0
post_max_size => 8M => 8M
precision => 14 => 14
register_argc_argv => On => On
register_globals => Off => Off
register_long_arrays => On => On
report_memleaks => On => On
report_zend_debug => Off => Off
safe_mode => Off => Off
safe_mode_exec_dir => /usr/bin => /usr/bin
safe_mode_gid => Off => Off
safe_mode_include_dir => no value => no value
sendmail_from => no value => no value
sendmail_path => /usr/sbin/sendmail -t -i => /usr/sbin/sendmail -t -i
serialize_precision => 100 => 100
short_open_tag => On => On
SMTP => localhost => localhost
smtp_port => 25 => 25
sql.safe_mode => Off => Off
track_errors => Off => Off
unserialize_callback_func => no value => no value
upload_max_filesize => 2M => 2M
upload_tmp_dir => no value => no value
user_dir => no value => no value
variables_order => no value => no value
xmlrpc_error_number => 0 => 0
xmlrpc_errors => Off => Off
y2k_compliance => On => On
zend2.implicit_clone => no value => no value
ctype
ctype functions => enabled
ftp
FTP support => enabled
gettext
GetText Support => enabled
openssl
OpenSSL support => enabled
OpenSSL Version => OpenSSL 0.9.7b 10 Apr 2003
pcre
PCRE (Perl Compatible Regular Expressions) Support => enabled
PCRE Library Version => 4.3 21-May-2003
posix
Revision => $Revision: 1.56 $
session
Session Support => enabled
Registered save handlers => files user
Directive => Local Value => Master Value
session.auto_start => Off => Off
session.bug_compat_42 => On => On
session.bug_compat_warn => On => On
session.cache_expire => 180 => 180
session.cache_limiter => nocache => nocache
session.cookie_domain => no value => no value
session.cookie_lifetime => 0 => 0
session.cookie_path => / => /
session.cookie_secure => Off => Off
session.entropy_file => no value => no value
session.entropy_length => 0 => 0
session.gc_divisor => 100 => 100
session.gc_maxlifetime => 1440 => 1440
session.gc_probability => 1 => 1
session.hash_bits_per_character => 4 => 4
session.hash_function => 0 => 0
session.name => PHPSESSID => PHPSESSID
session.referer_check => no value => no value
session.save_handler => files => files
session.save_path => . => .
session.serialize_handler => php => php
session.use_cookies => On => On
session.use_only_cookies => Off => Off
session.use_trans_sid => Off => Off
standard
Regex Library => Bundled library enabled
Dynamic Library Support => enabled
Path to sendmail => /usr/sbin/sendmail -t -i
Directive => Local Value => Master Value
assert.active => 1 => 1
assert.bail => 0 => 0
assert.callback => no value => no value
assert.quiet_eval => 0 => 0
assert.warning => 1 => 1
auto_detect_line_endings => 0 => 0
date.default_latitude => 31.7667 => 31.7667
date.default_longitude => 35.2333 => 35.2333
date.sunrise_zenith => 90.83 => 90.83
date.sunset_zenith => 90.83 => 90.83
default_socket_timeout => 60 => 60
safe_mode_allowed_env_vars => PHP_ => PHP_
safe_mode_protected_env_vars => LD_LIBRARY_PATH => LD_LIBRARY_PATH
url_rewriter.tags => a=href,area=href,frame=src,form=,fieldset= =>
a=href,area=href,frame=src,form=,fieldset=
user_agent => no value => no value
yp
YP Support => enabled
zlib
ZLib Support => enabled
Compiled Version => 1.1.4
Linked Version => 1.1.4
Directive => Local Value => Master Value
zlib.output_compression => Off => Off
zlib.output_compression_level => -1 => -1
zlib.output_handler => no value => no value
Additional Modules
Module Name
sysvsem
sysvshm
Environment
Variable => Value
LESSKEY => /etc/.less
HOSTNAME => klama.mandrake.org
LC_MONETARY => en_US
TEST_PHP_SRCDIR => /home/oden/RPM/BUILD/php-5.0.0b1
GUIDEHOME => /usr/openwin/lib/guide
LINGUAS => en_US
SHELL => /bin/sh
TERM => xterm
MPIRUN_HOME => /usr/bin
MAKEFLAGS =>
HISTSIZE => 1000
SSH_CLIENT => deleted
GNUSTEP_LOCAL_ROOT => /usr/GNUstep/Local
QMAILHOST => kvikkjokk.net
LC_NUMERIC => en_US
PHPRC => .
SSH_TTY => deleted
GNUSTEP_HOST => i686-pc-linux-gnu
LC_ALL => C
USER => oden
LD_LIBRARY_PATH => .
SCRIPT_FILENAME =>
GUILE_LOAD_PATH =>
/home/oden/GNUstep/Libraries/Guile:/usr/GNUstep/Local/Libraries/Guile:/usr/GNUstep/Network/Libraries/Guile:/usr/GNUstep/System/Libraries/Guile
GDK_USE_XFT => 1
OPENWINHOME => /usr/openwin
GNUSTEP_NETWORK_ROOT => /usr/GNUstep/Network
GNUSTEP_MAKEFILES => /usr/GNUstep/System/Makefiles
GNUSTEP_ROOT => /usr/GNUstep
SSH_AUTH_SOCK => deleted
CRYSTAL => /usr/lib/crystalspace
GNUSTEP_FLATTENED =>
GNUSTEP_HOST_OS => linux-gnu
MAKELEVEL => 1
MFLAGS =>
HELPPATH => /usr/openwin/lib/help
NLSPATH => /usr/share/locale/%l/%N
GNUSTEP_HOST_VENDOR => pc
PATH => /sbin:/usr/sbin:/bin:/usr/bin:/usr/local/bin:/var/qmail/bin:/usr/X11R6/bin:/home/oden/bin
MAIL => /var/spool/mail/oden
LC_MESSAGES => en_US
_ => /home/oden/RPM/BUILD/php-5.0.0b1/sapi/cli/php
QMAILINJECT => f
LC_COLLATE => en_US
PWD => /home/oden/RPM/BUILD/php-5.0.0b1
INPUTRC => /etc/inputrc
EDITOR => /usr/bin/nano
LANG => en
TEST_PHP_EXECUTABLE => /home/oden/RPM/BUILD/php-5.0.0b1/sapi/cli/php
REDIRECT_STATUS =>
GNUSTEP_HOST_CPU => ix86
PATH_TRANSLATED =>
HISTIGNORE => [ ]*:&:bg:fg
HISTCONTROL => ignoredups
HOME => /home/oden
SHLVL => 4
CONTENT_LENGTH =>
LANGUAGE => en_US:en
GNUSTEP_USER_ROOT => /home/oden/GNUstep
GNUSTEP_SYSTEM_ROOT => /usr/GNUstep/System
BASH_ENV => /home/oden/.bashrc
LOGNAME => oden
LESS => -MM
QUERY_STRING =>
GNUSTEP_PATHLIST =>
/home/oden/GNUstep:/usr/GNUstep/Local:/usr/GNUstep/Network:/usr/GNUstep/System
LC_CTYPE => en_US
SSH_CONNECTION => 213.65.248.91 32925 212.43.244.18 22
CLASSPATH =>
/home/oden/GNUstep/Libraries/Java:/usr/GNUstep/Local/Libraries/Java:/usr/GNUstep/Network/Libraries/Java:/usr/GNUstep/System/Libraries/Java
QMAILUSER => oden
LIBRARY_COMBO => gnu-gnu-gnu
CONTENT_TYPE =>
CC => gcc
REQUEST_METHOD =>
QMAILNAME => Oden Eriksson
LC_TIME => en_US
G_BROKEN_FILENAMES => 1
PHP Variables
Variable => Value
_SERVER["LESSKEY"] => /etc/.less
_SERVER["HOSTNAME"] => klama.mandrake.org
_SERVER["LC_MONETARY"] => en_US
_SERVER["TEST_PHP_SRCDIR"] => /home/oden/RPM/BUILD/php-5.0.0b1
_SERVER["GUIDEHOME"] => /usr/openwin/lib/guide
_SERVER["LINGUAS"] => en_US
_SERVER["SHELL"] => /bin/sh
_SERVER["TERM"] => xterm
_SERVER["MPIRUN_HOME"] => /usr/bin
_SERVER["MAKEFLAGS"] =>
_SERVER["HISTSIZE"] => 1000
_SERVER["SSH_CLIENT"] => deleted
_SERVER["GNUSTEP_LOCAL_ROOT"] => /usr/GNUstep/Local
_SERVER["QMAILHOST"] => kvikkjokk.net
_SERVER["LC_NUMERIC"] => en_US
_SERVER["PHPRC"] => .
_SERVER["SSH_TTY"] => deleted
_SERVER["GNUSTEP_HOST"] => i686-pc-linux-gnu
_SERVER["LC_ALL"] => C
_SERVER["USER"] => oden
_SERVER["LD_LIBRARY_PATH"] => .
_SERVER["SCRIPT_FILENAME"] =>
_SERVER["GUILE_LOAD_PATH"] =>
/home/oden/GNUstep/Libraries/Guile:/usr/GNUstep/Local/Libraries/Guile:/usr/GNUstep/Network/Libraries/Guile:/usr/GNUstep/System/Libraries/Guile
_SERVER["GDK_USE_XFT"] => 1
_SERVER["OPENWINHOME"] => /usr/openwin
_SERVER["GNUSTEP_NETWORK_ROOT"] => /usr/GNUstep/Network
_SERVER["GNUSTEP_MAKEFILES"] => /usr/GNUstep/System/Makefiles
_SERVER["GNUSTEP_ROOT"] => /usr/GNUstep
_SERVER["SSH_AUTH_SOCK"] => deleted
_SERVER["CRYSTAL"] => /usr/lib/crystalspace
_SERVER["GNUSTEP_FLATTENED"] =>
_SERVER["GNUSTEP_HOST_OS"] => linux-gnu
_SERVER["MAKELEVEL"] => 1
_SERVER["MFLAGS"] =>
_SERVER["HELPPATH"] => /usr/openwin/lib/help
_SERVER["NLSPATH"] => /usr/share/locale/%l/%N
_SERVER["GNUSTEP_HOST_VENDOR"] => pc
_SERVER["PATH"] =>
/sbin:/usr/sbin:/bin:/usr/bin:/usr/local/bin:/var/qmail/bin:/usr/X11R6/bin:/home/oden/bin
_SERVER["MAIL"] => /var/spool/mail/oden
_SERVER["LC_MESSAGES"] => en_US
_SERVER["_"] => /home/oden/RPM/BUILD/php-5.0.0b1/sapi/cli/php
_SERVER["QMAILINJECT"] => f
_SERVER["LC_COLLATE"] => en_US
_SERVER["PWD"] => /home/oden/RPM/BUILD/php-5.0.0b1
_SERVER["INPUTRC"] => /etc/inputrc
_SERVER["EDITOR"] => /usr/bin/nano
_SERVER["LANG"] => en
_SERVER["TEST_PHP_EXECUTABLE"] => /home/oden/RPM/BUILD/php-5.0.0b1/sapi/cli/php
_SERVER["REDIRECT_STATUS"] =>
_SERVER["GNUSTEP_HOST_CPU"] => ix86
_SERVER["PATH_TRANSLATED"] =>
_SERVER["HISTIGNORE"] => [ ]*:&:bg:fg
_SERVER["HISTCONTROL"] => ignoredups
_SERVER["HOME"] => /home/oden
_SERVER["SHLVL"] => 4
_SERVER["CONTENT_LENGTH"] =>
_SERVER["LANGUAGE"] => en_US:en
_SERVER["GNUSTEP_USER_ROOT"] => /home/oden/GNUstep
_SERVER["GNUSTEP_SYSTEM_ROOT"] => /usr/GNUstep/System
_SERVER["BASH_ENV"] => /home/oden/.bashrc
_SERVER["LOGNAME"] => oden
_SERVER["LESS"] => -MM
_SERVER["QUERY_STRING"] =>
_SERVER["GNUSTEP_PATHLIST"] =>
/home/oden/GNUstep:/usr/GNUstep/Local:/usr/GNUstep/Network:/usr/GNUstep/System
_SERVER["LC_CTYPE"] => en_US
_SERVER["SSH_CONNECTION"] => 213.65.248.91 32925 212.43.244.18 22
_SERVER["CLASSPATH"] =>
/home/oden/GNUstep/Libraries/Java:/usr/GNUstep/Local/Libraries/Java:/usr/GNUstep/Network/Libraries/Java:/usr/GNUstep/System/Libraries/Java
_SERVER["QMAILUSER"] => oden
_SERVER["LIBRARY_COMBO"] => gnu-gnu-gnu
_SERVER["CONTENT_TYPE"] =>
_SERVER["CC"] => gcc
_SERVER["REQUEST_METHOD"] =>
_SERVER["QMAILNAME"] => Oden Eriksson
_SERVER["LC_TIME"] => en_US
_SERVER["G_BROKEN_FILENAMES"] => 1
_SERVER["PHP_SELF"] =>
_SERVER["SCRIPT_NAME"] =>
_SERVER["DOCUMENT_ROOT"] =>
_SERVER["argv"] => Array
(
)
_SERVER["argc"] => 0
_ENV["LESSKEY"] => /etc/.less
_ENV["HOSTNAME"] => klama.mandrake.org
_ENV["LC_MONETARY"] => en_US
_ENV["TEST_PHP_SRCDIR"] => /home/oden/RPM/BUILD/php-5.0.0b1
_ENV["GUIDEHOME"] => /usr/openwin/lib/guide
_ENV["LINGUAS"] => en_US
_ENV["SHELL"] => /bin/sh
_ENV["TERM"] => xterm
_ENV["MPIRUN_HOME"] => /usr/bin
_ENV["MAKEFLAGS"] =>
_ENV["HISTSIZE"] => 1000
_ENV["SSH_CLIENT"] => deleted
_ENV["GNUSTEP_LOCAL_ROOT"] => /usr/GNUstep/Local
_ENV["QMAILHOST"] => kvikkjokk.net
_ENV["LC_NUMERIC"] => en_US
_ENV["PHPRC"] => .
_ENV["SSH_TTY"] => deleted
_ENV["GNUSTEP_HOST"] => i686-pc-linux-gnu
_ENV["LC_ALL"] => C
_ENV["USER"] => oden
_ENV["LD_LIBRARY_PATH"] => .
_ENV["SCRIPT_FILENAME"] =>
_ENV["GUILE_LOAD_PATH"] =>
/home/oden/GNUstep/Libraries/Guile:/usr/GNUstep/Local/Libraries/Guile:/usr/GNUstep/Network/Libraries/Guile:/usr/GNUstep/System/Libraries/Guile
_ENV["GDK_USE_XFT"] => 1
_ENV["OPENWINHOME"] => /usr/openwin
_ENV["GNUSTEP_NETWORK_ROOT"] => /usr/GNUstep/Network
_ENV["GNUSTEP_MAKEFILES"] => /usr/GNUstep/System/Makefiles
_ENV["GNUSTEP_ROOT"] => /usr/GNUstep
_ENV["SSH_AUTH_SOCK"] => deleted
_ENV["CRYSTAL"] => /usr/lib/crystalspace
_ENV["GNUSTEP_FLATTENED"] =>
_ENV["GNUSTEP_HOST_OS"] => linux-gnu
_ENV["MAKELEVEL"] => 1
_ENV["MFLAGS"] =>
_ENV["HELPPATH"] => /usr/openwin/lib/help
_ENV["NLSPATH"] => /usr/share/locale/%l/%N
_ENV["GNUSTEP_HOST_VENDOR"] => pc
_ENV["PATH"] =>
/sbin:/usr/sbin:/bin:/usr/bin:/usr/local/bin:/var/qmail/bin:/usr/X11R6/bin:/home/oden/bin
_ENV["MAIL"] => /var/spool/mail/oden
_ENV["LC_MESSAGES"] => en_US
_ENV["_"] => /home/oden/RPM/BUILD/php-5.0.0b1/sapi/cli/php
_ENV["QMAILINJECT"] => f
_ENV["LC_COLLATE"] => en_US
_ENV["PWD"] => /home/oden/RPM/BUILD/php-5.0.0b1
_ENV["INPUTRC"] => /etc/inputrc
_ENV["EDITOR"] => /usr/bin/nano
_ENV["LANG"] => en
_ENV["TEST_PHP_EXECUTABLE"] => /home/oden/RPM/BUILD/php-5.0.0b1/sapi/cli/php
_ENV["REDIRECT_STATUS"] =>
_ENV["GNUSTEP_HOST_CPU"] => ix86
_ENV["PATH_TRANSLATED"] =>
_ENV["HISTIGNORE"] => [ ]*:&:bg:fg
_ENV["HISTCONTROL"] => ignoredups
_ENV["HOME"] => /home/oden
_ENV["SHLVL"] => 4
_ENV["CONTENT_LENGTH"] =>
_ENV["LANGUAGE"] => en_US:en
_ENV["GNUSTEP_USER_ROOT"] => /home/oden/GNUstep
_ENV["GNUSTEP_SYSTEM_ROOT"] => /usr/GNUstep/System
_ENV["BASH_ENV"] => /home/oden/.bashrc
_ENV["LOGNAME"] => oden
_ENV["LESS"] => -MM
_ENV["QUERY_STRING"] =>
_ENV["GNUSTEP_PATHLIST"] =>
/home/oden/GNUstep:/usr/GNUstep/Local:/usr/GNUstep/Network:/usr/GNUstep/System
_ENV["LC_CTYPE"] => en_US
_ENV["SSH_CONNECTION"] => 213.65.248.91 32925 212.43.244.18 22
_ENV["CLASSPATH"] =>
/home/oden/GNUstep/Libraries/Java:/usr/GNUstep/Local/Libraries/Java:/usr/GNUstep/Network/Libraries/Java:/usr/GNUstep/System/Libraries/Java
_ENV["QMAILUSER"] => oden
_ENV["LIBRARY_COMBO"] => gnu-gnu-gnu
_ENV["CONTENT_TYPE"] =>
_ENV["CC"] => gcc
_ENV["REQUEST_METHOD"] =>
_ENV["QMAILNAME"] => Oden Eriksson
_ENV["LC_TIME"] => en_US
_ENV["G_BROKEN_FILENAMES"] => 1
PHP License
This program is free software; you can redistribute it and/or modify
it under the terms of the PHP License as published by the PHP Group
and included in the distribution in the file: LICENSE
This program is distributed in the hope that it will be useful,
but WITHOUT ANY WARRANTY; without even the implied warranty of
MERCHANTABILITY or FITNESS FOR A PARTICULAR PURPOSE.
If you did not receive a copy of the PHP license, or have any
questions about PHP licensing, please contact license@php.net.