Re: Any news on testing 4.0.3RC2?
| From: | Jani Taskinen | Date: | Wed, 11 Oct 2000 11:06:44 +0000 |
| Subject: | Re: Any news on testing 4.0.3RC2? | ||
| References: | 1 | Groups: | php.qa |
| Request: | Send a blank email to php-qa+get-1466@lists.php.net to get a copy of this message | ||
I'm still getting this error (with latest CVS) :
"reentrancy.c", line 106: prototype mismatch: 2 args passed, 3 expected
cc: acomp failed for reentrancy.c
make[2]: *** [reentrancy.lo] Error 1
make[2]: Leaving directory `/datan/data3/home/sniper/testsite/php4/main'
make[1]: *** [all-recursive] Error 1
make[1]: Leaving directory `/datan/data3/home/sniper/testsite/php4/main'
make: *** [all-recursive] Error 1
--Jani