Test results for 5.0.0b2-dev [failed]
| From: | noreply@php.net | Date: | Wed, 02 Jul 2003 17:52:05 +0000 |
| Subject: | Test results for 5.0.0b2-dev [failed] | ||
| Groups: | php.qa | ||
| Request: | Send a blank email to php-qa+get-14742@lists.php.net to get a copy of this message | ||
=====================================================================
FAILED TEST SUMMARY
---------------------------------------------------------------------
Bug #24399: is_subclass_of() crashes when parent class doesn't exist.
[tests/classes/bug24399.phpt]
ZE2 factory and singleton, test 2 [tests/classes/factory_and_singleton_002.phpt]
Bug #24436: isset()/empty() produce errors with non-existent variables in classes
[Zend/tests/bug24436.phpt]
correct instantiation of references between variables in sessions [ext/session/tests/006.phpt]
bug compatibility: unset($c) with enabled register_globals [ext/session/tests/007.phpt]
serializing references test case using globals [ext/session/tests/019.phpt]
date_sunrise() and date_sunset() functions [ext/standard/tests/general_functions/sunfuncts.phpt]
Bug #24142 (round() problems) [ext/standard/tests/math/bug24142.phpt]
serialize()/unserialize()/var_dump() [ext/standard/tests/serialize/001.phpt]
=====================================================================
=====================================================================
TEST RESULT SUMMARY
---------------------------------------------------------------------
Exts skipped : 105
Exts tested : 7
---------------------------------------------------------------------
Number of tests : 696
Tests skipped : 307 (44.1%)
Tests warned : 0 ( 0.0%)
Tests failed : 9 ( 1.3%)
Tests passed : 380 (54.6%)
---------------------------------------------------------------------
Time taken : 58 seconds
=====================================================================
=====================================================================
FAILED TEST SUMMARY
---------------------------------------------------------------------
Bug #24399: is_subclass_of() crashes when parent class doesn't exist.
[tests/classes/bug24399.phpt]
ZE2 factory and singleton, test 2 [tests/classes/factory_and_singleton_002.phpt]
Bug #24436: isset()/empty() produce errors with non-existent variables in classes
[Zend/tests/bug24436.phpt]
correct instantiation of references between variables in sessions [ext/session/tests/006.phpt]
bug compatibility: unset($c) with enabled register_globals [ext/session/tests/007.phpt]
serializing references test case using globals [ext/session/tests/019.phpt]
date_sunrise() and date_sunset() functions [ext/standard/tests/general_functions/sunfuncts.phpt]
Bug #24142 (round() problems) [ext/standard/tests/math/bug24142.phpt]
serialize()/unserialize()/var_dump() [ext/standard/tests/serialize/001.phpt]
=====================================================================
================================================================================
/home/zeev/php5/tests/classes/bug24399.phpt
================================================================================
---- EXPECTED OUTPUT
bool(false)
---- ACTUAL OUTPUT
bool(false)
/home/zeev/php5/Zend/zend_operators.h(206) : Freeing 0x08226FB4 (5 bytes),
script=/home/zeev/php5/tests/classes/bug24399.php
---- FAILED
================================================================================
002+ /home/zeev/php5/Zend/zend_operators.h(206) : Freeing 0x08226FB4 (5 bytes),
script=/home/zeev/php5/tests/classes/bug24399.php
================================================================================
================================================================================
/home/zeev/php5/tests/classes/factory_and_singleton_002.phpt
================================================================================
---- EXPECTED OUTPUT
Access static members
NULL
int(0)
Create x and y
int(1)
int(1)
int(1)
int(1)
Destruct x
int(1)
int(1)
int(1)
Destruct y
int(1)
int(1)
Done
---- ACTUAL OUTPUT
Access static members
NULL
int(0)
Create x and y
int(1)
int(1)
int(1)
int(1)
Destruct x
int(1)
int(1)
int(1)
Destruct y
int(1)
int(1)
Done
Fatal error: Call to protected destructor from context '' in Unknown on line 0
[Wed Jul 2 20:47:02 2003] Script:
'/home/zeev/php5/tests/classes/factory_and_singleton_002.php'
---------------------------------------
/home/zeev/php5/Zend/zend_execute.h(67) : Block 0x08220908 status:
Beginning: Overrun (magic=0x08226FF0, expected=0x7312F8DC)
End: Unknown
---------------------------------------
[Wed Jul 2 20:47:02 2003] Script:
'/home/zeev/php5/tests/classes/factory_and_singleton_002.php'
---------------------------------------
/home/zeev/php5/Zend/zend_hash.c(514) : Block 0x08226F10 status:
Beginning: Overrun (magic=0x08227030, expected=0x7312F8DC)
End: Unknown
---------------------------------------
[Wed Jul 2 20:47:02 2003] Script:
'/home/zeev/php5/tests/classes/factory_and_singleton_002.php'
---------------------------------------
/home/zeev/php5/Zend/zend_hash.c(516) : Block 0x08226B28 status:
Beginning: Overrun (magic=0x08226F08, expected=0x7312F8DC)
End: Unknown
---------------------------------------
[Wed Jul 2 20:47:02 2003] Script:
'/home/zeev/php5/tests/classes/factory_and_singleton_002.php'
---------------------------------------
/home/zeev/php5/Zend/zend_compile.c(3449) : Block 0x08226ED8 status:
Beginning: Overrun (magic=0x082272A0, expected=0x7312F8DC)
End: Unknown
---------------------------------------
[Wed Jul 2 20:47:02 2003] Script:
'/home/zeev/php5/tests/classes/factory_and_singleton_002.php'
---------------------------------------
/home/zeev/php5/Zend/zend_hash.c(512) : Block 0x082208C8 status:
Beginning: Overrun (magic=0x08220900, expected=0x7312F8DC)
End: Unknown
---------------------------------------
[Wed Jul 2 20:47:02 2003] Script:
'/home/zeev/php5/tests/classes/factory_and_singleton_002.php'
---------------------------------------
/home/zeev/php5/Zend/zend_hash.c(514) : Block 0x08226F68 status:
Beginning: Overrun (magic=0x08227030, expected=0x7312F8DC)
End: Unknown
---------------------------------------
[Wed Jul 2 20:47:02 2003] Script:
'/home/zeev/php5/tests/classes/factory_and_singleton_002.php'
---------------------------------------
/home/zeev/php5/Zend/zend_compile.c(3449) : Block 0x08226FF8 status:
Beginning: Overrun (magic=0x082270E8, expected=0x7312F8DC)
End: Unknown
---------------------------------------
[Wed Jul 2 20:47:02 2003] Script:
'/home/zeev/php5/tests/classes/factory_and_singleton_002.php'
---------------------------------------
/home/zeev/php5/Zend/zend_hash.c(512) : Block 0x082270F0 status:
Beginning: Overrun (magic=0x08227128, expected=0x7312F8DC)
End: Unknown
---------------------------------------
[Wed Jul 2 20:47:02 2003] Script:
'/home/zeev/php5/tests/classes/factory_and_singleton_002.php'
---------------------------------------
/home/zeev/php5/Zend/zend_hash.c(514) : Block 0x08227098 status:
Beginning: Overrun (magic=0x082271A8, expected=0x7312F8DC)
End: Unknown
---------------------------------------
[Wed Jul 2 20:47:02 2003] Script:
'/home/zeev/php5/tests/classes/factory_and_singleton_002.php'
---------------------------------------
/home/zeev/php5/Zend/zend_compile.c(3449) : Block 0x08227170 status:
Beginning: Overrun (magic=0x08227260, expected=0x7312F8DC)
End: Unknown
---------------------------------------
[Wed Jul 2 20:47:02 2003] Script:
'/home/zeev/php5/tests/classes/factory_and_singleton_002.php'
---------------------------------------
/home/zeev/php5/Zend/zend_hash.c(512) : Block 0x08227268 status:
Beginning: Overrun (magic=0x08228C08, expected=0x7312F8DC)
End: Unknown
---------------------------------------
[Wed Jul 2 20:47:02 2003] Script:
'/home/zeev/php5/tests/classes/factory_and_singleton_002.php'
---------------------------------------
/home/zeev/php5/Zend/zend_hash.c(514) : Block 0x08227210 status:
Beginning: Overrun (magic=0x082288E0, expected=0x7312F8DC)
End: Unknown
---------------------------------------
[Wed Jul 2 20:47:02 2003] Script:
'/home/zeev/php5/tests/classes/factory_and_singleton_002.php'
---------------------------------------
/home/zeev/php5/Zend/zend_hash.c(516) : Block 0x08226B78 status:
Beginning: Overrun (magic=0x08226F08, expected=0x7312F8DC)
End: Unknown
---------------------------------------
/home/zeev/php5/Zend/zend_hash.c(500) : ht=0x08226bec is being cleaned
/home/zeev/php5/Zend/zend_hash.c(67) : Bailed out without a bailout address!
---- FAILED
================================================================================
017+
018+ Fatal error: Call to protected destructor from context '' in Unknown on line 0
019+ [Wed Jul 2 20:47:02 2003] Script:
'/home/zeev/php5/tests/classes/factory_and_singleton_002.php'
020+ ---------------------------------------
021+ /home/zeev/php5/Zend/zend_execute.h(67) : Block 0x08220908 status:
022+ Beginning: Overrun (magic=0x08226FF0, expected=0x7312F8DC)
023+ End: Unknown
024+ ---------------------------------------
025+ [Wed Jul 2 20:47:02 2003] Script:
'/home/zeev/php5/tests/classes/factory_and_singleton_002.php'
026+ ---------------------------------------
027+ /home/zeev/php5/Zend/zend_hash.c(514) : Block 0x08226F10 status:
028+ Beginning: Overrun (magic=0x08227030, expected=0x7312F8DC)
029+ End: Unknown
030+ ---------------------------------------
031+ [Wed Jul 2 20:47:02 2003] Script:
'/home/zeev/php5/tests/classes/factory_and_singleton_002.php'
032+ ---------------------------------------
033+ /home/zeev/php5/Zend/zend_hash.c(516) : Block 0x08226B28 status:
034+ Beginning: Overrun (magic=0x08226F08, expected=0x7312F8DC)
035+ End: Unknown
036+ ---------------------------------------
037+ [Wed Jul 2 20:47:02 2003] Script:
'/home/zeev/php5/tests/classes/factory_and_singleton_002.php'
038+ ---------------------------------------
039+ /home/zeev/php5/Zend/zend_compile.c(3449) : Block 0x08226ED8 status:
040+ Beginning: Overrun (magic=0x082272A0, expected=0x7312F8DC)
041+ End: Unknown
042+ ---------------------------------------
043+ [Wed Jul 2 20:47:02 2003] Script:
'/home/zeev/php5/tests/classes/factory_and_singleton_002.php'
044+ ---------------------------------------
045+ /home/zeev/php5/Zend/zend_hash.c(512) : Block 0x082208C8 status:
046+ Beginning: Overrun (magic=0x08220900, expected=0x7312F8DC)
047+ End: Unknown
048+ ---------------------------------------
049+ [Wed Jul 2 20:47:02 2003] Script:
'/home/zeev/php5/tests/classes/factory_and_singleton_002.php'
050+ ---------------------------------------
051+ /home/zeev/php5/Zend/zend_hash.c(514) : Block 0x08226F68 status:
052+ Beginning: Overrun (magic=0x08227030, expected=0x7312F8DC)
053+ End: Unknown
054+ ---------------------------------------
055+ [Wed Jul 2 20:47:02 2003] Script:
'/home/zeev/php5/tests/classes/factory_and_singleton_002.php'
056+ ---------------------------------------
057+ /home/zeev/php5/Zend/zend_compile.c(3449) : Block 0x08226FF8 status:
058+ Beginning: Overrun (magic=0x082270E8, expected=0x7312F8DC)
059+ End: Unknown
060+ ---------------------------------------
061+ [Wed Jul 2 20:47:02 2003] Script:
'/home/zeev/php5/tests/classes/factory_and_singleton_002.php'
062+ ---------------------------------------
063+ /home/zeev/php5/Zend/zend_hash.c(512) : Block 0x082270F0 status:
064+ Beginning: Overrun (magic=0x08227128, expected=0x7312F8DC)
065+ End: Unknown
066+ ---------------------------------------
067+ [Wed Jul 2 20:47:02 2003] Script:
'/home/zeev/php5/tests/classes/factory_and_singleton_002.php'
068+ ---------------------------------------
069+ /home/zeev/php5/Zend/zend_hash.c(514) : Block 0x08227098 status:
070+ Beginning: Overrun (magic=0x082271A8, expected=0x7312F8DC)
071+ End: Unknown
072+ ---------------------------------------
073+ [Wed Jul 2 20:47:02 2003] Script:
'/home/zeev/php5/tests/classes/factory_and_singleton_002.php'
074+ ---------------------------------------
075+ /home/zeev/php5/Zend/zend_compile.c(3449) : Block 0x08227170 status:
076+ Beginning: Overrun (magic=0x08227260, expected=0x7312F8DC)
077+ End: Unknown
078+ ---------------------------------------
079+ [Wed Jul 2 20:47:02 2003] Script:
'/home/zeev/php5/tests/classes/factory_and_singleton_002.php'
080+ ---------------------------------------
081+ /home/zeev/php5/Zend/zend_hash.c(512) : Block 0x08227268 status:
082+ Beginning: Overrun (magic=0x08228C08, expected=0x7312F8DC)
083+ End: Unknown
084+ ---------------------------------------
085+ [Wed Jul 2 20:47:02 2003] Script:
'/home/zeev/php5/tests/classes/factory_and_singleton_002.php'
086+ ---------------------------------------
087+ /home/zeev/php5/Zend/zend_hash.c(514) : Block 0x08227210 status:
088+ Beginning: Overrun (magic=0x082288E0, expected=0x7312F8DC)
089+ End: Unknown
090+ ---------------------------------------
091+ [Wed Jul 2 20:47:02 2003] Script:
'/home/zeev/php5/tests/classes/factory_and_singleton_002.php'
092+ ---------------------------------------
093+ /home/zeev/php5/Zend/zend_hash.c(516) : Block 0x08226B78 status:
094+ Beginning: Overrun (magic=0x08226F08, expected=0x7312F8DC)
095+ End: Unknown
096+ ---------------------------------------
097+ /home/zeev/php5/Zend/zend_hash.c(500) : ht=0x08226bec is being cleaned
098+ /home/zeev/php5/Zend/zend_hash.c(67) : Bailed out without a bailout address!
================================================================================
================================================================================
/home/zeev/php5/Zend/tests/bug24436.phpt
================================================================================
---- EXPECTED OUTPUT
Notice: Undefined property: test::$test in /home/derick/bug24436.php on line 11test1
Notice: Undefined property: test::$test in /home/derick/bug24436.php on line 12test2
test1
test2
---- ACTUAL OUTPUT
test1
test2
test1
test2
---- FAILED
================================================================================
001- Notice: Undefined property: test::$test in /home/derick/bug24436.php on line 11test1
001+ test1
002-
002+ test2
003- Notice: Undefined property: test::$test in /home/derick/bug24436.php on line 12test2
003+ test1
004- test1
004+ test2
005- test2
================================================================================
================================================================================
/home/zeev/php5/ext/session/tests/006.phpt
================================================================================
---- EXPECTED OUTPUT
original values:
object(a)#%d (1) {
["test"]=>
string(5) "hallo"
}
object(b)#%d (1) {
["a"]=>
&object(a)#%d (1) {
["test"]=>
string(5) "hallo"
}
}
values after session:
object(a)#%d (1) {
["test"]=>
string(5) "hallo"
}
object(b)#%d (1) {
["a"]=>
&object(a)#%d (1) {
["test"]=>
string(5) "hallo"
}
}
---- ACTUAL OUTPUT
original values:
object(a)#1 (1) {
["test"]=>
string(5) "hallo"
}
object(b)#2 (1) {
["a"]=>
&object(a)#1 (1) {
["test"]=>
string(5) "hallo"
}
}
values after session:
object(a)#3 (1) {
["test"]=>
string(5) "hallo"
}
object(b)#1 (1) {
["a"]=>
&object(a)#3 (1) {
["test"]=>
string(5) "hallo"
}
}
/home/rei/PHP_CVS/php-src/ext/standard/var_unserializer.re(169) : Freeing 0x08228444 (16 bytes),
script=/home/zeev/php5/ext/session/tests/006.php
---- FAILED
================================================================================
002- object(a)#%d (1) {
002+ object(a)#1 (1) {
006- object(b)#%d (1) {
006+ object(b)#2 (1) {
008- &object(a)#%d (1) {
008+ &object(a)#1 (1) {
014- object(a)#%d (1) {
014+ object(a)#3 (1) {
018- object(b)#%d (1) {
018+ object(b)#1 (1) {
020- &object(a)#%d (1) {
020+ &object(a)#3 (1) {
025+ /home/rei/PHP_CVS/php-src/ext/standard/var_unserializer.re(169) : Freeing 0x08228444 (16
bytes), script=/home/zeev/php5/ext/session/tests/006.php
================================================================================
================================================================================
/home/zeev/php5/ext/session/tests/007.phpt
================================================================================
---- EXPECTED OUTPUT
float(3.14)
array(1) {
["c"]=>
&float(3.14)
}
float(3.14)
array(1) {
["c"]=>
&float(3.14)
}
---- ACTUAL OUTPUT
float(3.14)
array(1) {
["c"]=>
&float(3.14)
}
float(3.14)
array(1) {
["c"]=>
&float(3.14)
}
/home/rei/PHP_CVS/php-src/ext/standard/var_unserializer.re(169) : Freeing 0x082267D4 (16 bytes),
script=/home/zeev/php5/ext/session/tests/007.php
---- FAILED
================================================================================
011+ /home/rei/PHP_CVS/php-src/ext/standard/var_unserializer.re(169) : Freeing 0x082267D4 (16
bytes), script=/home/zeev/php5/ext/session/tests/007.php
================================================================================
================================================================================
/home/zeev/php5/ext/session/tests/019.phpt
================================================================================
---- EXPECTED OUTPUT
array(2) {
["o1"]=>
&object(tfoo)#1 (1) {
["c"]=>
int(42)
}
["o2"]=>
&object(tfoo)#1 (1) {
["c"]=>
int(42)
}
}
array(2) {
["o1"]=>
&object(tfoo)#1 (1) {
["c"]=>
int(44)
}
["o2"]=>
&object(tfoo)#1 (1) {
["c"]=>
int(44)
}
}
---- ACTUAL OUTPUT
array(2) {
["o1"]=>
&object(tfoo)#1 (1) {
["c"]=>
int(42)
}
["o2"]=>
&object(tfoo)#1 (1) {
["c"]=>
int(42)
}
}
array(2) {
["o1"]=>
&object(tfoo)#1 (1) {
["c"]=>
int(44)
}
["o2"]=>
&object(tfoo)#1 (1) {
["c"]=>
int(44)
}
}
/home/zeev/php5/ext/session/session.c(490) : Freeing 0x08226304 (16 bytes),
script=/home/zeev/php5/ext/session/tests/019.php
---- FAILED
================================================================================
025+ /home/zeev/php5/ext/session/session.c(490) : Freeing 0x08226304 (16 bytes),
script=/home/zeev/php5/ext/session/tests/019.php
================================================================================
================================================================================
/home/zeev/php5/ext/standard/tests/general_functions/sunfuncts.phpt
================================================================================
---- EXPECTED OUTPUT
1041293199 06:39 6.6524557618962
1041293806 16:46 16.769374867459
1043971592 06:32 6.5453702926602
1043972233 17:13 17.217524708736
1046390766 06:06 6.1156526756851
1046391456 17:36 17.6108549623
1049069128 05:28 5.4727420290691
1049069878 17:58 17.972552584375
1051661094 04:54 4.9012299828593
1051661898 18:18 18.313688769483
1054339474 04:34 4.5744292894498
1054340319 18:39 18.656400943241
1056931476 04:36 4.6161204505189
1056932328 18:48 18.808871657766
1059609894 04:54 4.9068825098364
1059610715 18:35 18.599286002028
1062288314 05:14 5.2368895570738
1062289083 18:03 18.060541787879
1064880332 05:32 5.542366581139
1064881044 17:24 17.411505614917
1067558754 05:54 5.9162088420581
1067559410 16:50 16.833698570628
1070150780 06:20 6.3462215520697
1070151395 16:35 16.583589055537
---- ACTUAL OUTPUT
1041293199 06:39 6.6524557618962
1041293806 16:46 16.769374867459
1043971592 06:32 6.5453702926602
1043972233 17:13 17.217524708736
1046390766 06:06 6.1156526756851
1046391456 17:36 17.6108549623
1049069128 05:28 5.4727420290691
1049069878 17:58 17.972552584375
1051661094 04:54 4.9012299828593
1051661898 18:18 18.313688769483
1054339474 04:34 4.5744292894498
1054340319 18:39 18.656400943241
1056931476 04:36 4.6161204505189
1056932328 18:48 18.808871657766
1059609894 04:54 4.9068825098365
1059610715 18:35 18.599286002028
1062288314 05:14 5.2368895570738
1062289083 18:03 18.060541787879
1064880332 05:32 5.542366581139
1064881044 17:24 17.411505614917
1067558754 05:54 5.9162088420581
1067559410 16:50 16.833698570628
1070150780 06:20 6.3462215520697
1070151395 16:35 16.583589055537
---- FAILED
================================================================================
015- 1059609894 04:54 4.9068825098364
015+ 1059609894 04:54 4.9068825098365
================================================================================
================================================================================
/home/zeev/php5/ext/standard/tests/math/bug24142.phpt
================================================================================
---- EXPECTED OUTPUT
5.04
5.05
---- ACTUAL OUTPUT
5.05
5.06
---- FAILED
================================================================================
001- 5.04
001+ 5.05
002- 5.05
002+ 5.06
================================================================================
================================================================================
/home/zeev/php5/ext/standard/tests/serialize/001.phpt
================================================================================
---- EXPECTED OUTPUT
N;
b:1;
b:0;
i:1;
i:0;
i:-1;
i:2147483647;
i:-2147483647;
d:1.123456789000000011213842299184761941432952880859375;
d:1;
d:0;
d:-1;
d:-1.123456789000000011213842299184761941432952880859375;
s:5:"hallo";
a:6:{i:0;i:1;i:1;d:1.100000000000000088817841970012523233890533447265625;i:2;s:5:"hallo";i:3;N;i:4;b:1;i:5;a:0:{}}
O:1:"t":1:{s:1:"a";s:5:"hallo";}
object(t)#%d (1) {
["a"]=>
string(5) "hallo"
}
__sleep called
O:1:"s":2:{s:1:"a";s:5:"hallo";s:1:"c";s:5:"world";}
__wakeup called
object(s)#%d (3) {
["a"]=>
string(5) "hallo"
["b"]=>
NULL
["c"]=>
string(5) "world"
}
array(2) {
["a"]=>
&string(4) "test"
["b"]=>
&string(4) "test"
}
a:2:{s:1:"a";s:4:"test";s:1:"b";R:2;}
array(2) {
["a"]=>
&string(4) "test"
["b"]=>
&string(4) "test"
}
---- ACTUAL OUTPUT
N;
b:1;
b:0;
i:1;
i:0;
i:-1;
i:2147483647;
i:-2147483647;
d:1.123456789000000011213842299184761941432952880859375;
d:1;
d:0;
d:-1;
d:-1.123456789000000011213842299184761941432952880859375;
s:5:"hallo";
a:6:{i:0;i:1;i:1;d:1.100000000000000088817841970012523233890533447265625;i:2;s:5:"hallo";i:3;N;i:4;b:1;i:5;a:0:{}}
O:1:"t":1:{s:1:"a";s:5:"hallo";}
object(t)#2 (1) {
["a"]=>
string(5) "hallo"
}
__sleep called
O:1:"s":2:{s:1:"a";s:5:"hallo";s:1:"c";s:5:"world";}
__wakeup called
object(s)#2 (3) {
["a"]=>
string(5) "hallo"
["b"]=>
NULL
["c"]=>
string(5) "world"
}
array(2) {
["a"]=>
&string(4) "test"
["b"]=>
&string(4) "test"
}
a:2:{s:1:"a";s:4:"test";s:1:"b";R:2;}
array(2) {
["a"]=>
&string(4) "test"
["b"]=>
&string(4) "test"
}
/home/rei/PHP_CVS/php-src/ext/standard/var_unserializer.re(169) : Freeing 0x08214C14 (16 bytes),
script=/home/zeev/php5/ext/standard/tests/serialize/001.php
---- FAILED
================================================================================
017- object(t)#%d (1) {
017+ object(t)#2 (1) {
024- object(s)#%d (3) {
024+ object(s)#2 (3) {
045+ /home/rei/PHP_CVS/php-src/ext/standard/var_unserializer.re(169) : Freeing 0x08214C14 (16
bytes), script=/home/zeev/php5/ext/standard/tests/serialize/001.php
================================================================================
================================================================================
BUILD ENVIRONMENT
================================================================================
OS:
Linux - Linux guardian.zend.office 2.4.18-14 #1 Wed Sep 4 13:35:50 EDT 2002 i686
Automake:
automake (GNU automake) 1.6.3
Written by Tom Tromey <tromey@redhat.com>.
Copyright 2002 Free Software Foundation, Inc.
This is free software; see the source for copying conditions. There is NO
warranty; not even for MERCHANTABILITY or FITNESS FOR A PARTICULAR PURPOSE.
Autoconf:
autoconf (GNU Autoconf) 2.53
Written by David J. MacKenzie and Akim Demaille.
Copyright 2002 Free Software Foundation, Inc.
This is free software; see the source for copying conditions. There is NO
warranty; not even for MERCHANTABILITY or FITNESS FOR A PARTICULAR PURPOSE.
Libtool:
Compiler:
Reading specs from /usr/lib/gcc-lib/i386-redhat-linux/3.2/specs
Configured with: ../configure --prefix=/usr --mandir=/usr/share/man --infodir=/usr/share/info
--enable-shared --enable-threads=posix --disable-checking --host=i386-redhat-linux
--with-system-zlib --enable-__cxa_atexit
Thread model: posix
gcc version 3.2 20020903 (Red Hat Linux 8.0 3.2-7)
Bison:
bison (GNU Bison) 1.35
Copyright 1984, 1986, 1989, 1992, 2000, 2001, 2002
Free Software Foundation, Inc.
This is free software; see the source for copying conditions. There is NO
warranty; not even for MERCHANTABILITY or FITNESS FOR A PARTICULAR PURPOSE.
Libraries:
libcrypt.so.1 => /lib/libcrypt.so.1 (0x40025000)
libresolv.so.2 => /lib/libresolv.so.2 (0x40053000)
libm.so.6 => /lib/i686/libm.so.6 (0x40065000)
libdl.so.2 => /lib/libdl.so.2 (0x40087000)
libnsl.so.1 => /lib/libnsl.so.1 (0x4008a000)
libc.so.6 => /lib/i686/libc.so.6 (0x42000000)
/lib/ld-linux.so.2 => /lib/ld-linux.so.2 (0x40000000)
User's E-mail: zeev at zend dot com
================================================================================
PHPINFO
================================================================================
phpinfo()
PHP Version => 5.0.0b2-dev
System => Linux guardian.zend.office 2.4.18-14 #1 Wed Sep 4 13:35:50 EDT 2002 i686
Build Date => Jul 2 2003 15:50:53
Configure Command => '../configure' '--disable-xml'
'--disable-dom' '--disable-simplexml' '--without-pear'
'--enable-debug' '--disable-wddx'
Server API => Command Line Interface
Virtual Directory Support => disabled
Configuration File (php.ini) Path => /usr/local/lib
PHP API => 20030518
PHP Extension => 20020429
Zend Extension => 90021012
Debug Build => yes
Thread Safety => disabled
Registered PHP Streams => php, http, ftp
This program makes use of the Zend Scripting Language Engine:
Zend Engine v2.0.0-dev, Copyright (c) 1998-2003 Zend Technologies
_______________________________________________________________________
Configuration
PHP Core
Directive => Local Value => Master Value
allow_call_time_pass_reference => On => On
allow_url_fopen => On => On
always_populate_raw_post_data => Off => Off
arg_separator.input => & => &
arg_separator.output => & => &
asp_tags => Off => Off
auto_append_file => no value => no value
auto_prepend_file => no value => no value
browscap => no value => no value
default_charset => no value => no value
default_mimetype => text/html => text/html
define_syslog_variables => Off => Off
disable_classes => no value => no value
disable_functions => no value => no value
display_errors => On => On
display_startup_errors => Off => Off
doc_root => no value => no value
docref_ext => no value => no value
docref_root => no value => no value
enable_dl => On => On
error_append_string => no value => no value
error_log => no value => no value
error_prepend_string => no value => no value
error_reporting => no value => no value
expose_php => On => On
extension_dir => /usr/local/lib/php/extensions/debug-non-zts-20020429 =>
/usr/local/lib/php/extensions/debug-non-zts-20020429
file_uploads => On => On
gpc_order => GPC => GPC
highlight.bg => #FFFFFF => #FFFFFF
highlight.comment => #FF8000 => #FF8000
highlight.default => #0000BB => #0000BB
highlight.html => #000000 => #000000
highlight.keyword => #007700 => #007700
highlight.string => #DD0000 => #DD0000
html_errors => On => On
ignore_repeated_errors => Off => Off
ignore_repeated_source => Off => Off
ignore_user_abort => Off => Off
implicit_flush => Off => Off
include_path => .: => .:
log_errors => Off => Off
log_errors_max_len => 1024 => 1024
magic_quotes_gpc => On => On
magic_quotes_runtime => Off => Off
magic_quotes_sybase => Off => Off
mail.force_extra_parameters => no value => no value
max_execution_time => 30 => 30
max_input_time => -1 => -1
open_basedir => no value => no value
output_buffering => 0 => 0
output_handler => no value => no value
post_max_size => 8M => 8M
precision => 14 => 14
register_argc_argv => On => On
register_globals => Off => Off
register_long_arrays => On => On
report_memleaks => On => On
report_zend_debug => Off => Off
safe_mode => Off => Off
safe_mode_exec_dir => /usr/local/php/bin => /usr/local/php/bin
safe_mode_gid => Off => Off
safe_mode_include_dir => no value => no value
sendmail_from => no value => no value
sendmail_path => /usr/sbin/sendmail -t -i => /usr/sbin/sendmail -t -i
serialize_precision => 100 => 100
short_open_tag => On => On
SMTP => localhost => localhost
smtp_port => 25 => 25
sql.safe_mode => Off => Off
track_errors => Off => Off
unserialize_callback_func => no value => no value
upload_max_filesize => 2M => 2M
upload_tmp_dir => no value => no value
user_dir => no value => no value
variables_order => no value => no value
xmlrpc_error_number => 0 => 0
xmlrpc_errors => Off => Off
y2k_compliance => On => On
zend2.implicit_clone => no value => no value
ctype
ctype functions => enabled
pcre
PCRE (Perl Compatible Regular Expressions) Support => enabled
PCRE Library Version => 4.3 21-May-2003
posix
Revision => $Revision: 1.56 $
session
Session Support => enabled
Registered save handlers => files user sqlite
Directive => Local Value => Master Value
session.auto_start => Off => Off
session.bug_compat_42 => On => On
session.bug_compat_warn => On => On
session.cache_expire => 180 => 180
session.cache_limiter => nocache => nocache
session.cookie_domain => no value => no value
session.cookie_lifetime => 0 => 0
session.cookie_path => / => /
session.cookie_secure => Off => Off
session.entropy_file => no value => no value
session.entropy_length => 0 => 0
session.gc_divisor => 100 => 100
session.gc_maxlifetime => 1440 => 1440
session.gc_probability => 1 => 1
session.hash_bits_per_character => 4 => 4
session.hash_function => 0 => 0
session.name => PHPSESSID => PHPSESSID
session.referer_check => no value => no value
session.save_handler => files => files
session.save_path => /tmp => /tmp
session.serialize_handler => php => php
session.use_cookies => On => On
session.use_only_cookies => Off => Off
session.use_trans_sid => Off => Off
sqlite
SQLite support => enabled
PECL Module version => 1.1-dev $Id: sqlite.c,v 1.69 2003/07/01 17:55:32 helly Exp $
SQLite Library => 2.8.3
SQLite Encoding => iso8859
Directive => Local Value => Master Value
sqlite.assoc_case => 0 => 0
standard
Regex Library => Bundled library enabled
Dynamic Library Support => enabled
Path to sendmail => /usr/sbin/sendmail -t -i
Directive => Local Value => Master Value
assert.active => 1 => 1
assert.bail => 0 => 0
assert.callback => no value => no value
assert.quiet_eval => 0 => 0
assert.warning => 1 => 1
auto_detect_line_endings => 0 => 0
date.default_latitude => 31.7667 => 31.7667
date.default_longitude => 35.2333 => 35.2333
date.sunrise_zenith => 90.83 => 90.83
date.sunset_zenith => 90.83 => 90.83
default_socket_timeout => 60 => 60
safe_mode_allowed_env_vars => PHP_ => PHP_
safe_mode_protected_env_vars => LD_LIBRARY_PATH => LD_LIBRARY_PATH
url_rewriter.tags => a=href,area=href,frame=src,form=,fieldset= =>
a=href,area=href,frame=src,form=,fieldset=
user_agent => no value => no value
tokenizer
Tokenizer Support => enabled
Additional Modules
Module Name
Environment
Variable => Value
REMOTEHOST => int.zend.com
SUPPORTED => en_US.UTF-8:en_US:en
HOSTNAME => guardian.zend.office
TEST_PHP_SRCDIR => /home/zeev/php5
TERM => screen
SHELL => /bin/sh
HOST => guardian.zend.office
MAKEFLAGS =>
SSH_CLIENT => deleted
QTDIR => /usr/lib/qt3-gcc3.2
SSH_TTY => deleted
USER => zeev
GROUP => zend
LS_COLORS =>
SCRIPT_FILENAME =>
SSH_AUTH_SOCK => deleted
HOSTTYPE => i386-linux
MAKELEVEL => 1
MFLAGS =>
PATH => /usr/local/bin:/bin:/usr/bin:/usr/X11R6/bin
MAIL => /var/mail/zeev
_ => /home/zeev/php5/cgi/sapi/cli/php
PWD => /home/zeev/php5
LANG => en_US.UTF-8
TEST_PHP_EXECUTABLE => /home/zeev/php5/cgi/sapi/cli/php
REDIRECT_STATUS =>
PATH_TRANSLATED =>
SSH_ASKPASS => /usr/libexec/openssh/gnome-ssh-askpass
HOME => /home/zeev
SHLVL => 3
CONTENT_LENGTH =>
OSTYPE => linux
VENDOR => intel
LOGNAME => zeev
MACHTYPE => i386
QUERY_STRING =>
LESSOPEN => |/usr/bin/lesspipe.sh %s
CONTENT_TYPE =>
CC => gcc
REQUEST_METHOD =>
G_BROKEN_FILENAMES => 1
PHP Variables
Variable => Value
_SERVER["REMOTEHOST"] => int.zend.com
_SERVER["SUPPORTED"] => en_US.UTF-8:en_US:en
_SERVER["HOSTNAME"] => guardian.zend.office
_SERVER["TEST_PHP_SRCDIR"] => /home/zeev/php5
_SERVER["TERM"] => screen
_SERVER["SHELL"] => /bin/sh
_SERVER["HOST"] => guardian.zend.office
_SERVER["MAKEFLAGS"] =>
_SERVER["SSH_CLIENT"] => deleted
_SERVER["QTDIR"] => /usr/lib/qt3-gcc3.2
_SERVER["SSH_TTY"] => deleted
_SERVER["USER"] => zeev
_SERVER["GROUP"] => zend
_SERVER["LS_COLORS"] =>
_SERVER["SCRIPT_FILENAME"] =>
_SERVER["SSH_AUTH_SOCK"] => deleted
_SERVER["HOSTTYPE"] => i386-linux
_SERVER["MAKELEVEL"] => 1
_SERVER["MFLAGS"] =>
_SERVER["PATH"] => /usr/local/bin:/bin:/usr/bin:/usr/X11R6/bin
_SERVER["MAIL"] => /var/mail/zeev
_SERVER["_"] => /home/zeev/php5/cgi/sapi/cli/php
_SERVER["PWD"] => /home/zeev/php5
_SERVER["LANG"] => en_US.UTF-8
_SERVER["TEST_PHP_EXECUTABLE"] => /home/zeev/php5/cgi/sapi/cli/php
_SERVER["REDIRECT_STATUS"] =>
_SERVER["PATH_TRANSLATED"] =>
_SERVER["SSH_ASKPASS"] => /usr/libexec/openssh/gnome-ssh-askpass
_SERVER["HOME"] => /home/zeev
_SERVER["SHLVL"] => 3
_SERVER["CONTENT_LENGTH"] =>
_SERVER["OSTYPE"] => linux
_SERVER["VENDOR"] => intel
_SERVER["LOGNAME"] => zeev
_SERVER["MACHTYPE"] => i386
_SERVER["QUERY_STRING"] =>
_SERVER["LESSOPEN"] => |/usr/bin/lesspipe.sh %s
_SERVER["CONTENT_TYPE"] =>
_SERVER["CC"] => gcc
_SERVER["REQUEST_METHOD"] =>
_SERVER["G_BROKEN_FILENAMES"] => 1
_SERVER["PHP_SELF"] =>
_SERVER["SCRIPT_NAME"] =>
_SERVER["DOCUMENT_ROOT"] =>
_SERVER["argv"] => Array
(
)
_SERVER["argc"] => 0
_ENV["REMOTEHOST"] => int.zend.com
_ENV["SUPPORTED"] => en_US.UTF-8:en_US:en
_ENV["HOSTNAME"] => guardian.zend.office
_ENV["TEST_PHP_SRCDIR"] => /home/zeev/php5
_ENV["TERM"] => screen
_ENV["SHELL"] => /bin/sh
_ENV["HOST"] => guardian.zend.office
_ENV["MAKEFLAGS"] =>
_ENV["SSH_CLIENT"] => deleted
_ENV["QTDIR"] => /usr/lib/qt3-gcc3.2
_ENV["SSH_TTY"] => deleted
_ENV["USER"] => zeev
_ENV["GROUP"] => zend
_ENV["LS_COLORS"] =>
_ENV["SCRIPT_FILENAME"] =>
_ENV["SSH_AUTH_SOCK"] => deleted
_ENV["HOSTTYPE"] => i386-linux
_ENV["MAKELEVEL"] => 1
_ENV["MFLAGS"] =>
_ENV["PATH"] => /usr/local/bin:/bin:/usr/bin:/usr/X11R6/bin
_ENV["MAIL"] => /var/mail/zeev
_ENV["_"] => /home/zeev/php5/cgi/sapi/cli/php
_ENV["PWD"] => /home/zeev/php5
_ENV["LANG"] => en_US.UTF-8
_ENV["TEST_PHP_EXECUTABLE"] => /home/zeev/php5/cgi/sapi/cli/php
_ENV["REDIRECT_STATUS"] =>
_ENV["PATH_TRANSLATED"] =>
_ENV["SSH_ASKPASS"] => /usr/libexec/openssh/gnome-ssh-askpass
_ENV["HOME"] => /home/zeev
_ENV["SHLVL"] => 3
_ENV["CONTENT_LENGTH"] =>
_ENV["OSTYPE"] => linux
_ENV["VENDOR"] => intel
_ENV["LOGNAME"] => zeev
_ENV["MACHTYPE"] => i386
_ENV["QUERY_STRING"] =>
_ENV["LESSOPEN"] => |/usr/bin/lesspipe.sh %s
_ENV["CONTENT_TYPE"] =>
_ENV["CC"] => gcc
_ENV["REQUEST_METHOD"] =>
_ENV["G_BROKEN_FILENAMES"] => 1
PHP License
This program is free software; you can redistribute it and/or modify
it under the terms of the PHP License as published by the PHP Group
and included in the distribution in the file: LICENSE
This program is distributed in the hope that it will be useful,
but WITHOUT ANY WARRANTY; without even the implied warranty of
MERCHANTABILITY or FITNESS FOR A PARTICULAR PURPOSE.
If you did not receive a copy of the PHP license, or have any
questions about PHP licensing, please contact license@php.net.