Test results for 5.0.0b2-dev [failed]

From: Date: Wed, 02 Jul 2003 20:52:57 +0000
Subject: Test results for 5.0.0b2-dev [failed]
Groups: php.qa 
Request: Send a blank email to php-qa+get-14749@lists.php.net to get a copy of this message
===================================================================== FAILED TEST SUMMARY --------------------------------------------------------------------- ZE2 factory and singleton, test 2 [tests/classes/factory_and_singleton_002.phpt] Locale settings affecting float parsing [tests/lang/034.phpt] Bug #24436: isset()/empty() produce errors with non-existent variables in classes [Zend/tests/bug24436.phpt] GMP functionality test - factorial [ext/gmp/tests/002.phpt] Translit failure [ext/iconv/tests/translit-failure.phpt] serializing references test case using globals [ext/session/tests/019.phpt] rewriter uses arg_seperator.output for modifying URLs [ext/session/tests/020.phpt] rewriter handles form and fieldset tags correctly [ext/session/tests/021.phpt] IPv6 Loopback test [ext/sockets/tests/ipv6loop.phpt] File type functions [ext/standard/tests/file/001.phpt] date_sunrise() and date_sunset() functions [ext/standard/tests/general_functions/sunfuncts.phpt] Bug #24142 (round() problems) [ext/standard/tests/math/bug24142.phpt] Check for mktime with out-of-range parameters [ext/standard/tests/time/003.phpt] mktime() [ext/standard/tests/time/mktime.phpt] wddz deserialization test [ext/wddx/tests/001.phpt] XML parser test, function callbacks [ext/xml/tests/xml001.phpt] XML parser test, object tuple callbacks [ext/xml/tests/xml002.phpt] XML parser test, xml_set_object callbacks [ext/xml/tests/xml003.phpt] ===================================================================== ===================================================================== TEST RESULT SUMMARY --------------------------------------------------------------------- Exts skipped : 46 Exts tested : 37 --------------------------------------------------------------------- Number of tests : 698 Tests skipped : 148 (21.2%) Tests warned : 0 ( 0.0%) Tests failed : 18 ( 2.6%) Tests passed : 532 (76.2%) --------------------------------------------------------------------- Time taken : 816 seconds ===================================================================== ===================================================================== FAILED TEST SUMMARY --------------------------------------------------------------------- ZE2 factory and singleton, test 2 [tests/classes/factory_and_singleton_002.phpt] Locale settings affecting float parsing [tests/lang/034.phpt] Bug #24436: isset()/empty() produce errors with non-existent variables in classes [Zend/tests/bug24436.phpt] GMP functionality test - factorial [ext/gmp/tests/002.phpt] Translit failure [ext/iconv/tests/translit-failure.phpt] serializing references test case using globals [ext/session/tests/019.phpt] rewriter uses arg_seperator.output for modifying URLs [ext/session/tests/020.phpt] rewriter handles form and fieldset tags correctly [ext/session/tests/021.phpt] IPv6 Loopback test [ext/sockets/tests/ipv6loop.phpt] File type functions [ext/standard/tests/file/001.phpt] date_sunrise() and date_sunset() functions [ext/standard/tests/general_functions/sunfuncts.phpt] Bug #24142 (round() problems) [ext/standard/tests/math/bug24142.phpt] Check for mktime with out-of-range parameters [ext/standard/tests/time/003.phpt] mktime() [ext/standard/tests/time/mktime.phpt] wddz deserialization test [ext/wddx/tests/001.phpt] XML parser test, function callbacks [ext/xml/tests/xml001.phpt] XML parser test, object tuple callbacks [ext/xml/tests/xml002.phpt] XML parser test, xml_set_object callbacks [ext/xml/tests/xml003.phpt] ===================================================================== ================================================================================ /Users/tychay/Documents/development/compile/php/php-5.0.0dev-030702/tests/classes/factory_and_singleton_002.phpt ================================================================================ ---- EXPECTED OUTPUT Access static members NULL int(0) Create x and y int(1) int(1) int(1) int(1) Destruct x int(1) int(1) int(1) Destruct y int(1) int(1) Done ---- ACTUAL OUTPUT Access static members NULL int(0) Create x and y int(1) int(1) int(1) int(1) Destruct x int(1) int(1) int(1) Destruct y int(1) int(1) Done Fatal error: Call to protected destructor from context '' in Unknown on line 0 ---- FAILED ================================================================================ 017+ 018+ Fatal error: Call to protected destructor from context '' in Unknown on line 0 ================================================================================ ================================================================================ /Users/tychay/Documents/development/compile/php/php-5.0.0dev-030702/tests/lang/034.phpt ================================================================================ ---- EXPECTED OUTPUT 3,14 ---- ACTUAL OUTPUT 3.14 ---- FAILED ================================================================================ 001- 3,14 001+ 3.14 ================================================================================ ================================================================================ /Users/tychay/Documents/development/compile/php/php-5.0.0dev-030702/Zend/tests/bug24436.phpt ================================================================================ ---- EXPECTED OUTPUT Notice: Undefined property: test::$test in /home/derick/bug24436.php on line 11test1 Notice: Undefined property: test::$test in /home/derick/bug24436.php on line 12test2 test1 test2 ---- ACTUAL OUTPUT test1 test2 test1 test2 ---- FAILED ================================================================================ 001- Notice: Undefined property: test::$test in /home/derick/bug24436.php on line 11test1 001+ test1 002- 002+ test2 003- Notice: Undefined property: test::$test in /home/derick/bug24436.php on line 12test2 003+ test1 004- test1 004+ test2 005- test2 ================================================================================ ================================================================================ /Users/tychay/Documents/development/compile/php/php-5.0.0dev-030702/ext/gmp/tests/002.phpt ================================================================================ ---- EXPECTED OUTPUT 402387260077093773543702433923003985719374864210714632543799910429938512398629020592044208486969404800479988610197196058631666872994808558901323829669944590997424504087073759918823627727188732519779505950995276120874975462497043601418278094646496291056393887437886487337119181045825783647849977012476632889835955735432513185323958463075557409114262417474349347553428646576611667797396668820291207379143853719588249808126867838374559731746136085379534524221586593201928090878297308431392844403281231558611036976801357304216168747609675871348312025478589320767169132448426236131412508780208000261683151027341827977704784635868170164365024153691398281264810213092761244896359928705114964975419909342221566832572080821333186116811553615836546984046708975602900950537616475847728421889679646244945160765353408198901385442487984959953319101723355556602139450399736280750137837615307127761926849034352625200015888535147331611702103968175921510907788019393178114194545257223865541461062892187960223838971476088506276862967146674697562911234082439208160153780889893964518263243671616762179168909779911903754031274622289988005195444414282012187361745992642956581746628302955570299024324153181617210465832036786906117260158783520751516284225540265170483304226143974286933061690897968482590125458327168226458066526769958652682272807075781391858178889652208164348344825993266043367660176999612831860788386150279465955131156552036093988180612138558600301435694527224206344631797460594682573103790084024432438465657245014402821885252470935190620929023136493273497565513958720559654228749774011413346962715422845862377387538230483865688976461927383814900140767310446640259899490222221765904339901886018566526485061799702356193897017860040811889729918311021171229845901641921068884387121855646124960798722908519296819372388642614839657382291123125024186649353143970137428531926649875337218940694281434118520158014123344828015051399694290153483077644569099073152433278288269864602789864321139083506217095002597389863554277196742822248757586765752344220207573630569498825087968928162753848863396909959826280956121450994871701244516461260379029309120889086942028510640182154399457156805941872748998094254742173582401063677404595741785160829230135358081840096996372524230560855903700624271243416909004153690105933983835777939410970027753472000000000000000000000000000000000000000000000000000000000000000000000000000000000000000000000000000000000000000000000000000000000000000000000000000000000000000000000000000000000000000000000000000000000000000000000000000000000000000000000000000000000 ---- ACTUAL OUTPUT ---- FAILED ================================================================================ 001- 402387260077093773543702433923003985719374864210714632543799910429938512398629020592044208486969404800479988610197196058631666872994808558901323829669944590997424504087073759918823627727188732519779505950995276120874975462497043601418278094646496291056393887437886487337119181045825783647849977012476632889835955735432513185323958463075557409114262417474349347553428646576611667797396668820291207379143853719588249808126867838374559731746136085379534524221586593201928090878297308431392844403281231558611036976801357304216168747609675871348312025478589320767169132448426236131412508780208000261683151027341827977704784635868170164365024153691398281264810213092761244896359928705114964975419909342221566832572080821333186116811553615836546984046708975602900950537616475847728421889679646244945160765353408198901385442487984959953319101723355556602139450399736280750137837615307127761926849034352625200015888535147331611702103968175921510907788019393178114194545257223865541461062892187960223838971476088506276862967146674697562911234082439208160153780889893964518263243671616762179168909779911903754031274622289988005195444414282012187361745992642956581746628302955570299024324153181617210465832036786906117260158783520751516284225540265170483304226143974286933061690897968482590125458327168226458066526769958652682272807075781391858178889652208164348344825993266043367660176999612831860788386150279465955131156552036093988180612138558600301435694527224206344631797460594682573103790084024432438465657245014402821885252470935190620929023136493273497565513958720559654228749774011413346962715422845862377387538230483865688976461927383814900140767310446640259899490222221765904339901886018566526485061799702356193897017860040811889729918311021171229845901641921068884387121855646124960798722908519296819372388642614839657382291123125024186649353143970137428531926649875337218940694281434118520158014123344828015051399694290153483077644569099073152433278288269864602789864321139083506217095002597389863554277196742822248757586765752344220207573630569498825087968928162753848863396909959826280956121450994871701244516461260379029309120889086942028510640182154399457156805941872748998094254742173582401063677404595741785160829230135358081840096996372524230560855903700624271243416909004153690105933983835777939410970027753472000000000000000000000000000000000000000000000000000000000000000000000000000000000000000000000000000000000000000000000000000000000000000000000000000000000000000000000000000000000000000000000000000000000000000000000000000000000000000000000000000000000 001+ ================================================================================ ================================================================================ /Users/tychay/Documents/development/compile/php/php-5.0.0dev-030702/ext/iconv/tests/translit-failure.phpt ================================================================================ ---- EXPECTED OUTPUT wrong is right ---- ACTUAL OUTPUT ---- FAILED ================================================================================ 001- wrong is right 001+ ================================================================================ ================================================================================ /Users/tychay/Documents/development/compile/php/php-5.0.0dev-030702/ext/session/tests/019.phpt ================================================================================ ---- EXPECTED OUTPUT array(2) { ["o1"]=> &object(tfoo)#1 (1) { ["c"]=> int(42) } ["o2"]=> &object(tfoo)#1 (1) { ["c"]=> int(42) } } array(2) { ["o1"]=> &object(tfoo)#1 (1) { ["c"]=> int(44) } ["o2"]=> &object(tfoo)#1 (1) { ["c"]=> int(44) } } ---- ACTUAL OUTPUT ---- FAILED ================================================================================ 001- array(2) { 001+ 002- ["o1"]=> 003- &object(tfoo)#1 (1) { 004- ["c"]=> 005- int(42) 006- } 007- ["o2"]=> 008- &object(tfoo)#1 (1) { 009- ["c"]=> 010- int(42) 011- } 012- } 013- array(2) { 014- ["o1"]=> 015- &object(tfoo)#1 (1) { 016- ["c"]=> 017- int(44) 018- } 019- ["o2"]=> 020- &object(tfoo)#1 (1) { 021- ["c"]=> 022- int(44) 023- } 024- } ================================================================================ ================================================================================ /Users/tychay/Documents/development/compile/php/php-5.0.0dev-030702/ext/session/tests/020.phpt ================================================================================ ---- EXPECTED OUTPUT <a href="link.php?a=b&amp;PHPSESSID=abtest"> ---- ACTUAL OUTPUT ---- FAILED ================================================================================ 001- <a href="link.php?a=b&amp;PHPSESSID=abtest"> 001+ ================================================================================ ================================================================================ /Users/tychay/Documents/development/compile/php/php-5.0.0dev-030702/ext/session/tests/021.phpt ================================================================================ ---- EXPECTED OUTPUT <form><input type="hidden" name="PHPSESSID" value="abtest" /> <fieldset><input type="hidden" name="PHPSESSID" value="abtest" /> <form><input type="hidden" name="PHPSESSID" value="abtest" /> <fieldset> <form><input type="hidden" name="PHPSESSID" value="abtest" /> <fieldset> <form> <fieldset><input type="hidden" name="PHPSESSID" value="abtest" /> ---- ACTUAL OUTPUT ---- FAILED ================================================================================ 001- <form><input type="hidden" name="PHPSESSID" value="abtest" /> 001+ 002- <fieldset><input type="hidden" name="PHPSESSID" value="abtest" /> 003- <form><input type="hidden" name="PHPSESSID" value="abtest" /> 004- <fieldset> 005- <form><input type="hidden" name="PHPSESSID" value="abtest" /> 006- <fieldset> 007- <form> 008- <fieldset><input type="hidden" name="PHPSESSID" value="abtest" /> ================================================================================ ================================================================================ /Users/tychay/Documents/development/compile/php/php-5.0.0dev-030702/ext/sockets/tests/ipv6loop.phpt ================================================================================ ---- EXPECTED OUTPUT string(10) "ABCdef123 " ---- ACTUAL OUTPUT Warning: socket_connect(): unable to connect [65]: No route to host in /Users/tychay/Documents/development/compile/php/php-5.0.0dev-030702/ext/sockets/tests/ipv6loop.php on line 19 Unable to connect to server socket ---- FAILED ================================================================================ 001- string(10) "ABCdef123 001+ Warning: socket_connect(): unable to connect [65]: No route to host in /Users/tychay/Documents/development/compile/php/php-5.0.0dev-030702/ext/sockets/tests/ipv6loop.php on line 19 002- " 002+ Unable to connect to server socket ================================================================================ ================================================================================ /Users/tychay/Documents/development/compile/php/php-5.0.0dev-030702/ext/standard/tests/file/001.phpt ================================================================================ ---- EXPECTED OUTPUT test.file does not exist test.file exists test.link exists test.file is not a symlink test.link is a symlink test.file exists test.link lstat and stat differ at element 1 test.link lstat and stat differ at element 2 test.link lstat and stat differ at element 7 test.link lstat and stat differ at element 8 test.link lstat and stat differ at element 9 test.link lstat and stat differ at element 10 test.file is file test.link is link test.file permissions are 0744 test.file size is 0 test.file is writeable test.file is readable test.file is executable test.file is a regular file test.link is a regular file test.link is not a directory ../file is a directory test.file is not a directory test.file does not exist test.file does not exist ---- ACTUAL OUTPUT test.file does not exist test.file exists test.link exists test.file is not a symlink test.link is a symlink test.file exists test.link lstat and stat differ at element 1 test.link lstat and stat differ at element 2 test.link lstat and stat differ at element 7 test.link lstat and stat differ at element 8 test.link lstat and stat differ at element 9 test.file is file test.link is link test.file permissions are 0744 test.file size is 0 test.file is writeable test.file is readable test.file is executable test.file is a regular file test.link is a regular file test.link is not a directory ../file is a directory test.file is not a directory test.file does not exist test.file does not exist ---- FAILED ================================================================================ 012- test.link lstat and stat differ at element 10 012+ test.file is file 013- test.file is file 013+ test.link is link 014- test.link is link 014+ test.file permissions are 0744 015- test.file permissions are 0744 015+ test.file size is 0 016- test.file size is 0 016+ test.file is writeable 017- test.file is writeable 017+ test.file is readable 018- test.file is readable 018+ test.file is executable 019- test.file is executable 019+ test.file is a regular file 020- test.file is a regular file 020+ test.link is a regular file 021- test.link is a regular file 021+ test.link is not a directory 022- test.link is not a directory 022+ ../file is a directory 023- ../file is a directory 023+ test.file is not a directory 024- test.file is not a directory 024+ test.file does not exist 026- test.file does not exist ================================================================================ ================================================================================ /Users/tychay/Documents/development/compile/php/php-5.0.0dev-030702/ext/standard/tests/general_functions/sunfuncts.phpt ================================================================================ ---- EXPECTED OUTPUT 1041293199 06:39 6.6524557618962 1041293806 16:46 16.769374867459 1043971592 06:32 6.5453702926602 1043972233 17:13 17.217524708736 1046390766 06:06 6.1156526756851 1046391456 17:36 17.6108549623 1049069128 05:28 5.4727420290691 1049069878 17:58 17.972552584375 1051661094 04:54 4.9012299828593 1051661898 18:18 18.313688769483 1054339474 04:34 4.5744292894498 1054340319 18:39 18.656400943241 1056931476 04:36 4.6161204505189 1056932328 18:48 18.808871657766 1059609894 04:54 4.9068825098364 1059610715 18:35 18.599286002028 1062288314 05:14 5.2368895570738 1062289083 18:03 18.060541787879 1064880332 05:32 5.542366581139 1064881044 17:24 17.411505614917 1067558754 05:54 5.9162088420581 1067559410 16:50 16.833698570628 1070150780 06:20 6.3462215520697 1070151395 16:35 16.583589055537 ---- ACTUAL OUTPUT 1041293199 06:39 6.6524557618962 1041293806 16:46 16.769374867459 1043971592 06:32 6.5453702926602 1043972233 17:13 17.217524708736 1046390766 06:06 6.1156526756851 1046391456 17:36 17.6108549623 1049069128 05:28 5.4727420290691 1049069878 17:58 17.972552584375 1051661094 04:54 4.9012299828593 1051661898 18:18 18.313688769483 1054339474 04:34 4.5744292894498 1054340319 18:39 18.656400943241 1056931476 04:36 4.6161204505189 1056932328 18:48 18.808871657766 1059609894 04:54 4.9068825098365 1059610715 18:35 18.599286002028 1062288314 05:14 5.2368895570738 1062289083 18:03 18.060541787879 1064880332 05:32 5.542366581139 1064881044 17:24 17.411505614917 1067558754 05:54 5.9162088420581 1067559410 16:50 16.833698570628 1070150780 06:20 6.3462215520697 1070151395 16:35 16.583589055537 ---- FAILED ================================================================================ 015- 1059609894 04:54 4.9068825098364 015+ 1059609894 04:54 4.9068825098365 ================================================================================ ================================================================================ /Users/tychay/Documents/development/compile/php/php-5.0.0dev-030702/ext/standard/tests/math/bug24142.phpt ================================================================================ ---- EXPECTED OUTPUT 5.04 5.05 ---- ACTUAL OUTPUT 5.05 5.06 ---- FAILED ================================================================================ 001- 5.04 001+ 5.05 002- 5.05 002+ 5.06 ================================================================================ ================================================================================ /Users/tychay/Documents/development/compile/php/php-5.0.0dev-030702/ext/standard/tests/time/003.phpt ================================================================================ ---- EXPECTED OUTPUT 2000-02-29 2000-02-28 2000-02-29 2001-02-28 2001-03-01 1999-11-30 2000-05-29 12:00:00 2000-05-29 13:00:00 2000-05-29 12:00:00 2000-01-31 12:00:00 2000-01-31 12:00:00 2000-01-31 11:00:00 2000-04-29 12:00:00 2000-04-29 13:00:00 2000-04-29 12:00:00 ---- ACTUAL OUTPUT 2000-02-29 2000-02-28 2000-02-29 2001-02-28 2001-03-01 1999-11-30 2000-05-29 12:00:00 2000-05-29 12:00:00 1969-12-31 23:58:58 2000-01-31 12:00:00 2000-01-31 12:00:00 1969-10-01 23:58:58 2000-04-29 12:00:00 2000-04-29 12:00:00 1969-12-29 23:58:58 ---- FAILED ================================================================================ 008- 2000-05-29 13:00:00 008+ 2000-05-29 12:00:00 009- 2000-05-29 12:00:00 009+ 1969-12-31 23:58:58 012- 2000-01-31 11:00:00 012+ 1969-10-01 23:58:58 014- 2000-04-29 13:00:00 014+ 2000-04-29 12:00:00 015- 2000-04-29 12:00:00 015+ 1969-12-29 23:58:58 ================================================================================ ================================================================================ /Users/tychay/Documents/development/compile/php/php-5.0.0dev-030702/ext/standard/tests/time/mktime.phpt ================================================================================ ---- EXPECTED OUTPUT int(1009843200) int(1009843200) int(1009843200) int(1009843200) int(1025481600) int(1025481600) int(1025481600) int(1025481600) int(1009839600) int(1009839600) int(1009839600) int(1009836000) int(1025474400) int(1025474400) int(1025478000) int(1025474400) ---- ACTUAL OUTPUT int(1009843200) int(1009843200) int(1009843200) int(-3662) int(1025481600) int(1025481600) int(1025481600) int(-3662) int(1009843200) int(1009843200) int(1009843200) int(-3662) int(1025481600) int(1025481600) int(1025481600) int(-3662) ---- FAILED ================================================================================ 004- int(1009843200) 004+ int(-3662) 008- int(1025481600) 008+ int(-3662) 009- int(1009839600) 009+ int(1009843200) 010- int(1009839600) 010+ int(1009843200) 011- int(1009839600) 011+ int(1009843200) 012- int(1009836000) 012+ int(-3662) 013- int(1025474400) 013+ int(1025481600) 014- int(1025474400) 014+ int(1025481600) 015- int(1025478000) 015+ int(1025481600) 016- int(1025474400) 016+ int(-3662) ================================================================================ ================================================================================ /Users/tychay/Documents/development/compile/php/php-5.0.0dev-030702/ext/wddx/tests/001.phpt ================================================================================ ---- EXPECTED OUTPUT array(11) { ["aNull"]=> NULL ["aString"]=> string(8) "a string" ["aNumber"]=> float(-12.456) ["aDateTime"]=> int(897600732) ["aDateTime2"]=> string(19) "1930-06-12T04:32:12" ["aDateTime3"]=> string(19) "2040-06-12T04:32:12" ["aBoolean"]=> bool(true) ["anArray"]=> array(2) { [0]=> int(10) [1]=> string(14) "second element" } ["aBinary"]=> string(11) "binary data" ["anObject"]=> array(2) { ["s"]=> string(8) "a string" ["n"]=> float(-12.456) } ["aRecordset"]=> array(2) { ["NAME"]=> array(2) { [0]=> string(8) "John Doe" [1]=> string(8) "Jane Doe" } ["AGE"]=> array(2) { [0]=> int(34) [1]=> int(31) } } } ---- ACTUAL OUTPUT array(11) { ["aNull"]=> NULL ["aString"]=> string(8) "a string" ["aNumber"]=> float(-12.456) ["aDateTime"]=> int(897600732) ["aDateTime2"]=> int(-1248316068) ["aDateTime3"]=> string(19) "2040-06-12T04:32:12" ["aBoolean"]=> bool(true) ["anArray"]=> array(2) { [0]=> int(10) [1]=> string(14) "second element" } ["aBinary"]=> string(11) "binary data" ["anObject"]=> array(2) { ["s"]=> string(8) "a string" ["n"]=> float(-12.456) } ["aRecordset"]=> array(2) { ["NAME"]=> array(2) { [0]=> string(8) "John Doe" [1]=> string(8) "Jane Doe" } ["AGE"]=> array(2) { [0]=> int(34) [1]=> int(31) } } } ---- FAILED ================================================================================ 011- string(19) "1930-06-12T04:32:12" 011+ int(-1248316068) ================================================================================ ================================================================================ /Users/tychay/Documents/development/compile/php/php-5.0.0dev-030702/ext/xml/tests/xml001.phpt ================================================================================ ---- EXPECTED OUTPUT {?[<?xml version="1.0" encoding="ISO-8859-1"?>]}{?[ ]}{?[<!DOCTYPE]}{?[ ]}{?[phptest]}{?[ ]}{?[SYSTEM]}{?[ ]}{?["notfound.dtd"]}{?[ ]}{?[[]}{?[ ]}{?[<!ENTITY]}{?[ ]}{?[%]}{?[ ]}{?[incent]}{?[ ]}{?[SYSTEM]}{?[ ]}{?["inc.ent"]}{?[>]}{?[ ]}{?[%incent;]}{?[ ]}{?[]]}{?[>]}{?[ ]}{ROOT ID="elem1"}{CDATA[ ]}{CDATA[ Plain text.]}{CDATA[ ]}{CDATA[ ]}{ELEM1}{CDATA[ ]}{CDATA[ ]}{?[<!-- comment -->]}{CDATA[ ]}{CDATA[ ]}{ELEM2}{CDATA[ ]}{CDATA[ ]}{?[<![CDATA[]}{CDATA[CDATA block]}{?[]]>]}{CDATA[ ]}{CDATA[ ]}{ELEM3}{CDATA[ ]}{CDATA[ ]}{ENTREF[&included-entity;]}{CDATA[ ]}{CDATA[ ]}{ELEM4}{CDATA[ ]}{CDATA[ ]}{PI[test,processing instruction ]}{CDATA[ ]}{CDATA[ ]}{/ELEM4}{CDATA[ ]}{CDATA[ ]}{/ELEM3}{CDATA[ ]}{CDATA[ ]}{/ELEM2}{CDATA[ ]}{CDATA[ ]}{/ELEM1}{CDATA[ ]}{/ROOT}{?[ ]}parse complete ---- ACTUAL OUTPUT {EXTENTREF[incent,,,inc.ent]} {ROOT ID="elem1"}{CDATA[ Plain text. ]}{ELEM1}{CDATA[ ]}{?[<-- comment -->]}{CDATA[ ]}{ELEM2}{CDATA[ ]}{CDATA[CDATA block]}{CDATA[ ]}{ELEM3}{CDATA[ ]}{ENTREF[&included-entity;]}{CDATA[ ]}{ELEM4}{CDATA[ ]}{PI[test,processing instruction ]}{CDATA[ ]}{/ELEM4}{CDATA[ ]}{/ELEM3}{CDATA[ ]}{/ELEM2}{CDATA[ ]}{/ELEM1}{CDATA[ ]}{/ROOT}XML error: Undeclared entity warning at line 21 ---- FAILED ================================================================================ 001- {?[<?xml version="1.0" encoding="ISO-8859-1"?>]}{?[ 001+ {EXTENTREF[incent,,,inc.ent]} 002- ]}{?[<!DOCTYPE]}{?[ ]}{?[phptest]}{?[ ]}{?[SYSTEM]}{?[ ]}{?["notfound.dtd"]}{?[ ]}{?[[]}{?[ 002+ {ROOT ID="elem1"}{CDATA[ 003- ]}{?[<!ENTITY]}{?[ ]}{?[%]}{?[ ]}{?[incent]}{?[ ]}{?[SYSTEM]}{?[ ]}{?["inc.ent"]}{?[>]}{?[ 003+ Plain text. 004- ]}{?[%incent;]}{?[ 004+ ]}{ELEM1}{CDATA[ 005- ]}{?[]]}{?[>]}{?[ 005+ ]}{?[<-- comment -->]}{CDATA[ 006- ]}{ROOT ID="elem1"}{CDATA[ 006+ ]}{ELEM2}{CDATA[ 007- ]}{CDATA[ Plain text.]}{CDATA[ 007+ ]}{CDATA[CDATA block]}{CDATA[ 008- ]}{CDATA[ ]}{ELEM1}{CDATA[ 008+ ]}{ELEM3}{CDATA[ 009- ]}{CDATA[ ]}{?[<!-- comment -->]}{CDATA[ 009+ ]}{ENTREF[&included-entity;]}{CDATA[ 010- ]}{CDATA[ ]}{ELEM2}{CDATA[ 010+ ]}{ELEM4}{CDATA[ 011- ]}{CDATA[ ]}{?[<![CDATA[]}{CDATA[CDATA block]}{?[]]>]}{CDATA[ 011+ ]}{PI[test,processing instruction ]}{CDATA[ 012- ]}{CDATA[ ]}{ELEM3}{CDATA[ 012+ ]}{/ELEM4}{CDATA[ 013- ]}{CDATA[ ]}{ENTREF[&included-entity;]}{CDATA[ 013+ ]}{/ELEM3}{CDATA[ 014- ]}{CDATA[ ]}{ELEM4}{CDATA[ 014+ ]}{/ELEM2}{CDATA[ 015- ]}{CDATA[ ]}{PI[test,processing instruction ]}{CDATA[ 015+ ]}{/ELEM1}{CDATA[ 016- ]}{CDATA[ ]}{/ELEM4}{CDATA[ 016+ ]}{/ROOT}XML error: Undeclared entity warning at line 21 017- ]}{CDATA[ ]}{/ELEM3}{CDATA[ 018- ]}{CDATA[ ]}{/ELEM2}{CDATA[ 019- ]}{CDATA[ ]}{/ELEM1}{CDATA[ 020- ]}{/ROOT}{?[ 021- ]}parse complete ================================================================================ ================================================================================ /Users/tychay/Documents/development/compile/php/php-5.0.0dev-030702/ext/xml/tests/xml002.phpt ================================================================================ ---- EXPECTED OUTPUT {?[<?xml version="1.0" encoding="ISO-8859-1"?>]}{?[ ]}{?[<!DOCTYPE]}{?[ ]}{?[phptest]}{?[ ]}{?[SYSTEM]}{?[ ]}{?["notfound.dtd"]}{?[ ]}{?[[]}{?[ ]}{?[<!ENTITY]}{?[ ]}{?[%]}{?[ ]}{?[incent]}{?[ ]}{?[SYSTEM]}{?[ ]}{?["inc.ent"]}{?[>]}{?[ ]}{?[%incent;]}{?[ ]}{?[]]}{?[>]}{?[ ]}{ROOT ID="elem1"}{CDATA[ ]}{CDATA[ Plain text.]}{CDATA[ ]}{CDATA[ ]}{ELEM1}{CDATA[ ]}{CDATA[ ]}{?[<!-- comment -->]}{CDATA[ ]}{CDATA[ ]}{ELEM2}{CDATA[ ]}{CDATA[ ]}{?[<![CDATA[]}{CDATA[CDATA block]}{?[]]>]}{CDATA[ ]}{CDATA[ ]}{ELEM3}{CDATA[ ]}{CDATA[ ]}{ENTREF[&included-entity;]}{CDATA[ ]}{CDATA[ ]}{ELEM4}{CDATA[ ]}{CDATA[ ]}{PI[test,processing instruction ]}{CDATA[ ]}{CDATA[ ]}{/ELEM4}{CDATA[ ]}{CDATA[ ]}{/ELEM3}{CDATA[ ]}{CDATA[ ]}{/ELEM2}{CDATA[ ]}{CDATA[ ]}{/ELEM1}{CDATA[ ]}{/ROOT}{?[ ]}parse complete ---- ACTUAL OUTPUT ---- FAILED ================================================================================ 001- {?[<?xml version="1.0" encoding="ISO-8859-1"?>]}{?[ 001+ 002- ]}{?[<!DOCTYPE]}{?[ ]}{?[phptest]}{?[ ]}{?[SYSTEM]}{?[ ]}{?["notfound.dtd"]}{?[ ]}{?[[]}{?[ 003- ]}{?[<!ENTITY]}{?[ ]}{?[%]}{?[ ]}{?[incent]}{?[ ]}{?[SYSTEM]}{?[ ]}{?["inc.ent"]}{?[>]}{?[ 004- ]}{?[%incent;]}{?[ 005- ]}{?[]]}{?[>]}{?[ 006- ]}{ROOT ID="elem1"}{CDATA[ 007- ]}{CDATA[ Plain text.]}{CDATA[ 008- ]}{CDATA[ ]}{ELEM1}{CDATA[ 009- ]}{CDATA[ ]}{?[<!-- comment -->]}{CDATA[ 010- ]}{CDATA[ ]}{ELEM2}{CDATA[ 011- ]}{CDATA[ ]}{?[<![CDATA[]}{CDATA[CDATA block]}{?[]]>]}{CDATA[ 012- ]}{CDATA[ ]}{ELEM3}{CDATA[ 013- ]}{CDATA[ ]}{ENTREF[&included-entity;]}{CDATA[ 014- ]}{CDATA[ ]}{ELEM4}{CDATA[ 015- ]}{CDATA[ ]}{PI[test,processing instruction ]}{CDATA[ 016- ]}{CDATA[ ]}{/ELEM4}{CDATA[ 017- ]}{CDATA[ ]}{/ELEM3}{CDATA[ 018- ]}{CDATA[ ]}{/ELEM2}{CDATA[ 019- ]}{CDATA[ ]}{/ELEM1}{CDATA[ 020- ]}{/ROOT}{?[ 021- ]}parse complete ================================================================================ ================================================================================ /Users/tychay/Documents/development/compile/php/php-5.0.0dev-030702/ext/xml/tests/xml003.phpt ================================================================================ ---- EXPECTED OUTPUT {?[<?xml version="1.0" encoding="ISO-8859-1"?>]}{?[ ]}{?[<!DOCTYPE]}{?[ ]}{?[phptest]}{?[ ]}{?[SYSTEM]}{?[ ]}{?["notfound.dtd"]}{?[ ]}{?[[]}{?[ ]}{?[<!ENTITY]}{?[ ]}{?[%]}{?[ ]}{?[incent]}{?[ ]}{?[SYSTEM]}{?[ ]}{?["inc.ent"]}{?[>]}{?[ ]}{?[%incent;]}{?[ ]}{?[]]}{?[>]}{?[ ]}{ROOT ID="elem1"}{CDATA[ ]}{CDATA[ Plain text.]}{CDATA[ ]}{CDATA[ ]}{ELEM1}{CDATA[ ]}{CDATA[ ]}{?[<!-- comment -->]}{CDATA[ ]}{CDATA[ ]}{ELEM2}{CDATA[ ]}{CDATA[ ]}{?[<![CDATA[]}{CDATA[CDATA block]}{?[]]>]}{CDATA[ ]}{CDATA[ ]}{ELEM3}{CDATA[ ]}{CDATA[ ]}{ENTREF[&included-entity;]}{CDATA[ ]}{CDATA[ ]}{ELEM4}{CDATA[ ]}{CDATA[ ]}{PI[test,processing instruction ]}{CDATA[ ]}{CDATA[ ]}{/ELEM4}{CDATA[ ]}{CDATA[ ]}{/ELEM3}{CDATA[ ]}{CDATA[ ]}{/ELEM2}{CDATA[ ]}{CDATA[ ]}{/ELEM1}{CDATA[ ]}{/ROOT}{?[ ]}parse complete ---- ACTUAL OUTPUT {EXTENTREF[incent,,,inc.ent]} {ROOT ID="elem1"}{CDATA[ Plain text. ]}{ELEM1}{CDATA[ ]}{?[<-- comment -->]}{CDATA[ ]}{ELEM2}{CDATA[ ]}{CDATA[CDATA block]}{CDATA[ ]}{ELEM3}{CDATA[ ]}{ENTREF[&included-entity;]}{CDATA[ ]}{ELEM4}{CDATA[ ]}{PI[test,processing instruction ]}{CDATA[ ]}{/ELEM4}{CDATA[ ]}{/ELEM3}{CDATA[ ]}{/ELEM2}{CDATA[ ]}{/ELEM1}{CDATA[ ]}{/ROOT}XML error: Undeclared entity warning at line 21 ---- FAILED ================================================================================ 001- {?[<?xml version="1.0" encoding="ISO-8859-1"?>]}{?[ 001+ {EXTENTREF[incent,,,inc.ent]} 002- ]}{?[<!DOCTYPE]}{?[ ]}{?[phptest]}{?[ ]}{?[SYSTEM]}{?[ ]}{?["notfound.dtd"]}{?[ ]}{?[[]}{?[ 002+ {ROOT ID="elem1"}{CDATA[ 003- ]}{?[<!ENTITY]}{?[ ]}{?[%]}{?[ ]}{?[incent]}{?[ ]}{?[SYSTEM]}{?[ ]}{?["inc.ent"]}{?[>]}{?[ 003+ Plain text. 004- ]}{?[%incent;]}{?[ 004+ ]}{ELEM1}{CDATA[ 005- ]}{?[]]}{?[>]}{?[ 005+ ]}{?[<-- comment -->]}{CDATA[ 006- ]}{ROOT ID="elem1"}{CDATA[ 006+ ]}{ELEM2}{CDATA[ 007- ]}{CDATA[ Plain text.]}{CDATA[ 007+ ]}{CDATA[CDATA block]}{CDATA[ 008- ]}{CDATA[ ]}{ELEM1}{CDATA[ 008+ ]}{ELEM3}{CDATA[ 009- ]}{CDATA[ ]}{?[<!-- comment -->]}{CDATA[ 009+ ]}{ENTREF[&included-entity;]}{CDATA[ 010- ]}{CDATA[ ]}{ELEM2}{CDATA[ 010+ ]}{ELEM4}{CDATA[ 011- ]}{CDATA[ ]}{?[<![CDATA[]}{CDATA[CDATA block]}{?[]]>]}{CDATA[ 011+ ]}{PI[test,processing instruction ]}{CDATA[ 012- ]}{CDATA[ ]}{ELEM3}{CDATA[ 012+ ]}{/ELEM4}{CDATA[ 013- ]}{CDATA[ ]}{ENTREF[&included-entity;]}{CDATA[ 013+ ]}{/ELEM3}{CDATA[ 014- ]}{CDATA[ ]}{ELEM4}{CDATA[ 014+ ]}{/ELEM2}{CDATA[ 015- ]}{CDATA[ ]}{PI[test,processing instruction ]}{CDATA[ 015+ ]}{/ELEM1}{CDATA[ 016- ]}{CDATA[ ]}{/ELEM4}{CDATA[ 016+ ]}{/ROOT}XML error: Undeclared entity warning at line 21 017- ]}{CDATA[ ]}{/ELEM3}{CDATA[ 018- ]}{CDATA[ ]}{/ELEM2}{CDATA[ 019- ]}{CDATA[ ]}{/ELEM1}{CDATA[ 020- ]}{/ROOT}{?[ 021- ]}parse complete ================================================================================ ================================================================================ BUILD ENVIRONMENT ================================================================================ OS: Darwin - Darwin onyx.local. 6.6 Darwin Kernel Version 6.6: Thu May 1 21:48:54 PDT 2003; root:xnu/xnu-344.34.obj~1/RELEASE_PPC Power Macintosh Automake: automake (GNU automake) 1.7.4 Written by Tom Tromey <tromey@redhat.com>. Copyright 2003 Free Software Foundation, Inc. This is free software; see the source for copying conditions. There is NO warranty; not even for MERCHANTABILITY or FITNESS FOR A PARTICULAR PURPOSE. Autoconf: autoconf (GNU Autoconf) 2.57 Written by David J. MacKenzie and Akim Demaille. Copyright 2002 Free Software Foundation, Inc. This is free software; see the source for copying conditions. There is NO warranty; not even for MERCHANTABILITY or FITNESS FOR A PARTICULAR PURPOSE. Libtool: ltmain.sh (GNU libtool) 1.4.3 (1.922.2.110 2002/10/23 01:39:54) Compiler: Reading specs from /usr/libexec/gcc/darwin/ppc/3.3/specs Thread model: posix gcc version 3.3 20030304 (Apple Computer, Inc. build 1435) Bison: bison (GNU Bison) 1.35 Copyright 1984, 1986, 1989, 1992, 2000, 2001, 2002 Free Software Foundation, Inc. This is free software; see the source for copying conditions. There is NO warranty; not even for MERCHANTABILITY or FITNESS FOR A PARTICULAR PURPOSE. Libraries: User's E-mail: tychay at php dot net ================================================================================ PHPINFO ================================================================================ phpinfo() PHP Version => 5.0.0b2-dev System => Darwin onyx.local. 6.6 Darwin Kernel Version 6.6: Thu May 1 21:48:54 PDT 2003; root:xnu/xnu-344.34.obj~1/RELEASE_PPC Power Macintosh Build Date => Jul 2 2003 13:29:48 Configure Command => './configure' '--prefix=/usr' '--mandir=/usr/share/man' '--infodir=/usr/share/info' '--with-apxs=/usr/sbin/apxs' '--with-xmlrpc' '--with-iodbc=/usr' '--with-ncurses=/sw' '--with-mysql=/sw' '--with-mysql-sock=/private/tmp/mysql.sock' '--with-mnogosearch=/sw' '--with-ming=/sw' '--with-mime-magic' '--with-mcrypt=/sw' '--with-ldap=/sw' '--with-iconv=/sw' '--with-iconv-dir=/sw' '--with-gmp=/sw' '--with-gettext=/sw' '--with-gd' '--with-jpeg-dir=/sw' '--with-png-dir=/sw' '--with-xpm-dir=/sw' '--with-freetype-dir=/sw' '--enable-gd-native-ttf' '--enable-exif' '--with-tiff-dir=/sw' '--with-dom=/sw' '--with-libxml-dir=/sw' '--with-dom-xslt=/sw' '--with-dom-exslt=/sw' '--with-curl=/usr' '--with-curlwrappers' '--with-bz2=/sw' '--with-zlib=/usr' '--with-zlib-dir=/usr' '--with-openssl=/sw' '--with-config-file-path=/etc' '--with-expat-dir=/sw' '--enable-wddx' '--enable-sockets' '--enable-mbstring=all' '--enable-mbregex' '--enable-ftp' '--enable-dio' '--enable-dbx' '--enable-dba' '--with-gdbm=/sw' '--with-ndbm=/usr' '--with-cdb' '--with-flatfile' '--enable-calendar' '--enable-bcmath' Server API => Command Line Interface Virtual Directory Support => disabled Configuration File (php.ini) Path => /etc PHP API => 20030518 PHP Extension => 20020429 Zend Extension => 90021012 Debug Build => no Thread Safety => disabled Registered PHP Streams => php, ftp, gopher, telnet, dict, ldap, http, file, https, ftps, compress.bzip2, compress.zlib This program makes use of the Zend Scripting Language Engine: Zend Engine v2.0.0-dev, Copyright (c) 1998-2003 Zend Technologies _______________________________________________________________________ Configuration PHP Core Directive => Local Value => Master Value allow_call_time_pass_reference => On => On allow_url_fopen => On => On always_populate_raw_post_data => Off => Off arg_separator.input => & => & arg_separator.output => & => & asp_tags => Off => Off auto_append_file => no value => no value auto_prepend_file => no value => no value browscap => no value => no value default_charset => no value => no value default_mimetype => text/html => text/html define_syslog_variables => Off => Off disable_classes => no value => no value disable_functions => no value => no value display_errors => On => On display_startup_errors => Off => Off doc_root => no value => no value docref_ext => no value => no value docref_root => no value => no value enable_dl => On => On error_append_string => no value => no value error_log => no value => no value error_prepend_string => no value => no value error_reporting => no value => no value expose_php => On => On extension_dir => /usr/lib/php/extensions/no-debug-non-zts-20020429 => /usr/lib/php/extensions/no-debug-non-zts-20020429 file_uploads => On => On gpc_order => GPC => GPC highlight.bg => #FFFFFF => #FFFFFF highlight.comment => #FF8000 => #FF8000 highlight.default => #0000BB => #0000BB highlight.html => #000000 => #000000 highlight.keyword => #007700 => #007700 highlight.string => #DD0000 => #DD0000 html_errors => On => On ignore_repeated_errors => Off => Off ignore_repeated_source => Off => Off ignore_user_abort => Off => Off implicit_flush => Off => Off include_path => .:/usr/lib/php => .:/usr/lib/php log_errors => Off => Off log_errors_max_len => 1024 => 1024 magic_quotes_gpc => On => On magic_quotes_runtime => Off => Off magic_quotes_sybase => Off => Off mail.force_extra_parameters => no value => no value max_execution_time => 30 => 30 max_input_time => -1 => -1 open_basedir => no value => no value output_buffering => 0 => 0 output_handler => no value => no value post_max_size => 8M => 8M precision => 14 => 14 register_argc_argv => On => On register_globals => Off => Off register_long_arrays => On => On report_memleaks => On => On report_zend_debug => Off => Off safe_mode => Off => Off safe_mode_exec_dir => /usr/local/php/bin => /usr/local/php/bin safe_mode_gid => Off => Off safe_mode_include_dir => no value => no value sendmail_from => no value => no value sendmail_path => /usr/sbin/sendmail -t -i => /usr/sbin/sendmail -t -i serialize_precision => 100 => 100 short_open_tag => On => On SMTP => localhost => localhost smtp_port => 25 => 25 sql.safe_mode => Off => Off track_errors => Off => Off unserialize_callback_func => no value => no value upload_max_filesize => 2M => 2M upload_tmp_dir => no value => no value user_dir => no value => no value variables_order => no value => no value xmlrpc_error_number => 0 => 0 xmlrpc_errors => Off => Off y2k_compliance => On => On zend2.implicit_clone => no value => no value bcmath BCMath support => enabled bz2 BZip2 Support => Enabled BZip2 Version => 1.0.2, 30-Dec-2001 calendar Calendar support => enabled ctype ctype functions => enabled curl CURL support => enabled CURL Information => libcurl/7.10.5 OpenSSL/0.9.7a ipv6 zlib/1.1.3 dba DBA support => enabled Supported handlers => gdbm ndbm cdb cdb_make inifile flatfile dbx dbx support => enabled dbx version => 1.0.0 supported databases => MySQL ODBC PostgreSQL Microsoft SQL Server FrontBase Oracle 8 (oci8) Sybase-CT Directive => Local Value => Master Value dbx.colnames_case => unchanged => unchanged dio dio support => enabled dom DOM/XML => enabled DOM/XML API Version => 20030413 libxml Version => 2.5.6 HTML Support => enabled XPath Support => enabled XPointer Support => enabled exif EXIF Support => enabled EXIF Version => 1.4 $Id: exif.c,v 1.152 2003/06/20 18:24:38 helly Exp $ Supported EXIF Version => 0220 Supported filetypes => JPEG,TIFF ftp FTP support => enabled gd GD Support => enabled GD Version => bundled (2.0.15 compatible) FreeType Support => enabled FreeType Linkage => with freetype GIF Read Support => enabled JPG Support => enabled PNG Support => enabled WBMP Support => enabled XPM Support => enabled XBM Support => enabled gettext GetText Support => enabled gmp gmp support => enabled iconv iconv support => enabled iconv implementation => libiconv iconv library version => 1.7 Directive => Local Value => Master Value iconv.input_encoding => ISO-8859-1 => ISO-8859-1 iconv.internal_encoding => ISO-8859-1 => ISO-8859-1 iconv.output_encoding => ISO-8859-1 => ISO-8859-1 ldap LDAP Support => enabled RCS Version => $Id: ldap.c,v 1.142 2003/06/13 13:30:46 sniper Exp $ Total Links => 0/unlimited API Version => 2004 Vendor Name => OpenLDAP Vendor Version => 20121 mbstring Multibyte Support => enabled Japanese support => enabled Simplified chinese support => enabled Traditional chinese support => enabled Korean support => enabled Russian support => enabled Multibyte (japanese) regex support => enabled mbstring extension makes use of "streamable kanji code filter and converter", which is distributed under the GNU Lesser General Public License version 2.1. Directive => Local Value => Master Value mbstring.detect_order => no value => no value mbstring.encoding_translation => Off => Off mbstring.func_overload => 0 => 0 mbstring.http_input => pass => pass mbstring.http_output => pass => pass mbstring.internal_encoding => none => none mbstring.language => neutral => neutral mbstring.substitute_character => no value => no value mcrypt mcrypt support => enabled Version => 2.5.5 Api No => 20021217 Supported ciphers => cast-128 cast-128 gost gost rijndael-128 rijndael-128 twofish twofish arcfour arcfour cast-256 cast-256 loki97 loki97 rijndael-192 rijndael-192 saferplus saferplus wake wake blowfish-compat blowfish-compat des des panama panama rijndael-256 rijndael-256 serpent serpent xtea xtea blowfish blowfish enigma enigma rc2 rc2 tripledes tripledes Supported modes => cbc cfb ctr ecb ncfb nofb ofb stream Directive => Local Value => Master Value mcrypt.algorithms_dir => no value => no value mcrypt.modes_dir => no value => no value mime_magic mime_magic support => invalid magic file, disabled Directive => Local Value => Master Value mime_magic.debug => 0 => 0 mime_magic.magicfile => no value => no value ming Ming SWF output library => enabled Version => 0.2a mnogosearch mnoGoSearch Support => enabled mnoGoSearch library version => 30120 mysql MySQL Support => enabled Active Persistent Links => 0 Active Links => 0 Client API version => 3.23.56 MYSQL_MODULE_TYPE => external MYSQL_SOCKET => /tmp/mysql.sock MYSQL_INCLUDE => -I/sw/include/mysql MYSQL_LIBS => -L/sw/lib -lmysqlclient Directive => Local Value => Master Value mysql.allow_persistent => On => On mysql.connect_timeout => 60 => 60 mysql.default_host => no value => no value mysql.default_password => no value => no value mysql.default_port => no value => no value mysql.default_socket => no value => no value mysql.default_user => no value => no value mysql.max_links => Unlimited => Unlimited mysql.max_persistent => Unlimited => Unlimited mysql.trace_mode => Off => Off ncurses ncurses support => enabled ncurses library version => 5.2 color support => yes odbc ODBC Support => enabled Active Persistent Links => 0 Active Links => 0 ODBC library => iodbc ODBC_INCLUDE => -I/usr/include ODBC_LFLAGS => -L/usr/lib ODBC_LIBS => -liodbc Directive => Local Value => Master Value odbc.allow_persistent => On => On odbc.check_persistent => On => On odbc.default_db => no value => no value odbc.default_pw => <i>no value</i> => <i>no value</i> odbc.default_user => no value => no value odbc.defaultbinmode => return as is => return as is odbc.defaultlrl => return up to 4096 bytes => return up to 4096 bytes odbc.max_links => Unlimited => Unlimited odbc.max_persistent => Unlimited => Unlimited openssl OpenSSL support => enabled OpenSSL Version => OpenSSL 0.9.7a Feb 19 2003 pcre PCRE (Perl Compatible Regular Expressions) Support => enabled PCRE Library Version => 4.3 21-May-2003 posix Revision => $Revision: 1.56 $ session Session Support => enabled Registered save handlers => files user sqlite Directive => Local Value => Master Value session.auto_start => Off => Off session.bug_compat_42 => On => On session.bug_compat_warn => On => On session.cache_expire => 180 => 180 session.cache_limiter => nocache => nocache session.cookie_domain => no value => no value session.cookie_lifetime => 0 => 0 session.cookie_path => / => / session.cookie_secure => Off => Off session.entropy_file => no value => no value session.entropy_length => 0 => 0 session.gc_divisor => 100 => 100 session.gc_maxlifetime => 1440 => 1440 session.gc_probability => 1 => 1 session.hash_bits_per_character => 4 => 4 session.hash_function => 0 => 0 session.name => PHPSESSID => PHPSESSID session.referer_check => no value => no value session.save_handler => files => files session.save_path => /tmp => /tmp session.serialize_handler => php => php session.use_cookies => On => On session.use_only_cookies => Off => Off session.use_trans_sid => Off => Off simplexml Simplexml support => enabled Revision => $Revision: 1.47 $ sockets Sockets Support => enabled sqlite SQLite support => enabled PECL Module version => 1.1-dev $Id: sqlite.c,v 1.69 2003/07/01 17:55:32 helly Exp $ SQLite Library => 2.8.3 SQLite Encoding => iso8859 Directive => Local Value => Master Value sqlite.assoc_case => 0 => 0 standard Regex Library => Bundled library enabled Dynamic Library Support => enabled Path to sendmail => /usr/sbin/sendmail -t -i Directive => Local Value => Master Value assert.active => 1 => 1 assert.bail => 0 => 0 assert.callback => no value => no value assert.quiet_eval => 0 => 0 assert.warning => 1 => 1 auto_detect_line_endings => 0 => 0 date.default_latitude => 31.7667 => 31.7667 date.default_longitude => 35.2333 => 35.2333 date.sunrise_zenith => 90.83 => 90.83 date.sunset_zenith => 90.83 => 90.83 default_socket_timeout => 60 => 60 safe_mode_allowed_env_vars => PHP_ => PHP_ safe_mode_protected_env_vars => LD_LIBRARY_PATH => LD_LIBRARY_PATH url_rewriter.tags => a=href,area=href,frame=src,form=,fieldset= => a=href,area=href,frame=src,form=,fieldset= user_agent => no value => no value tokenizer Tokenizer Support => enabled wddx WDDX Support => enabled WDDX Session Serializer => enabled xml XML Support => active XML Namespace Support => active libxml2 Version => 2.5.6 xmlrpc core library version => xmlrpc-epi v. 0.51 php extension version => 0.51 author => Dan Libby homepage => http://xmlrpc-epi.sourceforge.net open sourced by => Epinions.com zlib ZLib Support => enabled Compiled Version => 1.1.3 Linked Version => 1.1.3 Directive => Local Value => Master Value zlib.output_compression => Off => Off zlib.output_compression_level => -1 => -1 zlib.output_handler => no value => no value Additional Modules Module Name Environment Variable => Value PWD => /Users/tychay/Documents/development/compile/php/php-5.0.0dev-030702 MAKEFLAGS => XML_CATALOG_FILES => /sw/etc/xml/catalog SGML_CATALOG_FILES => /sw/etc/sgml/catalog MFLAGS => GDK_USE_XFT => 1 REDIRECT_STATUS => PHP_COMMAND => /usr/bin/php PERL5LIB => /sw/lib/perl5 TEST_PHP_EXECUTABLE => /Users/tychay/Documents/development/compile/php/php-5.0.0dev-030702/sapi/cli/php TERM_PROGRAM => Apple_Terminal PHP_CLASSPATH => /Users/tychay/spinodal/packages/phing/classes:/Users/tychay/spinodal/ext/phing/phing/classes:/usr/lib/php MANPATH => /sw/share/man:/Library/MySQL/man:/usr/share/man:/usr/X11R6/man CC => gcc PHING_HOME => /Users/tychay/spinodal/ext/phing/phing CXXFLAGS => -I/sw/include -prefer-non-pic -static USER => tychay SCRIPT_FILENAME => OPTIM => -O2 CVS_RSH => ssh PATH_TRANSLATED => CPPFLAGS => -I/sw/include -no-cpp-precomp -I/Users/tychay/Documents/development/compile/php/php-5.0.0dev-030702/TSRM TERMCAP => ¿ÿÙà QUERY_STRING => CONTENT_LENGTH => MAKELEVEL => 1 INFOPATH => /sw/share/info:/sw/info:/usr/share/info SSH_CLIENT => deleted SHLVL => 4 LOGNAME => tychay LDFLAGS => -L/sw/lib _ => /Users/tychay/Documents/development/compile/php/php-5.0.0dev-030702/sapi/cli/php REQUEST_METHOD => SHELL => /bin/sh TEST_PHP_SRCDIR => /Users/tychay/Documents/development/compile/php/php-5.0.0dev-030702 TERM => vt100 HOME => /Users/tychay TERM_PROGRAM_VERSION => 81 SSH_AUTH_SOCK => deleted PATH => /sw/bin:/sw/sbin:/usr/local/bin:/Library/MySQL/bin:/bin:/sbin:/usr/bin:/usr/sbin:/usr/X11R6/bin CFLAGS => -I/sw/include -prefer-non-pic -static __CF_USER_TEXT_ENCODING => 0x1F5:0:0 SSH_TTY => deleted CONTENT_TYPE => PHP Variables Variable => Value _SERVER["PWD"] => /Users/tychay/Documents/development/compile/php/php-5.0.0dev-030702 _SERVER["MAKEFLAGS"] => _SERVER["XML_CATALOG_FILES"] => /sw/etc/xml/catalog _SERVER["SGML_CATALOG_FILES"] => /sw/etc/sgml/catalog _SERVER["MFLAGS"] => _SERVER["GDK_USE_XFT"] => 1 _SERVER["REDIRECT_STATUS"] => _SERVER["PHP_COMMAND"] => /usr/bin/php _SERVER["PERL5LIB"] => /sw/lib/perl5 _SERVER["TEST_PHP_EXECUTABLE"] => /Users/tychay/Documents/development/compile/php/php-5.0.0dev-030702/sapi/cli/php _SERVER["TERM_PROGRAM"] => Apple_Terminal _SERVER["PHP_CLASSPATH"] => /Users/tychay/spinodal/packages/phing/classes:/Users/tychay/spinodal/ext/phing/phing/classes:/usr/lib/php _SERVER["MANPATH"] => /sw/share/man:/Library/MySQL/man:/usr/share/man:/usr/X11R6/man _SERVER["CC"] => gcc _SERVER["PHING_HOME"] => /Users/tychay/spinodal/ext/phing/phing _SERVER["CXXFLAGS"] => -I/sw/include -prefer-non-pic -static _SERVER["USER"] => tychay _SERVER["SCRIPT_FILENAME"] => _SERVER["OPTIM"] => -O2 _SERVER["CVS_RSH"] => ssh _SERVER["PATH_TRANSLATED"] => _SERVER["CPPFLAGS"] => -I/sw/include -no-cpp-precomp -I/Users/tychay/Documents/development/compile/php/php-5.0.0dev-030702/TSRM _SERVER["TERMCAP"] => ¿ÿÙà _SERVER["QUERY_STRING"] => _SERVER["CONTENT_LENGTH"] => _SERVER["MAKELEVEL"] => 1 _SERVER["INFOPATH"] => /sw/share/info:/sw/info:/usr/share/info _SERVER["SSH_CLIENT"] => deleted _SERVER["SHLVL"] => 4 _SERVER["LOGNAME"] => tychay _SERVER["LDFLAGS"] => -L/sw/lib _SERVER["_"] => /Users/tychay/Documents/development/compile/php/php-5.0.0dev-030702/sapi/cli/php _SERVER["REQUEST_METHOD"] => _SERVER["SHELL"] => /bin/sh _SERVER["TEST_PHP_SRCDIR"] => /Users/tychay/Documents/development/compile/php/php-5.0.0dev-030702 _SERVER["TERM"] => vt100 _SERVER["HOME"] => /Users/tychay _SERVER["TERM_PROGRAM_VERSION"] => 81 _SERVER["SSH_AUTH_SOCK"] => deleted _SERVER["PATH"] => /sw/bin:/sw/sbin:/usr/local/bin:/Library/MySQL/bin:/bin:/sbin:/usr/bin:/usr/sbin:/usr/X11R6/bin _SERVER["CFLAGS"] => -I/sw/include -prefer-non-pic -static _SERVER["__CF_USER_TEXT_ENCODING"] => 0x1F5:0:0 _SERVER["SSH_TTY"] => deleted _SERVER["CONTENT_TYPE"] => _SERVER["PHP_SELF"] => _SERVER["SCRIPT_NAME"] => _SERVER["DOCUMENT_ROOT"] => _SERVER["argv"] => Array ( ) _SERVER["argc"] => 0 _ENV["PWD"] => /Users/tychay/Documents/development/compile/php/php-5.0.0dev-030702 _ENV["MAKEFLAGS"] => _ENV["XML_CATALOG_FILES"] => /sw/etc/xml/catalog _ENV["SGML_CATALOG_FILES"] => /sw/etc/sgml/catalog _ENV["MFLAGS"] => _ENV["GDK_USE_XFT"] => 1 _ENV["REDIRECT_STATUS"] => _ENV["PHP_COMMAND"] => /usr/bin/php _ENV["PERL5LIB"] => /sw/lib/perl5 _ENV["TEST_PHP_EXECUTABLE"] => /Users/tychay/Documents/development/compile/php/php-5.0.0dev-030702/sapi/cli/php _ENV["TERM_PROGRAM"] => Apple_Terminal _ENV["PHP_CLASSPATH"] => /Users/tychay/spinodal/packages/phing/classes:/Users/tychay/spinodal/ext/phing/phing/classes:/usr/lib/php _ENV["MANPATH"] => /sw/share/man:/Library/MySQL/man:/usr/share/man:/usr/X11R6/man _ENV["CC"] => gcc _ENV["PHING_HOME"] => /Users/tychay/spinodal/ext/phing/phing _ENV["CXXFLAGS"] => -I/sw/include -prefer-non-pic -static _ENV["USER"] => tychay _ENV["SCRIPT_FILENAME"] => _ENV["OPTIM"] => -O2 _ENV["CVS_RSH"] => ssh _ENV["PATH_TRANSLATED"] => _ENV["CPPFLAGS"] => -I/sw/include -no-cpp-precomp -I/Users/tychay/Documents/development/compile/php/php-5.0.0dev-030702/TSRM _ENV["TERMCAP"] => ¿ÿÙà _ENV["QUERY_STRING"] => _ENV["CONTENT_LENGTH"] => _ENV["MAKELEVEL"] => 1 _ENV["INFOPATH"] => /sw/share/info:/sw/info:/usr/share/info _ENV["SSH_CLIENT"] => deleted _ENV["SHLVL"] => 4 _ENV["LOGNAME"] => tychay _ENV["LDFLAGS"] => -L/sw/lib _ENV["_"] => /Users/tychay/Documents/development/compile/php/php-5.0.0dev-030702/sapi/cli/php _ENV["REQUEST_METHOD"] => _ENV["SHELL"] => /bin/sh _ENV["TEST_PHP_SRCDIR"] => /Users/tychay/Documents/development/compile/php/php-5.0.0dev-030702 _ENV["TERM"] => vt100 _ENV["HOME"] => /Users/tychay _ENV["TERM_PROGRAM_VERSION"] => 81 _ENV["SSH_AUTH_SOCK"] => deleted _ENV["PATH"] => /sw/bin:/sw/sbin:/usr/local/bin:/Library/MySQL/bin:/bin:/sbin:/usr/bin:/usr/sbin:/usr/X11R6/bin _ENV["CFLAGS"] => -I/sw/include -prefer-non-pic -static _ENV["__CF_USER_TEXT_ENCODING"] => 0x1F5:0:0 _ENV["SSH_TTY"] => deleted _ENV["CONTENT_TYPE"] => PHP License This program is free software; you can redistribute it and/or modify it under the terms of the PHP License as published by the PHP Group and included in the distribution in the file: LICENSE This program is distributed in the hope that it will be useful, but WITHOUT ANY WARRANTY; without even the implied warranty of MERCHANTABILITY or FITNESS FOR A PARTICULAR PURPOSE. If you did not receive a copy of the PHP license, or have any questions about PHP licensing, please contact license@php.net.

« previous php.qa (#14749) next »