Test results for 4.3.3RC3 [failed]

From: Date: Fri, 08 Aug 2003 08:08:39 +0000
Subject: Test results for 4.3.3RC3 [failed]
Groups: php.qa 
Request: Send a blank email to php-qa+get-15560@lists.php.net to get a copy of this message
===================================================================== FAILED TEST SUMMARY --------------------------------------------------------------------- Bug #20539 (PHP CLI Segmentation Fault) [tests/basic/bug20539.phpt] session object serialization [ext/session/tests/001.phpt] session object deserialization [ext/session/tests/003.phpt] correct instantiation of references between variables in sessions [ext/session/tests/006.phpt] bug compatibility: unset($c) with enabled register_globals [ext/session/tests/007.phpt] bug compatibility: global is used albeit register_globals=0 [ext/session/tests/008-php4.2.3.phpt] unset($_SESSION["name"]); should work with register_globals=off [ext/session/tests/009.phpt] registering $_SESSION should not segfault [ext/session/tests/012.phpt] redefining SID should not cause warnings [ext/session/tests/013.phpt] a script should not be able to modify session.use_trans_sid [ext/session/tests/014.phpt] use_trans_sid should not affect SID [ext/session/tests/015.phpt] invalid session.save_path should not cause a segfault [ext/session/tests/016.phpt] setting $_SESSION before session_start() should not cause segfault [ext/session/tests/017.phpt] rewriter correctly handles attribute names which contain dashes [ext/session/tests/018.phpt] serializing references test case using globals [ext/session/tests/019.phpt] rewriter uses arg_seperator.output for modifying URLs [ext/session/tests/020.phpt] rewriter handles form and fieldset tags correctly [ext/session/tests/021.phpt] Bug #24592 (crash when multiple NULL values are being stored) [ext/session/tests/bug24592.phpt] Bug #24142 (round() problems) [ext/standard/tests/math/bug24142.phpt] Bug #24063 (serialize() missing 0 after the . on scientific notation) [ext/standard/tests/serialize/bug24063.phpt] ===================================================================== ===================================================================== TEST RESULT SUMMARY --------------------------------------------------------------------- Exts skipped : 68 Exts tested : 19 --------------------------------------------------------------------- Number of tests : 510 Tests skipped : 224 (43.9%) Tests warned : 0 ( 0.0%) Tests failed : 20 ( 3.9%) Tests passed : 266 (52.2%) --------------------------------------------------------------------- Time taken : 37 seconds ===================================================================== ============================================================================ ==== /home/jpa/dev/php-4.3.3RC3/tests/basic/bug20539.phpt ============================================================================ ==== ---- EXPECTED OUTPUT good :) ---- ACTUAL OUTPUT Fatal error: Unknown(): Failed to initialize storage module. in Unknown on line 0 Could not startup. ---- FAILED ============================================================================ ==== 001- good :) 001+ Fatal error: Unknown(): Failed to initialize storage module. in Unknown on line 0 002+ Could not startup. ============================================================================ ==== ============================================================================ ==== /home/jpa/dev/php-4.3.3RC3/ext/session/tests/001.phpt ============================================================================ ==== ---- EXPECTED OUTPUT baz|O:3:"foo":2:{s:3:"bar";s:2:"ok";s:3:"yes";s:4:"done";}arr|a:1:{i:3;O:3:" foo":2:{s:3:"bar";s:2:"ok";s:3:"yes";s:4:"done";}} ---- ACTUAL OUTPUT Fatal error: session_register(): Failed to initialize storage module. in /home/jpa/dev/php-4.3.3RC3/ext/session/tests/001.php on line 16 ---- FAILED ============================================================================ ==== 001- baz|O:3:"foo":2:{s:3:"bar";s:2:"ok";s:3:"yes";s:4:"done";}arr|a:1:{i:3;O:3:" foo":2:{s:3:"bar";s:2:"ok";s:3:"yes";s:4:"done";}} 001+ Fatal error: session_register(): Failed to initialize storage module. in /home/jpa/dev/php-4.3.3RC3/ext/session/tests/001.php on line 16 ============================================================================ ==== ============================================================================ ==== /home/jpa/dev/php-4.3.3RC3/ext/session/tests/003.phpt ============================================================================ ==== ---- EXPECTED OUTPUT object(foo)(2) { ["bar"]=> string(2) "ok" ["yes"]=> int(2) } array(1) { [3]=> &object(foo)(2) { ["bar"]=> string(2) "ok" ["yes"]=> int(2) } } ---- ACTUAL OUTPUT Fatal error: session_start(): Failed to initialize storage module. in /home/jpa/dev/php-4.3.3RC3/ext/session/tests/003.php on line 10 ---- FAILED ============================================================================ ==== 001- object(foo)(2) { 001+ Fatal error: session_start(): Failed to initialize storage module. in /home/jpa/dev/php-4.3.3RC3/ext/session/tests/003.php on line 10 002- ["bar"]=> 003- string(2) "ok" 004- ["yes"]=> 005- int(2) 006- } 007- array(1) { 008- [3]=> 009- &object(foo)(2) { 010- ["bar"]=> 011- string(2) "ok" 012- ["yes"]=> 013- int(2) 014- } 015- } ============================================================================ ==== ============================================================================ ==== /home/jpa/dev/php-4.3.3RC3/ext/session/tests/006.phpt ============================================================================ ==== ---- EXPECTED OUTPUT original values: object(a)(1) { ["test"]=> string(5) "hallo" } object(b)(1) { ["a"]=> &object(a)(1) { ["test"]=> string(5) "hallo" } } values after session: object(a)(1) { ["test"]=> string(5) "hallo" } object(b)(1) { ["a"]=> &object(a)(1) { ["test"]=> string(5) "hallo" } } ---- ACTUAL OUTPUT Fatal error: session_start(): Failed to initialize storage module. in /home/jpa/dev/php-4.3.3RC3/ext/session/tests/006.php on line 5 ---- FAILED ============================================================================ ==== 001- original values: 001+ Fatal error: session_start(): Failed to initialize storage module. in /home/jpa/dev/php-4.3.3RC3/ext/session/tests/006.php on line 5 002- object(a)(1) { 003- ["test"]=> 004- string(5) "hallo" 005- } 006- object(b)(1) { 007- ["a"]=> 008- &object(a)(1) { 009- ["test"]=> 010- string(5) "hallo" 011- } 012- } 013- values after session: 014- object(a)(1) { 015- ["test"]=> 016- string(5) "hallo" 017- } 018- object(b)(1) { 019- ["a"]=> 020- &object(a)(1) { 021- ["test"]=> 022- string(5) "hallo" 023- } 024- } ============================================================================ ==== ============================================================================ ==== /home/jpa/dev/php-4.3.3RC3/ext/session/tests/007.phpt ============================================================================ ==== ---- EXPECTED OUTPUT float(3.14) array(1) { ["c"]=> &float(3.14) } float(3.14) array(1) { ["c"]=> &float(3.14) } ---- ACTUAL OUTPUT Fatal error: session_start(): Failed to initialize storage module. in /home/jpa/dev/php-4.3.3RC3/ext/session/tests/007.php on line 7 ---- FAILED ============================================================================ ==== 001- float(3.14) 001+ Fatal error: session_start(): Failed to initialize storage module. in /home/jpa/dev/php-4.3.3RC3/ext/session/tests/007.php on line 7 002- array(1) { 003- ["c"]=> 004- &float(3.14) 005- } 006- float(3.14) 007- array(1) { 008- ["c"]=> 009- &float(3.14) 010- } ============================================================================ ==== ============================================================================ ==== /home/jpa/dev/php-4.3.3RC3/ext/session/tests/008-php4.2.3.phpt ============================================================================ ==== ---- EXPECTED OUTPUT NULL Your script possibly relies on a session side-effect which existed until PHP 4.2.3. Please be advised that the session extension does not consider global variables as a source of data, unless register_globals is enabled. You can disable this functionality and this warning by setting session.bug_compat_42 or session.bug_compat_warn to off, respectively. array(1) { ["c"]=> float(3.14) } NULL array(1) { ["c"]=> float(3.14) } ---- ACTUAL OUTPUT Fatal error: session_start(): Failed to initialize storage module. in /home/jpa/dev/php-4.3.3RC3/ext/session/tests/008-php4.2.3.php on line 5 ---- FAILED ============================================================================ ==== 001- NULL 001+ Fatal error: session_start(): Failed to initialize storage module. in /home/jpa/dev/php-4.3.3RC3/ext/session/tests/008-php4.2.3.php on line 5 002- Your script possibly relies on a session side-effect which existed until PHP 4.2.3. Please be advised that the session extension does not consider global variables as a source of data, unless register_globals is enabled. You can disable this functionality and this warning by setting session.bug_compat_42 or session.bug_compat_warn to off, respectively. 003- array(1) { 004- ["c"]=> 005- float(3.14) 006- } 007- NULL 008- array(1) { 009- ["c"]=> 010- float(3.14) 011- } ============================================================================ ==== ============================================================================ ==== /home/jpa/dev/php-4.3.3RC3/ext/session/tests/009.phpt ============================================================================ ==== ---- EXPECTED OUTPUT array(0) { } array(1) { ["name"]=> string(3) "foo" } array(1) { ["name"]=> string(3) "foo" } array(0) { } array(0) { } ---- ACTUAL OUTPUT Fatal error: session_start(): Failed to initialize storage module. in /home/jpa/dev/php-4.3.3RC3/ext/session/tests/009.php on line 7 ---- FAILED ============================================================================ ==== 001- array(0) { 001+ Fatal error: session_start(): Failed to initialize storage module. in /home/jpa/dev/php-4.3.3RC3/ext/session/tests/009.php on line 7 002- } 003- array(1) { 004- ["name"]=> 005- string(3) "foo" 006- } 007- array(1) { 008- ["name"]=> 009- string(3) "foo" 010- } 011- array(0) { 012- } 013- array(0) { 014- } ============================================================================ ==== ============================================================================ ==== /home/jpa/dev/php-4.3.3RC3/ext/session/tests/012.phpt ============================================================================ ==== ---- EXPECTED OUTPUT I live ---- ACTUAL OUTPUT Fatal error: session_start(): Failed to initialize storage module. in /home/jpa/dev/php-4.3.3RC3/ext/session/tests/012.php on line 7 ---- FAILED ============================================================================ ==== 001- I live 001+ Fatal error: session_start(): Failed to initialize storage module. in /home/jpa/dev/php-4.3.3RC3/ext/session/tests/012.php on line 7 ============================================================================ ==== ============================================================================ ==== /home/jpa/dev/php-4.3.3RC3/ext/session/tests/013.phpt ============================================================================ ==== ---- EXPECTED OUTPUT I live ---- ACTUAL OUTPUT Fatal error: session_start(): Failed to initialize storage module. in /home/jpa/dev/php-4.3.3RC3/ext/session/tests/013.php on line 5 ---- FAILED ============================================================================ ==== 001- I live 001+ Fatal error: session_start(): Failed to initialize storage module. in /home/jpa/dev/php-4.3.3RC3/ext/session/tests/013.php on line 5 ============================================================================ ==== ============================================================================ ==== /home/jpa/dev/php-4.3.3RC3/ext/session/tests/014.phpt ============================================================================ ==== ---- EXPECTED OUTPUT <a href="/link?PHPSESSID=abtest"> <a href="/link?PHPSESSID=abtest"> <a href="/link?PHPSESSID=abtest"> ---- ACTUAL OUTPUT Fatal error: session_start(): Failed to initialize storage module. in /home/jpa/dev/php-4.3.3RC3/ext/session/tests/014.php on line 5 ---- FAILED ============================================================================ ==== 001- <a href="/link?PHPSESSID=abtest"> 001+ Fatal error: session_start(): Failed to initialize storage module. in /home/jpa/dev/php-4.3.3RC3/ext/session/tests/014.php on line 5 002- <a href="/link?PHPSESSID=abtest"> 003- <a href="/link?PHPSESSID=abtest"> ============================================================================ ==== ============================================================================ ==== /home/jpa/dev/php-4.3.3RC3/ext/session/tests/015.phpt ============================================================================ ==== ---- EXPECTED OUTPUT <a href="/link?PHPSESSID=abtest&PHPSESSID=abtest"> ---- ACTUAL OUTPUT Fatal error: session_start(): Failed to initialize storage module. in /home/jpa/dev/php-4.3.3RC3/ext/session/tests/015.php on line 5 ---- FAILED ============================================================================ ==== 001- <a href="/link?PHPSESSID=abtest&PHPSESSID=abtest"> 001+ Fatal error: session_start(): Failed to initialize storage module. in /home/jpa/dev/php-4.3.3RC3/ext/session/tests/015.php on line 5 ============================================================================ ==== ============================================================================ ==== /home/jpa/dev/php-4.3.3RC3/ext/session/tests/016.phpt ============================================================================ ==== ---- EXPECTED OUTPUT I live ---- ACTUAL OUTPUT ---- FAILED ============================================================================ ==== 001- I live 001+ ============================================================================ ==== ============================================================================ ==== /home/jpa/dev/php-4.3.3RC3/ext/session/tests/017.phpt ============================================================================ ==== ---- EXPECTED OUTPUT I live ---- ACTUAL OUTPUT Fatal error: session_start(): Failed to initialize storage module. in /home/jpa/dev/php-4.3.3RC3/ext/session/tests/017.php on line 8 ---- FAILED ============================================================================ ==== 001- I live 001+ Fatal error: session_start(): Failed to initialize storage module. in /home/jpa/dev/php-4.3.3RC3/ext/session/tests/017.php on line 8 ============================================================================ ==== ============================================================================ ==== /home/jpa/dev/php-4.3.3RC3/ext/session/tests/018.phpt ============================================================================ ==== ---- EXPECTED OUTPUT <form accept-charset="ISO-8859-15, ISO-8859-1" action=url.php><input type="hidden" name="PHPSESSID" value="abtest" /> ---- ACTUAL OUTPUT Fatal error: session_start(): Failed to initialize storage module. in /home/jpa/dev/php-4.3.3RC3/ext/session/tests/018.php on line 6 ---- FAILED ============================================================================ ==== 001- <form accept-charset="ISO-8859-15, ISO-8859-1" action=url.php><input type="hidden" name="PHPSESSID" value="abtest" /> 001+ Fatal error: session_start(): Failed to initialize storage module. in /home/jpa/dev/php-4.3.3RC3/ext/session/tests/018.php on line 6 ============================================================================ ==== ============================================================================ ==== /home/jpa/dev/php-4.3.3RC3/ext/session/tests/019.phpt ============================================================================ ==== ---- EXPECTED OUTPUT array(2) { ["o1"]=> &object(tfoo)(1) { ["c"]=> int(42) } ["o2"]=> &object(tfoo)(1) { ["c"]=> int(42) } } array(2) { ["o1"]=> &object(tfoo)(1) { ["c"]=> int(44) } ["o2"]=> &object(tfoo)(1) { ["c"]=> int(44) } } ---- ACTUAL OUTPUT Fatal error: session_start(): Failed to initialize storage module. in /home/jpa/dev/php-4.3.3RC3/ext/session/tests/019.php on line 16 ---- FAILED ============================================================================ ==== 001- array(2) { 001+ Fatal error: session_start(): Failed to initialize storage module. in /home/jpa/dev/php-4.3.3RC3/ext/session/tests/019.php on line 16 002- ["o1"]=> 003- &object(tfoo)(1) { 004- ["c"]=> 005- int(42) 006- } 007- ["o2"]=> 008- &object(tfoo)(1) { 009- ["c"]=> 010- int(42) 011- } 012- } 013- array(2) { 014- ["o1"]=> 015- &object(tfoo)(1) { 016- ["c"]=> 017- int(44) 018- } 019- ["o2"]=> 020- &object(tfoo)(1) { 021- ["c"]=> 022- int(44) 023- } 024- } ============================================================================ ==== ============================================================================ ==== /home/jpa/dev/php-4.3.3RC3/ext/session/tests/020.phpt ============================================================================ ==== ---- EXPECTED OUTPUT <a href="link.php?a=b&amp;PHPSESSID=abtest"> ---- ACTUAL OUTPUT Fatal error: session_start(): Failed to initialize storage module. in /home/jpa/dev/php-4.3.3RC3/ext/session/tests/020.php on line 6 ---- FAILED ============================================================================ ==== 001- <a href="link.php?a=b&amp;PHPSESSID=abtest"> 001+ Fatal error: session_start(): Failed to initialize storage module. in /home/jpa/dev/php-4.3.3RC3/ext/session/tests/020.php on line 6 ============================================================================ ==== ============================================================================ ==== /home/jpa/dev/php-4.3.3RC3/ext/session/tests/021.phpt ============================================================================ ==== ---- EXPECTED OUTPUT <form><input type="hidden" name="PHPSESSID" value="abtest" /> <fieldset><input type="hidden" name="PHPSESSID" value="abtest" /> <form><input type="hidden" name="PHPSESSID" value="abtest" /> <fieldset> <form><input type="hidden" name="PHPSESSID" value="abtest" /> <fieldset> <form> <fieldset><input type="hidden" name="PHPSESSID" value="abtest" /> ---- ACTUAL OUTPUT Fatal error: session_start(): Failed to initialize storage module. in /home/jpa/dev/php-4.3.3RC3/ext/session/tests/021.php on line 6 ---- FAILED ============================================================================ ==== 001- <form><input type="hidden" name="PHPSESSID" value="abtest" /> 001+ Fatal error: session_start(): Failed to initialize storage module. in /home/jpa/dev/php-4.3.3RC3/ext/session/tests/021.php on line 6 002- <fieldset><input type="hidden" name="PHPSESSID" value="abtest" /> 003- <form><input type="hidden" name="PHPSESSID" value="abtest" /> 004- <fieldset> 005- <form><input type="hidden" name="PHPSESSID" value="abtest" /> 006- <fieldset> 007- <form> 008- <fieldset><input type="hidden" name="PHPSESSID" value="abtest" /> ============================================================================ ==== ============================================================================ ==== /home/jpa/dev/php-4.3.3RC3/ext/session/tests/bug24592.phpt ============================================================================ ==== ---- EXPECTED OUTPUT Notice: Undefined index: foo in %s on line %d Notice: Undefined index: bar in %s on line %d NULL NULL array(0) { } array(2) { ["foo"]=> NULL ["bar"]=> NULL } ---- ACTUAL OUTPUT ---- FAILED ============================================================================ ==== 001- Notice: Undefined index: foo in %s on line %d 001+ 002- 003- Notice: Undefined index: bar in %s on line %d 004- NULL 005- NULL 006- array(0) { 007- } 008- array(2) { 009- ["foo"]=> 010- NULL 011- ["bar"]=> 012- NULL 013- } ============================================================================ ==== ============================================================================ ==== /home/jpa/dev/php-4.3.3RC3/ext/standard/tests/math/bug24142.phpt ============================================================================ ==== ---- EXPECTED OUTPUT 5.05 5.06 ---- ACTUAL OUTPUT 5.04 5.05 ---- FAILED ============================================================================ ==== 001- 5.05 001+ 5.04 002- 5.06 002+ 5.05 ============================================================================ ==== ============================================================================ ==== /home/jpa/dev/php-4.3.3RC3/ext/standard/tests/serialize/bug24063.phpt ============================================================================ ==== ---- EXPECTED OUTPUT string(9) "d:1.0E-6;" float(1.0E-6) ---- ACTUAL OUTPUT Notice: unserialize(): Error at offset 0 of 9 bytes in /home/jpa/dev/php-4.3.3RC3/ext/standard/tests/serialize/bug24063.php on line 4 string(9) "d::.0E-7;" bool(false) ---- FAILED ============================================================================ ==== 001- string(9) "d:1.0E-6;" 001+ Notice: unserialize(): Error at offset 0 of 9 bytes in /home/jpa/dev/php-4.3.3RC3/ext/standard/tests/serialize/bug24063.php on line 4 002- float(1.0E-6) 002+ string(9) "d::.0E-7;" 003+ bool(false) ============================================================================ ==== ============================================================================ ==== BUILD ENVIRONMENT ============================================================================ ==== OS: Linux - Linux xxxx.xxxxxxxxxxxxx.com 2.4.7-10 #1 Thu Sep 6 17:27:27 EDT 2001 i686 Automake: automake (GNU automake) 1.4-p5 Copyright (C) 1999, 2001 Free Software Foundation, Inc. This is free software; see the source for copying conditions. There is NO warranty; not even for MERCHANTABILITY or FITNESS FOR A PARTICULAR PURPOSE. Written by Tom Tromey <tromey@cygnus.com> Autoconf: Autoconf version 2.13 Libtool: ltmain.sh (GNU libtool) 1.4.3 (1.922.2.110 2002/10/23 01:39:54) Compiler: Reading specs from /usr/lib/gcc-lib/i386-redhat-linux/2.96/specs gcc version 2.96 20000731 (Red Hat Linux 7.2 2.96-108.7.2) Bison: GNU Bison version 1.28 Libraries: libcrypt.so.1 => /lib/libcrypt.so.1 (0x4002a000) libmysqlclient.so.10 => /usr/local/mysql/lib/mysql/libmysqlclient.so.10 (0x40057000) libz.so.1 => /usr/lib/libz.so.1 (0x40073000) libpam.so.0 => /lib/libpam.so.0 (0x40081000) libpng.so.2 => /usr/lib/libpng.so.2 (0x40089000) libdl.so.2 => /lib/libdl.so.2 (0x400ab000) libbz2.so.1 => /usr/lib/libbz2.so.1 (0x400b0000) libresolv.so.2 => /lib/libresolv.so.2 (0x400c0000) libm.so.6 => /lib/i686/libm.so.6 (0x400d2000) libnsl.so.1 => /lib/libnsl.so.1 (0x400f5000) libcurl.so.2 => /usr/local/lib/libcurl.so.2 (0x4010b000) libssl.so.2 => /lib/libssl.so.2 (0x4012e000) libcrypto.so.2 => /lib/libcrypto.so.2 (0x4015c000) libc.so.6 => /lib/i686/libc.so.6 (0x40220000) /lib/ld-linux.so.2 => /lib/ld-linux.so.2 (0x40000000) ============================================================================ ==== PHPINFO ============================================================================ ==== phpinfo() PHP Version => 4.3.3RC3 System => Linux xxxx.xxxxxxxxxxxxx.com 2.4.7-10 #1 Thu Sep 6 17:27:27 EDT 2001 i686 Build Date => Aug 8 2003 09:28:22 Configure Command => './configure' '--with-apxs=/home/apache/bin/apxs' '--with-mysql=/usr/local/mysql' '--with-system-regex' '--enable-track-vars' '--enable-memory-limits' '--with-xml' '--with-imap=/usr/local' '--enable-sysvsem' '--enable-sysvshm' '--enable-sockets' '--with-gd' '--enable-inline-optimization' '--with-curl' '--with-zlib' '--with-bz2' '--with-gettext' '--with-pcre' '--enable-cli' '--disable-cgi' '--enable-pcntl' '--enable-url-open' Server API => Command Line Interface Virtual Directory Support => disabled Configuration File (php.ini) Path => /usr/local/Zend/etc/php.ini PHP API => 20020918 PHP Extension => 20020429 Zend Extension => 20021010 Debug Build => no Thread Safety => disabled Registered PHP Streams => php, http, ftp, compress.bzip2, compress.zlib This program makes use of the Zend Scripting Language Engine: Zend Engine v1.3.0, Copyright (c) 1998-2003 Zend Technologies _______________________________________________________________________ Configuration PHP Core Directive => Local Value => Master Value allow_call_time_pass_reference => On => On allow_url_fopen => On => On always_populate_raw_post_data => Off => Off arg_separator.input => & => & arg_separator.output => & => & asp_tags => Off => Off auto_append_file => no value => no value auto_prepend_file => /home/fda-root/target/kernel/website/target_script_auto_prepend_file.php => /home/fda-root/target/kernel/website/target_script_auto_prepend_file.php browscap => no value => no value default_charset => iso-8859-1 => iso-8859-1 default_mimetype => text/html => text/html define_syslog_variables => Off => Off disable_classes => no value => no value disable_functions => no value => no value display_errors => On => On display_startup_errors => On => On doc_root => no value => no value docref_ext => no value => no value docref_root => no value => no value enable_dl => On => On error_append_string => </font> => </font> error_log => /tmp/fds/target.error.log => /tmp/fds/target.error.log error_prepend_string => <font color=110000><br>Par toutatis! => <font color=110000><br>Par toutatis! error_reporting => 2047 => 2047 expose_php => On => On extension_dir => ./ => ./ file_uploads => On => On gpc_order => GPC => GPC highlight.bg => #FFFFFF => #FFFFFF highlight.comment => #FF9900 => #FF9900 highlight.default => #0000CC => #0000CC highlight.html => #000000 => #000000 highlight.keyword => #006600 => #006600 highlight.string => #CC0000 => #CC0000 html_errors => On => On ignore_repeated_errors => Off => Off ignore_repeated_source => Off => Off ignore_user_abort => Off => Off implicit_flush => Off => Off include_path => . => . log_errors => On => On log_errors_max_len => 1024 => 1024 magic_quotes_gpc => Off => Off magic_quotes_runtime => Off => Off magic_quotes_sybase => Off => Off max_execution_time => 30 => 30 max_input_time => -1 => -1 open_basedir => no value => no value output_buffering => no value => no value output_handler => no value => no value post_max_size => 8M => 8M precision => 14 => 14 register_argc_argv => Off => Off register_globals => On => On report_memleaks => On => On safe_mode => Off => Off safe_mode_exec_dir => no value => no value safe_mode_gid => Off => Off safe_mode_include_dir => no value => no value sendmail_from => me@localhost.com => me@localhost.com sendmail_path => /usr/sbin/sendmail -t -i => /usr/sbin/sendmail -t -i serialize_precision => 100 => 100 short_open_tag => On => On SMTP => localhost => localhost smtp_port => 25 => 25 sql.safe_mode => Off => Off track_errors => On => On unserialize_callback_func => no value => no value upload_max_filesize => 2M => 2M upload_tmp_dir => no value => no value user_dir => no value => no value variables_order => EGPCS => EGPCS xmlrpc_error_number => 0 => 0 xmlrpc_errors => Off => Off y2k_compliance => Off => Off bz2 BZip2 Support => Enabled BZip2 Version => 1.0.1, 23-June-2000 ctype ctype functions => enabled curl CURL support => enabled CURL Information => libcurl/7.10.2 OpenSSL/0.9.6b zlib/1.1.3 gd GD Support => enabled GD Version => bundled (2.0.15 compatible) GIF Read Support => enabled PNG Support => enabled WBMP Support => enabled XBM Support => enabled gettext GetText Support => enabled imap IMAP c-Client Version => 2001 mysql MySQL Support => enabled Active Persistent Links => 0 Active Links => 0 Client API version => 3.23.49 MYSQL_MODULE_TYPE => external MYSQL_SOCKET => /tmp/mysql.sock MYSQL_INCLUDE => -I/usr/local/mysql/include/mysql MYSQL_LIBS => -L/usr/local/mysql/lib/mysql -lmysqlclient Directive => Local Value => Master Value mysql.allow_persistent => On => On mysql.connect_timeout => 60 => 60 mysql.default_host => no value => no value mysql.default_password => no value => no value mysql.default_port => no value => no value mysql.default_socket => no value => no value mysql.default_user => no value => no value mysql.max_links => Unlimited => Unlimited mysql.max_persistent => Unlimited => Unlimited mysql.trace_mode => Off => Off overload User-Space Object Overloading Support => enabled pcntl pcntl support => enabled pcre PCRE (Perl Compatible Regular Expressions) Support => enabled PCRE Library Version => 4.3 21-May-2003 posix Revision => $Revision: 1.51.2.2 $ session Session Support => enabled Registered save handlers => files user Directive => Local Value => Master Value session.auto_start => Off => Off session.bug_compat_42 => On => On session.bug_compat_warn => On => On session.cache_expire => 180 => 180 session.cache_limiter => nocache => nocache session.cookie_domain => no value => no value session.cookie_lifetime => 0 => 0 session.cookie_path => / => / session.cookie_secure => Off => Off session.entropy_file => no value => no value session.entropy_length => 0 => 0 session.gc_divisor => 100 => 100 session.gc_maxlifetime => 1440 => 1440 session.gc_probability => 1 => 1 session.name => sid => sid session.referer_check => no value => no value session.save_handler => user => user session.save_path => not used by flow drivers => not used by flow drivers session.serialize_handler => php => php session.use_cookies => Off => Off session.use_only_cookies => Off => Off session.use_trans_sid => Off => Off sockets Sockets Support => enabled standard Regex Library => Bundled library enabled Dynamic Library Support => enabled Path to sendmail => /usr/sbin/sendmail -t -i Directive => Local Value => Master Value assert.active => 1 => 1 assert.bail => 0 => 0 assert.callback => no value => no value assert.quiet_eval => 0 => 0 assert.warning => 1 => 1 auto_detect_line_endings => 0 => 0 default_socket_timeout => 60 => 60 safe_mode_allowed_env_vars => PHP_ => PHP_ safe_mode_protected_env_vars => LD_LIBRARY_PATH => LD_LIBRARY_PATH url_rewriter.tags => a=href,area=href,frame=src,input=src,form=fakeentry => a=href,area=href,frame=src,input=src,form=fakeentry user_agent => no value => no value tokenizer Tokenizer Support => enabled xml XML Support => active XML Namespace Support => active EXPAT Version => 1.95.6 zlib ZLib Support => enabled Compiled Version => 1.1.3 Linked Version => 1.1.3 Directive => Local Value => Master Value zlib.output_compression => Off => Off zlib.output_compression_level => -1 => -1 zlib.output_handler => no value => no value Additional Modules Module Name sysvsem sysvshm Environment Variable => Value PWD => /home/jpa/dev/php-4.3.3RC3 MAKEFLAGS => SCRIPT_FILENAME => MFLAGS => HOSTNAME => xxxx.xxxxxxxxxxxxx.com QTDIR => /usr/lib/qt-2.3.1 LESSOPEN => |/usr/bin/lesspipe.sh %s CC => gcc KDEDIR => /usr REQUEST_METHOD => LS_COLORS => no=00:fi=00:di=01;34:ln=01;36:pi=40;33:so=01;35:bd=40;33;01:cd=40;33;01:or=0 1;05;37;41:mi=01;05;37;41:ex=01;32:*.cmd=01;32:*.exe=01;32:*.com=01;32:*.btm =01;32:*.bat=01;32:*.sh=01;32:*.csh=01;32:*.tar=01;31:*.tgz=01;31:*.arj=01;3 1:*.taz=01;31:*.lzh=01;31:*.zip=01;31:*.z=01;31:*.Z=01;31:*.gz=01;31:*.bz2=0 1;31:*.bz=01;31:*.tz=01;31:*.rpm=01;31:*.cpio=01;31:*.jpg=01;35:*.gif=01;35: *.bmp=01;35:*.xbm=01;35:*.xpm=01;35:*.png=01;35:*.tif=01;35: USER => root MACHTYPE => i386-redhat-linux-gnu VNCDESKTOP => X TEST_PHP_SRCDIR => /home/jpa/dev/php-4.3.3RC3 KDE_MULTIHEAD => false MAIL => /var/spool/mail/root INPUTRC => /etc/inputrc BASH_ENV => /root/.bashrc GTK_RC_FILES => /etc/gtk/gtkrc:/root/.gtkrc:/root/.gtkrc-kde PATH_TRANSLATED => LANG => fr_FR@euro QUERY_STRING => CONTENT_LENGTH => MAKELEVEL => 1 COLORTERM => DISPLAY => :1 SHLVL => 7 LOGNAME => root REDIRECT_STATUS => TEST_PHP_EXECUTABLE => /home/jpa/dev/php-4.3.3RC3/sapi/cli/php _ => /home/jpa/dev/php-4.3.3RC3/sapi/cli/php SESSION_MANAGER => local/xxxx.xxxxxxxxxxxxx.com:/tmp/.ICE-unix/2087 SHELL => /bin/sh USERNAME => root QT_XFT => 0 HOSTTYPE => i386 HISTSIZE => 1000 OSTYPE => linux-gnu TERM => xterm HOME => /root SSH_ASKPASS => /usr/libexec/openssh/gnome-ssh-askpass PATH => /bin:/sbin:/usr/bin:/usr/sbin:/usr/local/bin:/usr/local/sbin:/usr/bin/X11:/u sr/X11R6/bin:/usr/lib/courier/bin:/usr/lib/courier/sbin:/root/bin:/usr/local /mysql/bin CONTENT_TYPE => PHP Variables Variable => Value PHP_SELF => _SERVER["PWD"] => /home/jpa/dev/php-4.3.3RC3 _SERVER["MAKEFLAGS"] => _SERVER["SCRIPT_FILENAME"] => _SERVER["MFLAGS"] => _SERVER["HOSTNAME"] => xxxx.xxxxxxxxxxxxx.com _SERVER["QTDIR"] => /usr/lib/qt-2.3.1 _SERVER["LESSOPEN"] => |/usr/bin/lesspipe.sh %s _SERVER["CC"] => gcc _SERVER["KDEDIR"] => /usr _SERVER["REQUEST_METHOD"] => _SERVER["LS_COLORS"] => no=00:fi=00:di=01;34:ln=01;36:pi=40;33:so=01;35:bd=40;33;01:cd=40;33;01:or=0 1;05;37;41:mi=01;05;37;41:ex=01;32:*.cmd=01;32:*.exe=01;32:*.com=01;32:*.btm =01;32:*.bat=01;32:*.sh=01;32:*.csh=01;32:*.tar=01;31:*.tgz=01;31:*.arj=01;3 1:*.taz=01;31:*.lzh=01;31:*.zip=01;31:*.z=01;31:*.Z=01;31:*.gz=01;31:*.bz2=0 1;31:*.bz=01;31:*.tz=01;31:*.rpm=01;31:*.cpio=01;31:*.jpg=01;35:*.gif=01;35: *.bmp=01;35:*.xbm=01;35:*.xpm=01;35:*.png=01;35:*.tif=01;35: _SERVER["USER"] => root _SERVER["MACHTYPE"] => i386-redhat-linux-gnu _SERVER["VNCDESKTOP"] => X _SERVER["TEST_PHP_SRCDIR"] => /home/jpa/dev/php-4.3.3RC3 _SERVER["KDE_MULTIHEAD"] => false _SERVER["MAIL"] => /var/spool/mail/root _SERVER["INPUTRC"] => /etc/inputrc _SERVER["BASH_ENV"] => /root/.bashrc _SERVER["GTK_RC_FILES"] => /etc/gtk/gtkrc:/root/.gtkrc:/root/.gtkrc-kde _SERVER["PATH_TRANSLATED"] => _SERVER["LANG"] => fr_FR@euro _SERVER["QUERY_STRING"] => _SERVER["CONTENT_LENGTH"] => _SERVER["MAKELEVEL"] => 1 _SERVER["COLORTERM"] => _SERVER["DISPLAY"] => :1 _SERVER["SHLVL"] => 7 _SERVER["LOGNAME"] => root _SERVER["REDIRECT_STATUS"] => _SERVER["TEST_PHP_EXECUTABLE"] => /home/jpa/dev/php-4.3.3RC3/sapi/cli/php _SERVER["_"] => /home/jpa/dev/php-4.3.3RC3/sapi/cli/php _SERVER["SESSION_MANAGER"] => local/xxxx.xxxxxxxxxxxxx.com:/tmp/.ICE-unix/2087 _SERVER["SHELL"] => /bin/sh _SERVER["USERNAME"] => root _SERVER["QT_XFT"] => 0 _SERVER["HOSTTYPE"] => i386 _SERVER["HISTSIZE"] => 1000 _SERVER["OSTYPE"] => linux-gnu _SERVER["TERM"] => xterm _SERVER["HOME"] => /root _SERVER["SSH_ASKPASS"] => /usr/libexec/openssh/gnome-ssh-askpass _SERVER["PATH"] => /bin:/sbin:/usr/bin:/usr/sbin:/usr/local/bin:/usr/local/sbin:/usr/bin/X11:/u sr/X11R6/bin:/usr/lib/courier/bin:/usr/lib/courier/sbin:/root/bin:/usr/local /mysql/bin _SERVER["CONTENT_TYPE"] => _SERVER["PHP_SELF"] => _SERVER["SCRIPT_NAME"] => _SERVER["DOCUMENT_ROOT"] => _ENV["PWD"] => /home/jpa/dev/php-4.3.3RC3 _ENV["MAKEFLAGS"] => _ENV["SCRIPT_FILENAME"] => _ENV["MFLAGS"] => _ENV["HOSTNAME"] => xxxx.xxxxxxxxxxxxx.com _ENV["QTDIR"] => /usr/lib/qt-2.3.1 _ENV["LESSOPEN"] => |/usr/bin/lesspipe.sh %s _ENV["CC"] => gcc _ENV["KDEDIR"] => /usr _ENV["REQUEST_METHOD"] => _ENV["LS_COLORS"] => no=00:fi=00:di=01;34:ln=01;36:pi=40;33:so=01;35:bd=40;33;01:cd=40;33;01:or=0 1;05;37;41:mi=01;05;37;41:ex=01;32:*.cmd=01;32:*.exe=01;32:*.com=01;32:*.btm =01;32:*.bat=01;32:*.sh=01;32:*.csh=01;32:*.tar=01;31:*.tgz=01;31:*.arj=01;3 1:*.taz=01;31:*.lzh=01;31:*.zip=01;31:*.z=01;31:*.Z=01;31:*.gz=01;31:*.bz2=0 1;31:*.bz=01;31:*.tz=01;31:*.rpm=01;31:*.cpio=01;31:*.jpg=01;35:*.gif=01;35: *.bmp=01;35:*.xbm=01;35:*.xpm=01;35:*.png=01;35:*.tif=01;35: _ENV["USER"] => root _ENV["MACHTYPE"] => i386-redhat-linux-gnu _ENV["VNCDESKTOP"] => X _ENV["TEST_PHP_SRCDIR"] => /home/jpa/dev/php-4.3.3RC3 _ENV["KDE_MULTIHEAD"] => false _ENV["MAIL"] => /var/spool/mail/root _ENV["INPUTRC"] => /etc/inputrc _ENV["BASH_ENV"] => /root/.bashrc _ENV["GTK_RC_FILES"] => /etc/gtk/gtkrc:/root/.gtkrc:/root/.gtkrc-kde _ENV["PATH_TRANSLATED"] => _ENV["LANG"] => fr_FR@euro _ENV["QUERY_STRING"] => _ENV["CONTENT_LENGTH"] => _ENV["MAKELEVEL"] => 1 _ENV["COLORTERM"] => _ENV["DISPLAY"] => :1 _ENV["SHLVL"] => 7 _ENV["LOGNAME"] => root _ENV["REDIRECT_STATUS"] => _ENV["TEST_PHP_EXECUTABLE"] => /home/jpa/dev/php-4.3.3RC3/sapi/cli/php _ENV["_"] => /home/jpa/dev/php-4.3.3RC3/sapi/cli/php _ENV["SESSION_MANAGER"] => local/xxxx.xxxxxxxxxxxxx.com:/tmp/.ICE-unix/2087 _ENV["SHELL"] => /bin/sh _ENV["USERNAME"] => root _ENV["QT_XFT"] => 0 _ENV["HOSTTYPE"] => i386 _ENV["HISTSIZE"] => 1000 _ENV["OSTYPE"] => linux-gnu _ENV["TERM"] => xterm _ENV["HOME"] => /root _ENV["SSH_ASKPASS"] => /usr/libexec/openssh/gnome-ssh-askpass _ENV["PATH"] => /bin:/sbin:/usr/bin:/usr/sbin:/usr/local/bin:/usr/local/sbin:/usr/bin/X11:/u sr/X11R6/bin:/usr/lib/courier/bin:/usr/lib/courier/sbin:/root/bin:/usr/local /mysql/bin _ENV["CONTENT_TYPE"] => PHP License This program is free software; you can redistribute it and/or modify it under the terms of the PHP License as published by the PHP Group and included in the distribution in the file: LICENSE This program is distributed in the hope that it will be useful, but WITHOUT ANY WARRANTY; without even the implied warranty of MERCHANTABILITY or FITNESS FOR A PARTICULAR PURPOSE. If you did not receive a copy of the PHP license, or have any questions about PHP licensing, please contact license@php.net.

« previous php.qa (#15560) next »