Test results for 4.3.3RC4 [failed]
| From: | Seiji Masugata | Date: | Wed, 20 Aug 2003 13:11:56 +0000 |
| Subject: | Test results for 4.3.3RC4 [failed] | ||
| Groups: | php.qa | ||
| Request: | Send a blank email to php-qa+get-15614@lists.php.net to get a copy of this message | ||
=====================================================================
FAILED TEST SUMMARY
---------------------------------------------------------------------
User-space streams [ext/standard/tests/file/userstreams.phpt]
Testing randomization of shuffle() and str_shuffle(). [ext/standard/tests/strings/004.phpt]
Testing str_shuffle. [ext/standard/tests/strings/str_shuffle.phpt]
=====================================================================
=====================================================================
TEST RESULT SUMMARY
---------------------------------------------------------------------
Exts skipped : 76
Exts tested : 11
---------------------------------------------------------------------
Number of tests : 517
Tests skipped : 184 (35.6%)
Tests warned : 0 ( 0.0%)
Tests failed : 3 ( 0.6%)
Tests passed : 330 (63.8%)
---------------------------------------------------------------------
Time taken : 68 seconds
=====================================================================
================================================================================
/usr/local/src/php-4.3.3RC4/ext/standard/tests/file/userstreams.phpt
================================================================================
---- EXPECTED OUTPUT
Not Registered
Registered
Registered
SEEK: OK
FGETS: OK
int(0)
...and the road becomes my bride
---- ACTUAL OUTPUT
Not Registered
Registered
Registered
Notice: Undefined index: in /usr/local/src/php-4.3.3RC4/ext/standard/tests/file/userstreams.php on
line 208
Notice: Undefined index: in /usr/local/src/php-4.3.3RC4/ext/standard/tests/file/userstreams.php on
line 208
Notice: Undefined index: in /usr/local/src/php-4.3.3RC4/ext/standard/tests/file/userstreams.php on
line 208
Notice: Undefined index: in /usr/local/src/php-4.3.3RC4/ext/standard/tests/file/userstreams.php on
line 208
Notice: Undefined index: in /usr/local/src/php-4.3.3RC4/ext/standard/tests/file/userstreams.php on
line 208
Notice: Undefined index: in /usr/local/src/php-4.3.3RC4/ext/standard/tests/file/userstreams.php on
line 208
Notice: Undefined index: in /usr/local/src/php-4.3.3RC4/ext/standard/tests/file/userstreams.php on
line 208
Notice: Undefined index: in /usr/local/src/php-4.3.3RC4/ext/standard/tests/file/userstreams.php on
line 208
Notice: Undefined index: in /usr/local/src/php-4.3.3RC4/ext/standard/tests/file/userstreams.php on
line 208
Notice: Undefined index: in /usr/local/src/php-4.3.3RC4/ext/standard/tests/file/userstreams.php on
line 208
Notice: Undefined index: in /usr/local/src/php-4.3.3RC4/ext/standard/tests/file/userstreams.php on
line 208
Notice: Undefined index: in /usr/local/src/php-4.3.3RC4/ext/standard/tests/file/userstreams.php on
line 208
Notice: Undefined index: in /usr/local/src/php-4.3.3RC4/ext/standard/tests/file/userstreams.php on
line 208
Notice: Undefined index: in /usr/local/src/php-4.3.3RC4/ext/standard/tests/file/userstreams.php on
line 208
Notice: Undefined index: in /usr/local/src/php-4.3.3RC4/ext/standard/tests/file/userstreams.php on
line 208
Notice: Undefined index: in /usr/local/src/php-4.3.3RC4/ext/standard/tests/file/userstreams.php on
line 208
Notice: Undefined index: in /usr/local/src/php-4.3.3RC4/ext/standard/tests/file/userstreams.php on
line 208
Notice: Undefined index: in /usr/local/src/php-4.3.3RC4/ext/standard/tests/file/userstreams.php on
line 208
Notice: Undefined index: in /usr/local/src/php-4.3.3RC4/ext/standard/tests/file/userstreams.php on
line 208
Notice: Undefined index: in /usr/local/src/php-4.3.3RC4/ext/standard/tests/file/userstreams.php on
line 208
Notice: Undefined index: in /usr/local/src/php-4.3.3RC4/ext/standard/tests/file/userstreams.php on
line 208
Notice: Undefined index: in /usr/local/src/php-4.3.3RC4/ext/standard/tests/file/userstreams.php on
line 208
Notice: Undefined index: in /usr/local/src/php-4.3.3RC4/ext/standard/tests/file/userstreams.php on
line 208
Notice: Undefined index: in /usr/local/src/php-4.3.3RC4/ext/standard/tests/file/userstreams.php on
line 208
Notice: Undefined index: in /usr/local/src/php-4.3.3RC4/ext/standard/tests/file/userstreams.php on
line 208
Notice: Undefined index: in /usr/local/src/php-4.3.3RC4/ext/standard/tests/file/userstreams.php on
line 208
Notice: Undefined index: in /usr/local/src/php-4.3.3RC4/ext/standard/tests/file/userstreams.php on
line 208
Notice: Undefined index: in /usr/local/src/php-4.3.3RC4/ext/standard/tests/file/userstreams.php on
line 208
Notice: Undefined index: in /usr/local/src/php-4.3.3RC4/ext/standard/tests/file/userstreams.php on
line 208
Notice: Undefined index: in /usr/local/src/php-4.3.3RC4/ext/standard/tests/file/userstreams.php on
line 208
Notice: Undefined index: in /usr/local/src/php-4.3.3RC4/ext/standard/tests/file/userstreams.php on
line 208
Notice: Undefined index: in /usr/local/src/php-4.3.3RC4/ext/standard/tests/file/userstreams.php on
line 208
Notice: Undefined index: in /usr/local/src/php-4.3.3RC4/ext/standard/tests/file/userstreams.php on
line 208
Notice: Undefined index: in /usr/local/src/php-4.3.3RC4/ext/standard/tests/file/userstreams.php on
line 208
Notice: Undefined index: in /usr/local/src/php-4.3.3RC4/ext/standard/tests/file/userstreams.php on
line 208
Notice: Undefined index: in /usr/local/src/php-4.3.3RC4/ext/standard/tests/file/userstreams.php on
line 208
Notice: Undefined index: in /usr/local/src/php-4.3.3RC4/ext/standard/tests/file/userstreams.php on
line 208
Notice: Undefined index: in /usr/local/src/php-4.3.3RC4/ext/standard/tests/file/userstreams.php on
line 208
Notice: Undefined index: in /usr/local/src/php-4.3.3RC4/ext/standard/tests/file/userstreams.php on
line 208
Notice: Undefined index: in /usr/local/src/php-4.3.3RC4/ext/standard/tests/file/userstreams.php on
line 208
Notice: Undefined index: in /usr/local/src/php-4.3.3RC4/ext/standard/tests/file/userstreams.php on
line 208
Notice: Undefined index: in /usr/local/src/php-4.3.3RC4/ext/standard/tests/file/userstreams.php on
line 208
Notice: Undefined index: in /usr/local/src/php-4.3.3RC4/ext/standard/tests/file/userstreams.php on
line 208
Notice: Undefined index: in /usr/local/src/php-4.3.3RC4/ext/standard/tests/file/userstreams.php on
line 208
Notice: Undefined index: in /usr/local/src/php-4.3.3RC4/ext/standard/tests/file/userstreams.php on
line 208
Notice: Undefined index: in /usr/local/src/php-4.3.3RC4/ext/standard/tests/file/userstreams.php on
line 208
Notice: Undefined index: in /usr/local/src/php-4.3.3RC4/ext/standard/tests/file/userstreams.php on
line 208
Notice: Undefined index: in /usr/local/src/php-4.3.3RC4/ext/standard/tests/file/userstreams.php on
line 208
Notice: Undefined index: in /usr/local/src/php-4.3.3RC4/ext/standard/tests/file/userstreams.php on
line 208
Notice: Undefined index: in /usr/local/src/php-4.3.3RC4/ext/standard/tests/file/userstreams.php on
line 208
Notice: Undefined index: in /usr/local/src/php-4.3.3RC4/ext/standard/tests/file/userstreams.php on
line 208
Notice: Undefined index: in /usr/local/src/php-4.3.3RC4/ext/standard/tests/file/userstreams.php on
line 208
Notice: Undefined index: in /usr/local/src/php-4.3.3RC4/ext/standard/tests/file/userstreams.php on
line 208
Notice: Undefined index: in /usr/local/src/php-4.3.3RC4/ext/standard/tests/file/userstreams.php on
line 208
Notice: Undefined index: in /usr/local/src/php-4.3.3RC4/ext/standard/tests/file/userstreams.php on
line 208
Notice: Undefined index: in /usr/local/src/php-4.3.3RC4/ext/standard/tests/file/userstreams.php on
line 208
Notice: Undefined index: in /usr/local/src/php-4.3.3RC4/ext/standard/tests/file/userstreams.php on
line 208
Notice: Undefined index: in /usr/local/src/php-4.3.3RC4/ext/standard/tests/file/userstreams.php on
line 208
Notice: Undefined index: in /usr/local/src/php-4.3.3RC4/ext/standard/tests/file/userstreams.php on
line 208
Notice: Undefined index: in /usr/local/src/php-4.3.3RC4/ext/standard/tests/file/userstreams.php on
line 208
Notice: Undefined index: in /usr/local/src/php-4.3.3RC4/ext/standard/tests/file/userstreams.php on
line 208
Notice: Undefined index: in /usr/local/src/php-4.3.3RC4/ext/standard/tests/file/userstreams.php on
line 208
Notice: Undefined index: in /usr/local/src/php-4.3.3RC4/ext/standard/tests/file/userstreams.php on
line 208
Notice: Undefined index: in /usr/local/src/php-4.3.3RC4/ext/standard/tests/file/userstreams.php on
line 208
Notice: Undefined index: in /usr/local/src/php-4.3.3RC4/ext/standard/tests/file/userstreams.php on
line 208
Notice: Undefined index: in /usr/local/src/php-4.3.3RC4/ext/standard/tests/file/userstreams.php on
line 208
Notice: Undefined index: in /usr/local/src/php-4.3.3RC4/ext/standard/tests/file/userstreams.php on
line 208
Notice: Undefined index: in /usr/local/src/php-4.3.3RC4/ext/standard/tests/file/userstreams.php on
line 208
Notice: Undefined index: in /usr/local/src/php-4.3.3RC4/ext/standard/tests/file/userstreams.php on
line 208
Notice: Undefined index: in /usr/local/src/php-4.3.3RC4/ext/standard/tests/file/userstreams.php on
line 208
Notice: Undefined index: in /usr/local/src/php-4.3.3RC4/ext/standard/tests/file/userstreams.php on
line 208
Notice: Undefined index: in /usr/local/src/php-4.3.3RC4/ext/standard/tests/file/userstreams.php on
line 208
Notice: Undefined index: in /usr/local/src/php-4.3.3RC4/ext/standard/tests/file/userstreams.php on
line 208
Notice: Undefined index: in /usr/local/src/php-4.3.3RC4/ext/standard/tests/file/userstreams.php on
line 208
Notice: Undefined index: in /usr/local/src/php-4.3.3RC4/ext/standard/tests/file/userstreams.php on
line 208
Notice: Undefined index: in /usr/local/src/php-4.3.3RC4/ext/standard/tests/file/userstreams.php on
line 208
Notice: Undefined index: in /usr/local/src/php-4.3.3RC4/ext/standard/tests/file/userstreams.php on
line 208
Notice: Undefined index: in /usr/local/src/php-4.3.3RC4/ext/standard/tests/file/userstreams.php on
line 208
Notice: Undefined index: in /usr/local/src/php-4.3.3RC4/ext/standard/tests/file/userstreams.php on
line 208
Notice: Undefined index: in /usr/local/src/php-4.3.3RC4/ext/standard/tests/file/userstreams.php on
line 208
Notice: Undefined index: in /usr/local/src/php-4.3.3RC4/ext/standard/tests/file/userstreams.php on
line 208
Notice: Undefined index: in /usr/local/src/php-4.3.3RC4/ext/standard/tests/file/userstreams.php on
line 208
Notice: Undefined index: in /usr/local/src/php-4.3.3RC4/ext/standard/tests/file/userstreams.php on
line 208
Notice: Undefined index: in /usr/local/src/php-4.3.3RC4/ext/standard/tests/file/userstreams.php on
line 208
Notice: Undefined index: in /usr/local/src/php-4.3.3RC4/ext/standard/tests/file/userstreams.php on
line 208
Notice: Undefined index: in /usr/local/src/php-4.3.3RC4/ext/standard/tests/file/userstreams.php on
line 208
Notice: Undefined index: in /usr/local/src/php-4.3.3RC4/ext/standard/tests/file/userstreams.php on
line 208
Notice: Undefined index: in /usr/local/src/php-4.3.3RC4/ext/standard/tests/file/userstreams.php on
line 208
Notice: Undefined index: in /usr/local/src/php-4.3.3RC4/ext/standard/tests/file/userstreams.php on
line 208
Notice: Undefined index: in /usr/local/src/php-4.3.3RC4/ext/standard/tests/file/userstreams.php on
line 208
Notice: Undefined index: in /usr/local/src/php-4.3.3RC4/ext/standard/tests/file/userstreams.php on
line 208
Notice: Undefined index: in /usr/local/src/php-4.3.3RC4/ext/standard/tests/file/userstreams.php on
line 208
Notice: Undefined index: in /usr/local/src/php-4.3.3RC4/ext/standard/tests/file/userstreams.php on
line 208
Notice: Undefined index: in /usr/local/src/php-4.3.3RC4/ext/standard/tests/file/userstreams.php on
line 208
Notice: Undefined index: in /usr/local/src/php-4.3.3RC4/ext/standard/tests/file/userstreams.php on
line 208
Notice: Undefined index: in /usr/local/src/php-4.3.3RC4/ext/standard/tests/file/userstreams.php on
line 208
Notice: Undefined index: in /usr/local/src/php-4.3.3RC4/ext/standard/tests/file/userstreams.php on
line 208
Notice: Undefined index: in /usr/local/src/php-4.3.3RC4/ext/standard/tests/file/userstreams.php on
line 208
Notice: Undefined index: in /usr/local/src/php-4.3.3RC4/ext/standard/tests/file/userstreams.php on
line 208
Notice: Undefined index: in /usr/local/src/php-4.3.3RC4/ext/standard/tests/file/userstreams.php on
line 208
Notice: Undefined index: in /usr/local/src/php-4.3.3RC4/ext/standard/tests/file/userstreams.php on
line 208
Notice: Undefined index: in /usr/local/src/php-4.3.3RC4/ext/standard/tests/file/userstreams.php on
line 208
Notice: Undefined index: in /usr/local/src/php-4.3.3RC4/ext/standard/tests/file/userstreams.php on
line 208
Notice: Undefined index: in /usr/local/src/php-4.3.3RC4/ext/standard/tests/file/userstreams.php on
line 208
Notice: Undefined index: in /usr/local/src/php-4.3.3RC4/ext/standard/tests/file/userstreams.php on
line 208
Notice: Undefined index: in /usr/local/src/php-4.3.3RC4/ext/standard/tests/file/userstreams.php on
line 208
Notice: Undefined index: in /usr/local/src/php-4.3.3RC4/ext/standard/tests/file/userstreams.php on
line 208
Notice: Undefined index: in /usr/local/src/php-4.3.3RC4/ext/standard/tests/file/userstreams.php on
line 208
Notice: Undefined index: in /usr/local/src/php-4.3.3RC4/ext/standard/tests/file/userstreams.php on
line 208
Notice: Undefined index: in /usr/local/src/php-4.3.3RC4/ext/standard/tests/file/userstreams.php on
line 208
Notice: Undefined index: in /usr/local/src/php-4.3.3RC4/ext/standard/tests/file/userstreams.php on
line 208
Notice: Undefined index: in /usr/local/src/php-4.3.3RC4/ext/standard/tests/file/userstreams.php on
line 208
Notice: Undefined index: in /usr/local/src/php-4.3.3RC4/ext/standard/tests/file/userstreams.php on
line 208
Notice: Undefined index: in /usr/local/src/php-4.3.3RC4/ext/standard/tests/file/userstreams.php on
line 208
Notice: Undefined index: in /usr/local/src/php-4.3.3RC4/ext/standard/tests/file/userstreams.php on
line 208
Notice: Undefined index: in /usr/local/src/php-4.3.3RC4/ext/standard/tests/file/userstreams.php on
line 208
Notice: Undefined index: in /usr/local/src/php-4.3.3RC4/ext/standard/tests/file/userstreams.php on
line 208
Notice: Undefined index: in /usr/local/src/php-4.3.3RC4/ext/standard/tests/file/userstreams.php on
line 208
Notice: Undefined index: in /usr/local/src/php-4.3.3RC4/ext/standard/tests/file/userstreams.php on
line 208
Notice: Undefined index: in /usr/local/src/php-4.3.3RC4/ext/standard/tests/file/userstreams.php on
line 208
Notice: Undefined index: in /usr/local/src/php-4.3.3RC4/ext/standard/tests/file/userstreams.php on
line 208
Notice: Undefined index: in /usr/local/src/php-4.3.3RC4/ext/standard/tests/file/userstreams.php on
line 208
Notice: Undefined index: in /usr/local/src/php-4.3.3RC4/ext/standard/tests/file/userstreams.php on
line 208
Notice: Undefined index: in /usr/local/src/php-4.3.3RC4/ext/standard/tests/file/userstreams.php on
line 208
Notice: Undefined index: in /usr/local/src/php-4.3.3RC4/ext/standard/tests/file/userstreams.php on
line 208
Notice: Undefined index: in /usr/local/src/php-4.3.3RC4/ext/standard/tests/file/userstreams.php on
line 208
Notice: Undefined index: in /usr/local/src/php-4.3.3RC4/ext/standard/tests/file/userstreams.php on
line 208
Notice: Undefined index: in /usr/local/src/php-4.3.3RC4/ext/standard/tests/file/userstreams.php on
line 208
Notice: Undefined index: in /usr/local/src/php-4.3.3RC4/ext/standard/tests/file/userstreams.php on
line 208
Notice: Undefined index: in /usr/local/src/php-4.3.3RC4/ext/standard/tests/file/userstreams.php on
line 208
Notice: Undefined index: in /usr/local/src/php-4.3.3RC4/ext/standard/tests/file/userstreams.php on
line 208
Notice: Undefined index: in /usr/local/src/php-4.3.3RC4/ext/standard/tests/file/userstreams.php on
line 208
Notice: Undefined index: in /usr/local/src/php-4.3.3RC4/ext/standard/tests/file/userstreams.php on
line 208
Notice: Undefined index: in /usr/local/src/php-4.3.3RC4/ext/standard/tests/file/userstreams.php on
line 208
Notice: Undefined index: in /usr/local/src/php-4.3.3RC4/ext/standard/tests/file/userstreams.php on
line 208
Notice: Undefined index: in /usr/local/src/php-4.3.3RC4/ext/standard/tests/file/userstreams.php on
line 208
Notice: Undefined index: in /usr/local/src/php-4.3.3RC4/ext/standard/tests/file/userstreams.php on
line 208
Notice: Undefined index: in /usr/local/src/php-4.3.3RC4/ext/standard/tests/file/userstreams.php on
line 208
Notice: Undefined index: in /usr/local/src/php-4.3.3RC4/ext/standard/tests/file/userstreams.php on
line 208
Notice: Undefined index: in /usr/local/src/php-4.3.3RC4/ext/standard/tests/file/userstreams.php on
line 208
Notice: Undefined index: in /usr/local/src/php-4.3.3RC4/ext/standard/tests/file/userstreams.php on
line 208
Notice: Undefined index: in /usr/local/src/php-4.3.3RC4/ext/standard/tests/file/userstreams.php on
line 208
Notice: Undefined index: in /usr/local/src/php-4.3.3RC4/ext/standard/tests/file/userstreams.php on
line 208
Notice: Undefined index: in /usr/local/src/php-4.3.3RC4/ext/standard/tests/file/userstreams.php on
line 208
Notice: Undefined index: in /usr/local/src/php-4.3.3RC4/ext/standard/tests/file/userstreams.php on
line 208
Notice: Undefined index: in /usr/local/src/php-4.3.3RC4/ext/standard/tests/file/userstreams.php on
line 208
Notice: Undefined index: in /usr/local/src/php-4.3.3RC4/ext/standard/tests/file/userstreams.php on
line 208
Notice: Undefined index: in /usr/local/src/php-4.3.3RC4/ext/standard/tests/file/userstreams.php on
line 208
Notice: Undefined index: in /usr/local/src/php-4.3.3RC4/ext/standard/tests/file/userstreams.php on
line 208
Notice: Undefined index: in /usr/local/src/php-4.3.3RC4/ext/standard/tests/file/userstreams.php on
line 208
Notice: Undefined index: in /usr/local/src/php-4.3.3RC4/ext/standard/tests/file/userstreams.php on
line 208
Notice: Undefined index: in /usr/local/src/php-4.3.3RC4/ext/standard/tests/file/userstreams.php on
line 208
Notice: Undefined index: in /usr/local/src/php-4.3.3RC4/ext/standard/tests/file/userstreams.php on
line 208
Notice: Undefined index: in /usr/local/src/php-4.3.3RC4/ext/standard/tests/file/userstreams.php on
line 208
Notice: Undefined index: in /usr/local/src/php-4.3.3RC4/ext/standard/tests/file/userstreams.php on
line 208
Notice: Undefined index: in /usr/local/src/php-4.3.3RC4/ext/standard/tests/file/userstreams.php on
line 208
Notice: Undefined index: in /usr/local/src/php-4.3.3RC4/ext/standard/tests/file/userstreams.php on
line 208
Notice: Undefined index: in /usr/local/src/php-4.3.3RC4/ext/standard/tests/file/userstreams.php on
line 208
Notice: Undefined index: in /usr/local/src/php-4.3.3RC4/ext/standard/tests/file/userstreams.php on
line 208
Notice: Undefined index: in /usr/local/src/php-4.3.3RC4/ext/standard/tests/file/userstreams.php on
line 208
Notice: Undefined index: in /usr/local/src/php-4.3.3RC4/ext/standard/tests/file/userstreams.php on
line 208
Notice: Undefined index: in /usr/local/src/php-4.3.3RC4/ext/standard/tests/file/userstreams.php on
line 208
Notice: Undefined index: in /usr/local/src/php-4.3.3RC4/ext/standard/tests/file/userstreams.php on
line 208
Notice: Undefined index: in /usr/local/src/php-4.3.3RC4/ext/standard/tests/file/userstreams.php on
line 208
Notice: Undefined index: in /usr/local/src/php-4.3.3RC4/ext/standard/tests/file/userstreams.php on
line 208
Notice: Undefined index: in /usr/local/src/php-4.3.3RC4/ext/standard/tests/file/userstreams.php on
line 208
Notice: Undefined index: in /usr/local/src/php-4.3.3RC4/ext/standard/tests/file/userstreams.php on
line 208
Notice: Undefined index: in /usr/local/src/php-4.3.3RC4/ext/standard/tests/file/userstreams.php on
line 208
Notice: Undefined index: in /usr/local/src/php-4.3.3RC4/ext/standard/tests/file/userstreams.php on
line 208
Notice: Undefined index: in /usr/local/src/php-4.3.3RC4/ext/standard/tests/file/userstreams.php on
line 208
Notice: Undefined index: in /usr/local/src/php-4.3.3RC4/ext/standard/tests/file/userstreams.php on
line 208
Notice: Undefined index: in /usr/local/src/php-4.3.3RC4/ext/standard/tests/file/userstreams.php on
line 208
Notice: Undefined index: in /usr/local/src/php-4.3.3RC4/ext/standard/tests/file/userstreams.php on
line 208
Notice: Undefined index: in /usr/local/src/php-4.3.3RC4/ext/standard/tests/file/userstreams.php on
line 208
Notice: Undefined index: in /usr/local/src/php-4.3.3RC4/ext/standard/tests/file/userstreams.php on
line 208
Notice: Undefined index: in /usr/local/src/php-4.3.3RC4/ext/standard/tests/file/userstreams.php on
line 208
Notice: Undefined index: in /usr/local/src/php-4.3.3RC4/ext/standard/tests/file/userstreams.php on
line 208
Notice: Undefined index: in /usr/local/src/php-4.3.3RC4/ext/standard/tests/file/userstreams.php on
line 208
Notice: Undefined index: in /usr/local/src/php-4.3.3RC4/ext/standard/tests/file/userstreams.php on
line 208
Notice: Undefined index: in /usr/local/src/php-4.3.3RC4/ext/standard/tests/file/userstreams.php on
line 208
Notice: Undefined index: in /usr/local/src/php-4.3.3RC4/ext/standard/tests/file/userstreams.php on
line 208
Notice: Undefined index: in /usr/local/src/php-4.3.3RC4/ext/standard/tests/file/userstreams.php on
line 208
Notice: Undefined index: in /usr/local/src/php-4.3.3RC4/ext/standard/tests/file/userstreams.php on
line 208
Notice: Undefined index: in /usr/local/src/php-4.3.3RC4/ext/standard/tests/file/userstreams.php on
line 208
Notice: Undefined index: in /usr/local/src/php-4.3.3RC4/ext/standard/tests/file/userstreams.php on
line 208
Notice: Undefined index: in /usr/local/src/php-4.3.3RC4/ext/standard/tests/file/userstreams.php on
line 208
Notice: Undefined index: in /usr/local/src/php-4.3.3RC4/ext/standard/tests/file/userstreams.php on
line 208
Notice: Undefined index: in /usr/local/src/php-4.3.3RC4/ext/standard/tests/file/userstreams.php on
line 208
Notice: Undefined index: in /usr/local/src/php-4.3.3RC4/ext/standard/tests/file/userstreams.php on
line 208
Notice: Undefined index: in /usr/local/src/php-4.3.3RC4/ext/standard/tests/file/userstreams.php on
line 208
Notice: Undefined index: in /usr/local/src/php-4.3.3RC4/ext/standard/tests/file/userstreams.php on
line 208
Notice: Undefined index: in /usr/local/src/php-4.3.3RC4/ext/standard/tests/file/userstreams.php on
line 208
Notice: Undefined index: in /usr/local/src/php-4.3.3RC4/ext/standard/tests/file/userstreams.php on
line 208
Notice: Undefined index: in /usr/local/src/php-4.3.3RC4/ext/standard/tests/file/userstreams.php on
line 208
Notice: Undefined index: in /usr/local/src/php-4.3.3RC4/ext/standard/tests/file/userstreams.php on
line 208
Notice: Undefined index: in /usr/local/src/php-4.3.3RC4/ext/standard/tests/file/userstreams.php on
line 208
Notice: Undefined index: in /usr/local/src/php-4.3.3RC4/ext/standard/tests/file/userstreams.php on
line 208
Notice: Undefined index: in /usr/local/src/php-4.3.3RC4/ext/standard/tests/file/userstreams.php on
line 208
Notice: Undefined index: in /usr/local/src/php-4.3.3RC4/ext/standard/tests/file/userstreams.php on
line 208
Notice: Undefined index: in /usr/local/src/php-4.3.3RC4/ext/standard/tests/file/userstreams.php on
line 208
Notice: Undefined index: in /usr/local/src/php-4.3.3RC4/ext/standard/tests/file/userstreams.php on
line 208
Notice: Undefined index: in /usr/local/src/php-4.3.3RC4/ext/standard/tests/file/userstreams.php on
line 208
Notice: Undefined index: in /usr/local/src/php-4.3.3RC4/ext/standard/tests/file/userstreams.php on
line 208
Notice: Undefined index: in /usr/local/src/php-4.3.3RC4/ext/standard/tests/file/userstreams.php on
line 208
Notice: Undefined index: in /usr/local/src/php-4.3.3RC4/ext/standard/tests/file/userstreams.php on
line 208
Notice: Undefined index: in /usr/local/src/php-4.3.3RC4/ext/standard/tests/file/userstreams.php on
line 208
Notice: Undefined index: in /usr/local/src/php-4.3.3RC4/ext/standard/tests/file/userstreams.php on
line 208
Notice: Undefined index: in /usr/local/src/php-4.3.3RC4/ext/standard/tests/file/userstreams.php on
line 208
Notice: Undefined index: in /usr/local/src/php-4.3.3RC4/ext/standard/tests/file/userstreams.php on
line 208
Notice: Undefined index: in /usr/local/src/php-4.3.3RC4/ext/standard/tests/file/userstreams.php on
line 208
Notice: Undefined index: in /usr/local/src/php-4.3.3RC4/ext/standard/tests/file/userstreams.php on
line 208
Notice: Undefined index: in /usr/local/src/php-4.3.3RC4/ext/standard/tests/file/userstreams.php on
line 208
Notice: Undefined index: in /usr/local/src/php-4.3.3RC4/ext/standard/tests/file/userstreams.php on
line 208
Notice: Undefined index: in /usr/local/src/php-4.3.3RC4/ext/standard/tests/file/userstreams.php on
line 208
Notice: Undefined index: in /usr/local/src/php-4.3.3RC4/ext/standard/tests/file/userstreams.php on
line 208
Notice: Undefined index: in /usr/local/src/php-4.3.3RC4/ext/standard/tests/file/userstreams.php on
line 208
Notice: Undefined index: in /usr/local/src/php-4.3.3RC4/ext/standard/tests/file/userstreams.php on
line 208
Notice: Undefined index: in /usr/local/src/php-4.3.3RC4/ext/standard/tests/file/userstreams.php on
line 208
Notice: Undefined index: in /usr/local/src/php-4.3.3RC4/ext/standard/tests/file/userstreams.php on
line 208
Notice: Undefined index: in /usr/local/src/php-4.3.3RC4/ext/standard/tests/file/userstreams.php on
line 208
Notice: Undefined index: in /usr/local/src/php-4.3.3RC4/ext/standard/tests/file/userstreams.php on
line 208
Notice: Undefined index: in /usr/local/src/php-4.3.3RC4/ext/standard/tests/file/userstreams.php on
line 208
Notice: Undefined index: in /usr/local/src/php-4.3.3RC4/ext/standard/tests/file/userstreams.php on
line 208
Notice: Undefined index: in /usr/local/src/php-4.3.3RC4/ext/standard/tests/file/userstreams.php on
line 208
Notice: Undefined index: in /usr/local/src/php-4.3.3RC4/ext/standard/tests/file/userstreams.php on
line 208
Notice: Undefined index: in /usr/local/src/php-4.3.3RC4/ext/standard/tests/file/userstreams.php on
line 208
Notice: Undefined index: in /usr/local/src/php-4.3.3RC4/ext/standard/tests/file/userstreams.php on
line 208
Notice: Undefined index: in /usr/local/src/php-4.3.3RC4/ext/standard/tests/file/userstreams.php on
line 208
Notice: Undefined index: in /usr/local/src/php-4.3.3RC4/ext/standard/tests/file/userstreams.php on
line 208
Notice: Undefined index: in /usr/local/src/php-4.3.3RC4/ext/standard/tests/file/userstreams.php on
line 208
Notice: Undefined index: in /usr/local/src/php-4.3.3RC4/ext/standard/tests/file/userstreams.php on
line 208
Notice: Undefined index: in /usr/local/src/php-4.3.3RC4/ext/standard/tests/file/userstreams.php on
line 208
Notice: Undefined index: in /usr/local/src/php-4.3.3RC4/ext/standard/tests/file/userstreams.php on
line 208
Notice: Undefined index: in /usr/local/src/php-4.3.3RC4/ext/standard/tests/file/userstreams.php on
line 208
Notice: Undefined index: in /usr/local/src/php-4.3.3RC4/ext/standard/tests/file/userstreams.php on
line 208
Notice: Undefined index: in /usr/local/src/php-4.3.3RC4/ext/standard/tests/file/userstreams.php on
line 208
Notice: Undefined index: in /usr/local/src/php-4.3.3RC4/ext/standard/tests/file/userstreams.php on
line 208
Notice: Undefined index: in /usr/local/src/php-4.3.3RC4/ext/standard/tests/file/userstreams.php on
line 208
Notice: Undefined index: in /usr/local/src/php-4.3.3RC4/ext/standard/tests/file/userstreams.php on
line 208
Notice: Undefined index: in /usr/local/src/php-4.3.3RC4/ext/standard/tests/file/userstreams.php on
line 208
Notice: Undefined index: in /usr/local/src/php-4.3.3RC4/ext/standard/tests/file/userstreams.php on
line 208
Notice: Undefined index: in /usr/local/src/php-4.3.3RC4/ext/standard/tests/file/userstreams.php on
line 208
Notice: Undefined index: in /usr/local/src/php-4.3.3RC4/ext/standard/tests/file/userstreams.php on
line 208
Notice: Undefined index: in /usr/local/src/php-4.3.3RC4/ext/standard/tests/file/userstreams.php on
line 208
Notice: Undefined index: in /usr/local/src/php-4.3.3RC4/ext/standard/tests/file/userstreams.php on
line 208
Notice: Undefined index: in /usr/local/src/php-4.3.3RC4/ext/standard/tests/file/userstreams.php on
line 208
Notice: Undefined index: in /usr/local/src/php-4.3.3RC4/ext/standard/tests/file/userstreams.php on
line 208
Notice: Undefined index: in /usr/local/src/php-4.3.3RC4/ext/standard/tests/file/userstreams.php on
line 208
Notice: Undefined index: in /usr/local/src/php-4.3.3RC4/ext/standard/tests/file/userstreams.php on
line 208
Notice: Undefined index: in /usr/local/src/php-4.3.3RC4/ext/standard/tests/file/userstreams.php on
line 208
Notice: Undefined index: in /usr/local/src/php-4.3.3RC4/ext/standard/tests/file/userstreams.php on
line 208
Notice: Undefined index: in /usr/local/src/php-4.3.3RC4/ext/standard/tests/file/userstreams.php on
line 208
Notice: Undefined index: in /usr/local/src/php-4.3.3RC4/ext/standard/tests/file/userstreams.php on
line 208
Notice: Undefined index: in /usr/local/src/php-4.3.3RC4/ext/standard/tests/file/userstreams.php on
line 208
Notice: Undefined index: in /usr/local/src/php-4.3.3RC4/ext/standard/tests/file/userstreams.php on
line 208
Notice: Undefined index: in /usr/local/src/php-4.3.3RC4/ext/standard/tests/file/userstreams.php on
line 208
--[0] whence=SEEK_SET offset=0 line_length=1024 position_should_be=0 --
REAL: pos=(0,0,0) ret=0 line[33]=`...naq gur ebnq orpbzrf zl oevqr
'
USER: pos=(0,0,0) ret=0 line[33]=`...naq gur ebnq orpbzrf zl oevqr
'
--[1] whence=SEEK_CUR offset=8450 line_length=1024 position_should_be=8450 --
REAL: pos=(0,8450,8450) ret=0 line[6]=`where
'
USER: pos=(0,8450,8450) ret=0 line[6]=`where
'
--[2] whence=SEEK_CUR offset=-7904 line_length=1024 position_should_be=546 --
REAL: pos=(8450,546,546) ret=0 line[17]=`er frirerq pyrna
'
USER: pos=(8450,546,546) ret=0 line[17]=`er frirerq pyrna
'
--[3] whence=SEEK_CUR offset=12456 line_length=1024 position_should_be=13002 --
REAL: pos=(546,13002,13002) ret=0 line[18]=`erever I May Roam
'
USER: pos=(546,13002,13002) ret=0 line[18]=`erever I May Roam
'
--[4] whence=SEEK_SET offset=0 line_length=1024 position_should_be=0 --
REAL: pos=(13002,0,0) ret=0 line[33]=`...naq gur ebnq orpbzrf zl oevqr
'
USER: pos=(13002,0,0) ret=0 line[33]=`...naq gur ebnq orpbzrf zl oevqr
'
Notice: Undefined index: in /usr/local/src/php-4.3.3RC4/ext/standard/tests/file/userstreams.php on
line 255
--[5] whence= offset=429861302 line_length=1024 position_should_be=429861302 --
REAL: pos=(0,429861302,429861302) ret=0 line[0]=`'
USER: pos=(0,0,0) ret=0 line[33]=`...naq gur ebnq orpbzrf zl oevqr
'
###################################### FAIL!
array(7) {
["wrapper_data"]=>
&object(mystream)(5) {
["path"]=>
string(11) "test://DATA"
["mode"]=>
string(2) "rb"
["options"]=>
int(4)
["position"]=>
int(0)
["varname"]=>
string(4) "DATA"
}
["wrapper_type"]=>
string(10) "user-space"
["stream_type"]=>
string(10) "user-space"
["unread_bytes"]=>
int(0)
["timed_out"]=>
bool(false)
["blocked"]=>
bool(true)
["eof"]=>
bool(false)
}
SEEK: FAIL
FGETS: OK
int(0)
...and the road becomes my bride
---- FAILED
================================================================================
004- SEEK: OK
004+
005- FGETS: OK
005+ Notice: Undefined index: in
/usr/local/src/php-4.3.3RC4/ext/standard/tests/file/userstreams.php on line 208
006- int(0)
006+
007- ...and the road becomes my bride
007+ Notice: Undefined index: in
/usr/local/src/php-4.3.3RC4/ext/standard/tests/file/userstreams.php on line 208
008+
009+ Notice: Undefined index: in
/usr/local/src/php-4.3.3RC4/ext/standard/tests/file/userstreams.php on line 208
010+
011+ Notice: Undefined index: in
/usr/local/src/php-4.3.3RC4/ext/standard/tests/file/userstreams.php on line 208
012+
013+ Notice: Undefined index: in
/usr/local/src/php-4.3.3RC4/ext/standard/tests/file/userstreams.php on line 208
014+
015+ Notice: Undefined index: in
/usr/local/src/php-4.3.3RC4/ext/standard/tests/file/userstreams.php on line 208
016+
017+ Notice: Undefined index: in
/usr/local/src/php-4.3.3RC4/ext/standard/tests/file/userstreams.php on line 208
018+
019+ Notice: Undefined index: in
/usr/local/src/php-4.3.3RC4/ext/standard/tests/file/userstreams.php on line 208
020+
021+ Notice: Undefined index: in
/usr/local/src/php-4.3.3RC4/ext/standard/tests/file/userstreams.php on line 208
022+
023+ Notice: Undefined index: in
/usr/local/src/php-4.3.3RC4/ext/standard/tests/file/userstreams.php on line 208
024+
025+ Notice: Undefined index: in
/usr/local/src/php-4.3.3RC4/ext/standard/tests/file/userstreams.php on line 208
026+
027+ Notice: Undefined index: in
/usr/local/src/php-4.3.3RC4/ext/standard/tests/file/userstreams.php on line 208
028+
029+ Notice: Undefined index: in
/usr/local/src/php-4.3.3RC4/ext/standard/tests/file/userstreams.php on line 208
030+
031+ Notice: Undefined index: in
/usr/local/src/php-4.3.3RC4/ext/standard/tests/file/userstreams.php on line 208
032+
033+ Notice: Undefined index: in
/usr/local/src/php-4.3.3RC4/ext/standard/tests/file/userstreams.php on line 208
034+
035+ Notice: Undefined index: in
/usr/local/src/php-4.3.3RC4/ext/standard/tests/file/userstreams.php on line 208
036+
037+ Notice: Undefined index: in
/usr/local/src/php-4.3.3RC4/ext/standard/tests/file/userstreams.php on line 208
038+
039+ Notice: Undefined index: in
/usr/local/src/php-4.3.3RC4/ext/standard/tests/file/userstreams.php on line 208
040+
041+ Notice: Undefined index: in
/usr/local/src/php-4.3.3RC4/ext/standard/tests/file/userstreams.php on line 208
042+
043+ Notice: Undefined index: in
/usr/local/src/php-4.3.3RC4/ext/standard/tests/file/userstreams.php on line 208
044+
045+ Notice: Undefined index: in
/usr/local/src/php-4.3.3RC4/ext/standard/tests/file/userstreams.php on line 208
046+
047+ Notice: Undefined index: in
/usr/local/src/php-4.3.3RC4/ext/standard/tests/file/userstreams.php on line 208
048+
049+ Notice: Undefined index: in
/usr/local/src/php-4.3.3RC4/ext/standard/tests/file/userstreams.php on line 208
050+
051+ Notice: Undefined index: in
/usr/local/src/php-4.3.3RC4/ext/standard/tests/file/userstreams.php on line 208
052+
053+ Notice: Undefined index: in
/usr/local/src/php-4.3.3RC4/ext/standard/tests/file/userstreams.php on line 208
054+
055+ Notice: Undefined index: in
/usr/local/src/php-4.3.3RC4/ext/standard/tests/file/userstreams.php on line 208
056+
057+ Notice: Undefined index: in
/usr/local/src/php-4.3.3RC4/ext/standard/tests/file/userstreams.php on line 208
058+
059+ Notice: Undefined index: in
/usr/local/src/php-4.3.3RC4/ext/standard/tests/file/userstreams.php on line 208
060+
061+ Notice: Undefined index: in
/usr/local/src/php-4.3.3RC4/ext/standard/tests/file/userstreams.php on line 208
062+
063+ Notice: Undefined index: in
/usr/local/src/php-4.3.3RC4/ext/standard/tests/file/userstreams.php on line 208
064+
065+ Notice: Undefined index: in
/usr/local/src/php-4.3.3RC4/ext/standard/tests/file/userstreams.php on line 208
066+
067+ Notice: Undefined index: in
/usr/local/src/php-4.3.3RC4/ext/standard/tests/file/userstreams.php on line 208
068+
069+ Notice: Undefined index: in
/usr/local/src/php-4.3.3RC4/ext/standard/tests/file/userstreams.php on line 208
070+
071+ Notice: Undefined index: in
/usr/local/src/php-4.3.3RC4/ext/standard/tests/file/userstreams.php on line 208
072+
073+ Notice: Undefined index: in
/usr/local/src/php-4.3.3RC4/ext/standard/tests/file/userstreams.php on line 208
074+
075+ Notice: Undefined index: in
/usr/local/src/php-4.3.3RC4/ext/standard/tests/file/userstreams.php on line 208
076+
077+ Notice: Undefined index: in
/usr/local/src/php-4.3.3RC4/ext/standard/tests/file/userstreams.php on line 208
078+
079+ Notice: Undefined index: in
/usr/local/src/php-4.3.3RC4/ext/standard/tests/file/userstreams.php on line 208
080+
081+ Notice: Undefined index: in
/usr/local/src/php-4.3.3RC4/ext/standard/tests/file/userstreams.php on line 208
082+
083+ Notice: Undefined index: in
/usr/local/src/php-4.3.3RC4/ext/standard/tests/file/userstreams.php on line 208
084+
085+ Notice: Undefined index: in
/usr/local/src/php-4.3.3RC4/ext/standard/tests/file/userstreams.php on line 208
086+
087+ Notice: Undefined index: in
/usr/local/src/php-4.3.3RC4/ext/standard/tests/file/userstreams.php on line 208
088+
089+ Notice: Undefined index: in
/usr/local/src/php-4.3.3RC4/ext/standard/tests/file/userstreams.php on line 208
090+
091+ Notice: Undefined index: in
/usr/local/src/php-4.3.3RC4/ext/standard/tests/file/userstreams.php on line 208
092+
093+ Notice: Undefined index: in
/usr/local/src/php-4.3.3RC4/ext/standard/tests/file/userstreams.php on line 208
094+
095+ Notice: Undefined index: in
/usr/local/src/php-4.3.3RC4/ext/standard/tests/file/userstreams.php on line 208
096+
097+ Notice: Undefined index: in
/usr/local/src/php-4.3.3RC4/ext/standard/tests/file/userstreams.php on line 208
098+
099+ Notice: Undefined index: in
/usr/local/src/php-4.3.3RC4/ext/standard/tests/file/userstreams.php on line 208
100+
101+ Notice: Undefined index: in
/usr/local/src/php-4.3.3RC4/ext/standard/tests/file/userstreams.php on line 208
102+
103+ Notice: Undefined index: in
/usr/local/src/php-4.3.3RC4/ext/standard/tests/file/userstreams.php on line 208
104+
105+ Notice: Undefined index: in
/usr/local/src/php-4.3.3RC4/ext/standard/tests/file/userstreams.php on line 208
106+
107+ Notice: Undefined index: in
/usr/local/src/php-4.3.3RC4/ext/standard/tests/file/userstreams.php on line 208
108+
109+ Notice: Undefined index: in
/usr/local/src/php-4.3.3RC4/ext/standard/tests/file/userstreams.php on line 208
110+
111+ Notice: Undefined index: in
/usr/local/src/php-4.3.3RC4/ext/standard/tests/file/userstreams.php on line 208
112+
113+ Notice: Undefined index: in
/usr/local/src/php-4.3.3RC4/ext/standard/tests/file/userstreams.php on line 208
114+
115+ Notice: Undefined index: in
/usr/local/src/php-4.3.3RC4/ext/standard/tests/file/userstreams.php on line 208
116+
117+ Notice: Undefined index: in
/usr/local/src/php-4.3.3RC4/ext/standard/tests/file/userstreams.php on line 208
118+
119+ Notice: Undefined index: in
/usr/local/src/php-4.3.3RC4/ext/standard/tests/file/userstreams.php on line 208
120+
121+ Notice: Undefined index: in
/usr/local/src/php-4.3.3RC4/ext/standard/tests/file/userstreams.php on line 208
122+
123+ Notice: Undefined index: in
/usr/local/src/php-4.3.3RC4/ext/standard/tests/file/userstreams.php on line 208
124+
125+ Notice: Undefined index: in
/usr/local/src/php-4.3.3RC4/ext/standard/tests/file/userstreams.php on line 208
126+
127+ Notice: Undefined index: in
/usr/local/src/php-4.3.3RC4/ext/standard/tests/file/userstreams.php on line 208
128+
129+ Notice: Undefined index: in
/usr/local/src/php-4.3.3RC4/ext/standard/tests/file/userstreams.php on line 208
130+
131+ Notice: Undefined index: in
/usr/local/src/php-4.3.3RC4/ext/standard/tests/file/userstreams.php on line 208
132+
133+ Notice: Undefined index: in
/usr/local/src/php-4.3.3RC4/ext/standard/tests/file/userstreams.php on line 208
134+
135+ Notice: Undefined index: in
/usr/local/src/php-4.3.3RC4/ext/standard/tests/file/userstreams.php on line 208
136+
137+ Notice: Undefined index: in
/usr/local/src/php-4.3.3RC4/ext/standard/tests/file/userstreams.php on line 208
138+
139+ Notice: Undefined index: in
/usr/local/src/php-4.3.3RC4/ext/standard/tests/file/userstreams.php on line 208
140+
141+ Notice: Undefined index: in
/usr/local/src/php-4.3.3RC4/ext/standard/tests/file/userstreams.php on line 208
142+
143+ Notice: Undefined index: in
/usr/local/src/php-4.3.3RC4/ext/standard/tests/file/userstreams.php on line 208
144+
145+ Notice: Undefined index: in
/usr/local/src/php-4.3.3RC4/ext/standard/tests/file/userstreams.php on line 208
146+
147+ Notice: Undefined index: in
/usr/local/src/php-4.3.3RC4/ext/standard/tests/file/userstreams.php on line 208
148+
149+ Notice: Undefined index: in
/usr/local/src/php-4.3.3RC4/ext/standard/tests/file/userstreams.php on line 208
150+
151+ Notice: Undefined index: in
/usr/local/src/php-4.3.3RC4/ext/standard/tests/file/userstreams.php on line 208
152+
153+ Notice: Undefined index: in
/usr/local/src/php-4.3.3RC4/ext/standard/tests/file/userstreams.php on line 208
154+
155+ Notice: Undefined index: in
/usr/local/src/php-4.3.3RC4/ext/standard/tests/file/userstreams.php on line 208
156+
157+ Notice: Undefined index: in
/usr/local/src/php-4.3.3RC4/ext/standard/tests/file/userstreams.php on line 208
158+
159+ Notice: Undefined index: in
/usr/local/src/php-4.3.3RC4/ext/standard/tests/file/userstreams.php on line 208
160+
161+ Notice: Undefined index: in
/usr/local/src/php-4.3.3RC4/ext/standard/tests/file/userstreams.php on line 208
162+
163+ Notice: Undefined index: in
/usr/local/src/php-4.3.3RC4/ext/standard/tests/file/userstreams.php on line 208
164+
165+ Notice: Undefined index: in
/usr/local/src/php-4.3.3RC4/ext/standard/tests/file/userstreams.php on line 208
166+
167+ Notice: Undefined index: in
/usr/local/src/php-4.3.3RC4/ext/standard/tests/file/userstreams.php on line 208
168+
169+ Notice: Undefined index: in
/usr/local/src/php-4.3.3RC4/ext/standard/tests/file/userstreams.php on line 208
170+
171+ Notice: Undefined index: in
/usr/local/src/php-4.3.3RC4/ext/standard/tests/file/userstreams.php on line 208
172+
173+ Notice: Undefined index: in
/usr/local/src/php-4.3.3RC4/ext/standard/tests/file/userstreams.php on line 208
174+
175+ Notice: Undefined index: in
/usr/local/src/php-4.3.3RC4/ext/standard/tests/file/userstreams.php on line 208
176+
177+ Notice: Undefined index: in
/usr/local/src/php-4.3.3RC4/ext/standard/tests/file/userstreams.php on line 208
178+
179+ Notice: Undefined index: in
/usr/local/src/php-4.3.3RC4/ext/standard/tests/file/userstreams.php on line 208
180+
181+ Notice: Undefined index: in
/usr/local/src/php-4.3.3RC4/ext/standard/tests/file/userstreams.php on line 208
182+
183+ Notice: Undefined index: in
/usr/local/src/php-4.3.3RC4/ext/standard/tests/file/userstreams.php on line 208
184+
185+ Notice: Undefined index: in
/usr/local/src/php-4.3.3RC4/ext/standard/tests/file/userstreams.php on line 208
186+
187+ Notice: Undefined index: in
/usr/local/src/php-4.3.3RC4/ext/standard/tests/file/userstreams.php on line 208
188+
189+ Notice: Undefined index: in
/usr/local/src/php-4.3.3RC4/ext/standard/tests/file/userstreams.php on line 208
190+
191+ Notice: Undefined index: in
/usr/local/src/php-4.3.3RC4/ext/standard/tests/file/userstreams.php on line 208
192+
193+ Notice: Undefined index: in
/usr/local/src/php-4.3.3RC4/ext/standard/tests/file/userstreams.php on line 208
194+
195+ Notice: Undefined index: in
/usr/local/src/php-4.3.3RC4/ext/standard/tests/file/userstreams.php on line 208
196+
197+ Notice: Undefined index: in
/usr/local/src/php-4.3.3RC4/ext/standard/tests/file/userstreams.php on line 208
198+
199+ Notice: Undefined index: in
/usr/local/src/php-4.3.3RC4/ext/standard/tests/file/userstreams.php on line 208
200+
201+ Notice: Undefined index: in
/usr/local/src/php-4.3.3RC4/ext/standard/tests/file/userstreams.php on line 208
202+
203+ Notice: Undefined index: in
/usr/local/src/php-4.3.3RC4/ext/standard/tests/file/userstreams.php on line 208
204+
205+ Notice: Undefined index: in
/usr/local/src/php-4.3.3RC4/ext/standard/tests/file/userstreams.php on line 208
206+
207+ Notice: Undefined index: in
/usr/local/src/php-4.3.3RC4/ext/standard/tests/file/userstreams.php on line 208
208+
209+ Notice: Undefined index: in
/usr/local/src/php-4.3.3RC4/ext/standard/tests/file/userstreams.php on line 208
210+
211+ Notice: Undefined index: in
/usr/local/src/php-4.3.3RC4/ext/standard/tests/file/userstreams.php on line 208
212+
213+ Notice: Undefined index: in
/usr/local/src/php-4.3.3RC4/ext/standard/tests/file/userstreams.php on line 208
214+
215+ Notice: Undefined index: in
/usr/local/src/php-4.3.3RC4/ext/standard/tests/file/userstreams.php on line 208
216+
217+ Notice: Undefined index: in
/usr/local/src/php-4.3.3RC4/ext/standard/tests/file/userstreams.php on line 208
218+
219+ Notice: Undefined index: in
/usr/local/src/php-4.3.3RC4/ext/standard/tests/file/userstreams.php on line 208
220+
221+ Notice: Undefined index: in
/usr/local/src/php-4.3.3RC4/ext/standard/tests/file/userstreams.php on line 208
222+
223+ Notice: Undefined index: in
/usr/local/src/php-4.3.3RC4/ext/standard/tests/file/userstreams.php on line 208
224+
225+ Notice: Undefined index: in
/usr/local/src/php-4.3.3RC4/ext/standard/tests/file/userstreams.php on line 208
226+
227+ Notice: Undefined index: in
/usr/local/src/php-4.3.3RC4/ext/standard/tests/file/userstreams.php on line 208
228+
229+ Notice: Undefined index: in
/usr/local/src/php-4.3.3RC4/ext/standard/tests/file/userstreams.php on line 208
230+
231+ Notice: Undefined index: in
/usr/local/src/php-4.3.3RC4/ext/standard/tests/file/userstreams.php on line 208
232+
233+ Notice: Undefined index: in
/usr/local/src/php-4.3.3RC4/ext/standard/tests/file/userstreams.php on line 208
234+
235+ Notice: Undefined index: in
/usr/local/src/php-4.3.3RC4/ext/standard/tests/file/userstreams.php on line 208
236+
237+ Notice: Undefined index: in
/usr/local/src/php-4.3.3RC4/ext/standard/tests/file/userstreams.php on line 208
238+
239+ Notice: Undefined index: in
/usr/local/src/php-4.3.3RC4/ext/standard/tests/file/userstreams.php on line 208
240+
241+ Notice: Undefined index: in
/usr/local/src/php-4.3.3RC4/ext/standard/tests/file/userstreams.php on line 208
242+
243+ Notice: Undefined index: in
/usr/local/src/php-4.3.3RC4/ext/standard/tests/file/userstreams.php on line 208
244+
245+ Notice: Undefined index: in
/usr/local/src/php-4.3.3RC4/ext/standard/tests/file/userstreams.php on line 208
246+
247+ Notice: Undefined index: in
/usr/local/src/php-4.3.3RC4/ext/standard/tests/file/userstreams.php on line 208
248+
249+ Notice: Undefined index: in
/usr/local/src/php-4.3.3RC4/ext/standard/tests/file/userstreams.php on line 208
250+
251+ Notice: Undefined index: in
/usr/local/src/php-4.3.3RC4/ext/standard/tests/file/userstreams.php on line 208
252+
253+ Notice: Undefined index: in
/usr/local/src/php-4.3.3RC4/ext/standard/tests/file/userstreams.php on line 208
254+
255+ Notice: Undefined index: in
/usr/local/src/php-4.3.3RC4/ext/standard/tests/file/userstreams.php on line 208
256+
257+ Notice: Undefined index: in
/usr/local/src/php-4.3.3RC4/ext/standard/tests/file/userstreams.php on line 208
258+
259+ Notice: Undefined index: in
/usr/local/src/php-4.3.3RC4/ext/standard/tests/file/userstreams.php on line 208
260+
261+ Notice: Undefined index: in
/usr/local/src/php-4.3.3RC4/ext/standard/tests/file/userstreams.php on line 208
262+
263+ Notice: Undefined index: in
/usr/local/src/php-4.3.3RC4/ext/standard/tests/file/userstreams.php on line 208
264+
265+ Notice: Undefined index: in
/usr/local/src/php-4.3.3RC4/ext/standard/tests/file/userstreams.php on line 208
266+
267+ Notice: Undefined index: in
/usr/local/src/php-4.3.3RC4/ext/standard/tests/file/userstreams.php on line 208
268+
269+ Notice: Undefined index: in
/usr/local/src/php-4.3.3RC4/ext/standard/tests/file/userstreams.php on line 208
270+
271+ Notice: Undefined index: in
/usr/local/src/php-4.3.3RC4/ext/standard/tests/file/userstreams.php on line 208
272+
273+ Notice: Undefined index: in
/usr/local/src/php-4.3.3RC4/ext/standard/tests/file/userstreams.php on line 208
274+
275+ Notice: Undefined index: in
/usr/local/src/php-4.3.3RC4/ext/standard/tests/file/userstreams.php on line 208
276+
277+ Notice: Undefined index: in
/usr/local/src/php-4.3.3RC4/ext/standard/tests/file/userstreams.php on line 208
278+
279+ Notice: Undefined index: in
/usr/local/src/php-4.3.3RC4/ext/standard/tests/file/userstreams.php on line 208
280+
281+ Notice: Undefined index: in
/usr/local/src/php-4.3.3RC4/ext/standard/tests/file/userstreams.php on line 208
282+
283+ Notice: Undefined index: in
/usr/local/src/php-4.3.3RC4/ext/standard/tests/file/userstreams.php on line 208
284+
285+ Notice: Undefined index: in
/usr/local/src/php-4.3.3RC4/ext/standard/tests/file/userstreams.php on line 208
286+
287+ Notice: Undefined index: in
/usr/local/src/php-4.3.3RC4/ext/standard/tests/file/userstreams.php on line 208
288+
289+ Notice: Undefined index: in
/usr/local/src/php-4.3.3RC4/ext/standard/tests/file/userstreams.php on line 208
290+
291+ Notice: Undefined index: in
/usr/local/src/php-4.3.3RC4/ext/standard/tests/file/userstreams.php on line 208
292+
293+ Notice: Undefined index: in
/usr/local/src/php-4.3.3RC4/ext/standard/tests/file/userstreams.php on line 208
294+
295+ Notice: Undefined index: in
/usr/local/src/php-4.3.3RC4/ext/standard/tests/file/userstreams.php on line 208
296+
297+ Notice: Undefined index: in
/usr/local/src/php-4.3.3RC4/ext/standard/tests/file/userstreams.php on line 208
298+
299+ Notice: Undefined index: in
/usr/local/src/php-4.3.3RC4/ext/standard/tests/file/userstreams.php on line 208
300+
301+ Notice: Undefined index: in
/usr/local/src/php-4.3.3RC4/ext/standard/tests/file/userstreams.php on line 208
302+
303+ Notice: Undefined index: in
/usr/local/src/php-4.3.3RC4/ext/standard/tests/file/userstreams.php on line 208
304+
305+ Notice: Undefined index: in
/usr/local/src/php-4.3.3RC4/ext/standard/tests/file/userstreams.php on line 208
306+
307+ Notice: Undefined index: in
/usr/local/src/php-4.3.3RC4/ext/standard/tests/file/userstreams.php on line 208
308+
309+ Notice: Undefined index: in
/usr/local/src/php-4.3.3RC4/ext/standard/tests/file/userstreams.php on line 208
310+
311+ Notice: Undefined index: in
/usr/local/src/php-4.3.3RC4/ext/standard/tests/file/userstreams.php on line 208
312+
313+ Notice: Undefined index: in
/usr/local/src/php-4.3.3RC4/ext/standard/tests/file/userstreams.php on line 208
314+
315+ Notice: Undefined index: in
/usr/local/src/php-4.3.3RC4/ext/standard/tests/file/userstreams.php on line 208
316+
317+ Notice: Undefined index: in
/usr/local/src/php-4.3.3RC4/ext/standard/tests/file/userstreams.php on line 208
318+
319+ Notice: Undefined index: in
/usr/local/src/php-4.3.3RC4/ext/standard/tests/file/userstreams.php on line 208
320+
321+ Notice: Undefined index: in
/usr/local/src/php-4.3.3RC4/ext/standard/tests/file/userstreams.php on line 208
322+
323+ Notice: Undefined index: in
/usr/local/src/php-4.3.3RC4/ext/standard/tests/file/userstreams.php on line 208
324+
325+ Notice: Undefined index: in
/usr/local/src/php-4.3.3RC4/ext/standard/tests/file/userstreams.php on line 208
326+
327+ Notice: Undefined index: in
/usr/local/src/php-4.3.3RC4/ext/standard/tests/file/userstreams.php on line 208
328+
329+ Notice: Undefined index: in
/usr/local/src/php-4.3.3RC4/ext/standard/tests/file/userstreams.php on line 208
330+
331+ Notice: Undefined index: in
/usr/local/src/php-4.3.3RC4/ext/standard/tests/file/userstreams.php on line 208
332+
333+ Notice: Undefined index: in
/usr/local/src/php-4.3.3RC4/ext/standard/tests/file/userstreams.php on line 208
334+
335+ Notice: Undefined index: in
/usr/local/src/php-4.3.3RC4/ext/standard/tests/file/userstreams.php on line 208
336+
337+ Notice: Undefined index: in
/usr/local/src/php-4.3.3RC4/ext/standard/tests/file/userstreams.php on line 208
338+
339+ Notice: Undefined index: in
/usr/local/src/php-4.3.3RC4/ext/standard/tests/file/userstreams.php on line 208
340+
341+ Notice: Undefined index: in
/usr/local/src/php-4.3.3RC4/ext/standard/tests/file/userstreams.php on line 208
342+
343+ Notice: Undefined index: in
/usr/local/src/php-4.3.3RC4/ext/standard/tests/file/userstreams.php on line 208
344+
345+ Notice: Undefined index: in
/usr/local/src/php-4.3.3RC4/ext/standard/tests/file/userstreams.php on line 208
346+
347+ Notice: Undefined index: in
/usr/local/src/php-4.3.3RC4/ext/standard/tests/file/userstreams.php on line 208
348+
349+ Notice: Undefined index: in
/usr/local/src/php-4.3.3RC4/ext/standard/tests/file/userstreams.php on line 208
350+
351+ Notice: Undefined index: in
/usr/local/src/php-4.3.3RC4/ext/standard/tests/file/userstreams.php on line 208
352+
353+ Notice: Undefined index: in
/usr/local/src/php-4.3.3RC4/ext/standard/tests/file/userstreams.php on line 208
354+
355+ Notice: Undefined index: in
/usr/local/src/php-4.3.3RC4/ext/standard/tests/file/userstreams.php on line 208
356+
357+ Notice: Undefined index: in
/usr/local/src/php-4.3.3RC4/ext/standard/tests/file/userstreams.php on line 208
358+
359+ Notice: Undefined index: in
/usr/local/src/php-4.3.3RC4/ext/standard/tests/file/userstreams.php on line 208
360+
361+ Notice: Undefined index: in
/usr/local/src/php-4.3.3RC4/ext/standard/tests/file/userstreams.php on line 208
362+
363+ Notice: Undefined index: in
/usr/local/src/php-4.3.3RC4/ext/standard/tests/file/userstreams.php on line 208
364+
365+ Notice: Undefined index: in
/usr/local/src/php-4.3.3RC4/ext/standard/tests/file/userstreams.php on line 208
366+
367+ Notice: Undefined index: in
/usr/local/src/php-4.3.3RC4/ext/standard/tests/file/userstreams.php on line 208
368+
369+ Notice: Undefined index: in
/usr/local/src/php-4.3.3RC4/ext/standard/tests/file/userstreams.php on line 208
370+
371+ Notice: Undefined index: in
/usr/local/src/php-4.3.3RC4/ext/standard/tests/file/userstreams.php on line 208
372+
373+ Notice: Undefined index: in
/usr/local/src/php-4.3.3RC4/ext/standard/tests/file/userstreams.php on line 208
374+
375+ Notice: Undefined index: in
/usr/local/src/php-4.3.3RC4/ext/standard/tests/file/userstreams.php on line 208
376+
377+ Notice: Undefined index: in
/usr/local/src/php-4.3.3RC4/ext/standard/tests/file/userstreams.php on line 208
378+
379+ Notice: Undefined index: in
/usr/local/src/php-4.3.3RC4/ext/standard/tests/file/userstreams.php on line 208
380+
381+ Notice: Undefined index: in
/usr/local/src/php-4.3.3RC4/ext/standard/tests/file/userstreams.php on line 208
382+
383+ Notice: Undefined index: in
/usr/local/src/php-4.3.3RC4/ext/standard/tests/file/userstreams.php on line 208
384+
385+ Notice: Undefined index: in
/usr/local/src/php-4.3.3RC4/ext/standard/tests/file/userstreams.php on line 208
386+
387+ Notice: Undefined index: in
/usr/local/src/php-4.3.3RC4/ext/standard/tests/file/userstreams.php on line 208
388+
389+ Notice: Undefined index: in
/usr/local/src/php-4.3.3RC4/ext/standard/tests/file/userstreams.php on line 208
390+
391+ Notice: Undefined index: in
/usr/local/src/php-4.3.3RC4/ext/standard/tests/file/userstreams.php on line 208
392+
393+ Notice: Undefined index: in
/usr/local/src/php-4.3.3RC4/ext/standard/tests/file/userstreams.php on line 208
394+
395+ Notice: Undefined index: in
/usr/local/src/php-4.3.3RC4/ext/standard/tests/file/userstreams.php on line 208
396+
397+ Notice: Undefined index: in
/usr/local/src/php-4.3.3RC4/ext/standard/tests/file/userstreams.php on line 208
398+
399+ Notice: Undefined index: in
/usr/local/src/php-4.3.3RC4/ext/standard/tests/file/userstreams.php on line 208
400+
401+ Notice: Undefined index: in
/usr/local/src/php-4.3.3RC4/ext/standard/tests/file/userstreams.php on line 208
402+
403+ Notice: Undefined index: in
/usr/local/src/php-4.3.3RC4/ext/standard/tests/file/userstreams.php on line 208
404+
405+ Notice: Undefined index: in
/usr/local/src/php-4.3.3RC4/ext/standard/tests/file/userstreams.php on line 208
406+
407+ Notice: Undefined index: in
/usr/local/src/php-4.3.3RC4/ext/standard/tests/file/userstreams.php on line 208
408+
409+ Notice: Undefined index: in
/usr/local/src/php-4.3.3RC4/ext/standard/tests/file/userstreams.php on line 208
410+
411+ Notice: Undefined index: in
/usr/local/src/php-4.3.3RC4/ext/standard/tests/file/userstreams.php on line 208
412+
413+ Notice: Undefined index: in
/usr/local/src/php-4.3.3RC4/ext/standard/tests/file/userstreams.php on line 208
414+
415+ Notice: Undefined index: in
/usr/local/src/php-4.3.3RC4/ext/standard/tests/file/userstreams.php on line 208
416+
417+ Notice: Undefined index: in
/usr/local/src/php-4.3.3RC4/ext/standard/tests/file/userstreams.php on line 208
418+
419+ Notice: Undefined index: in
/usr/local/src/php-4.3.3RC4/ext/standard/tests/file/userstreams.php on line 208
420+
421+ Notice: Undefined index: in
/usr/local/src/php-4.3.3RC4/ext/standard/tests/file/userstreams.php on line 208
422+
423+ Notice: Undefined index: in
/usr/local/src/php-4.3.3RC4/ext/standard/tests/file/userstreams.php on line 208
424+
425+ Notice: Undefined index: in
/usr/local/src/php-4.3.3RC4/ext/standard/tests/file/userstreams.php on line 208
426+
427+ Notice: Undefined index: in
/usr/local/src/php-4.3.3RC4/ext/standard/tests/file/userstreams.php on line 208
428+
429+ Notice: Undefined index: in
/usr/local/src/php-4.3.3RC4/ext/standard/tests/file/userstreams.php on line 208
430+
431+ Notice: Undefined index: in
/usr/local/src/php-4.3.3RC4/ext/standard/tests/file/userstreams.php on line 208
432+
433+ Notice: Undefined index: in
/usr/local/src/php-4.3.3RC4/ext/standard/tests/file/userstreams.php on line 208
434+
435+ Notice: Undefined index: in
/usr/local/src/php-4.3.3RC4/ext/standard/tests/file/userstreams.php on line 208
436+
437+ Notice: Undefined index: in
/usr/local/src/php-4.3.3RC4/ext/standard/tests/file/userstreams.php on line 208
438+
439+ Notice: Undefined index: in
/usr/local/src/php-4.3.3RC4/ext/standard/tests/file/userstreams.php on line 208
440+
441+ Notice: Undefined index: in
/usr/local/src/php-4.3.3RC4/ext/standard/tests/file/userstreams.php on line 208
442+
443+ Notice: Undefined index: in
/usr/local/src/php-4.3.3RC4/ext/standard/tests/file/userstreams.php on line 208
444+
445+ Notice: Undefined index: in
/usr/local/src/php-4.3.3RC4/ext/standard/tests/file/userstreams.php on line 208
446+
447+ Notice: Undefined index: in
/usr/local/src/php-4.3.3RC4/ext/standard/tests/file/userstreams.php on line 208
448+
449+ Notice: Undefined index: in
/usr/local/src/php-4.3.3RC4/ext/standard/tests/file/userstreams.php on line 208
450+
451+ Notice: Undefined index: in
/usr/local/src/php-4.3.3RC4/ext/standard/tests/file/userstreams.php on line 208
452+
453+ Notice: Undefined index: in
/usr/local/src/php-4.3.3RC4/ext/standard/tests/file/userstreams.php on line 208
454+
455+ Notice: Undefined index: in
/usr/local/src/php-4.3.3RC4/ext/standard/tests/file/userstreams.php on line 208
456+
457+ Notice: Undefined index: in
/usr/local/src/php-4.3.3RC4/ext/standard/tests/file/userstreams.php on line 208
458+
459+ Notice: Undefined index: in
/usr/local/src/php-4.3.3RC4/ext/standard/tests/file/userstreams.php on line 208
460+
461+ Notice: Undefined index: in
/usr/local/src/php-4.3.3RC4/ext/standard/tests/file/userstreams.php on line 208
462+
463+ Notice: Undefined index: in
/usr/local/src/php-4.3.3RC4/ext/standard/tests/file/userstreams.php on line 208
464+
465+ Notice: Undefined index: in
/usr/local/src/php-4.3.3RC4/ext/standard/tests/file/userstreams.php on line 208
466+
467+ Notice: Undefined index: in
/usr/local/src/php-4.3.3RC4/ext/standard/tests/file/userstreams.php on line 208
468+
469+ Notice: Undefined index: in
/usr/local/src/php-4.3.3RC4/ext/standard/tests/file/userstreams.php on line 208
470+
471+ Notice: Undefined index: in
/usr/local/src/php-4.3.3RC4/ext/standard/tests/file/userstreams.php on line 208
472+
473+ Notice: Undefined index: in
/usr/local/src/php-4.3.3RC4/ext/standard/tests/file/userstreams.php on line 208
474+
475+ Notice: Undefined index: in
/usr/local/src/php-4.3.3RC4/ext/standard/tests/file/userstreams.php on line 208
476+
477+ Notice: Undefined index: in
/usr/local/src/php-4.3.3RC4/ext/standard/tests/file/userstreams.php on line 208
478+
479+ Notice: Undefined index: in
/usr/local/src/php-4.3.3RC4/ext/standard/tests/file/userstreams.php on line 208
480+
481+ Notice: Undefined index: in
/usr/local/src/php-4.3.3RC4/ext/standard/tests/file/userstreams.php on line 208
482+
483+ Notice: Undefined index: in
/usr/local/src/php-4.3.3RC4/ext/standard/tests/file/userstreams.php on line 208
484+
485+ Notice: Undefined index: in
/usr/local/src/php-4.3.3RC4/ext/standard/tests/file/userstreams.php on line 208
486+
487+ Notice: Undefined index: in
/usr/local/src/php-4.3.3RC4/ext/standard/tests/file/userstreams.php on line 208
488+
489+ Notice: Undefined index: in
/usr/local/src/php-4.3.3RC4/ext/standard/tests/file/userstreams.php on line 208
490+
491+ Notice: Undefined index: in
/usr/local/src/php-4.3.3RC4/ext/standard/tests/file/userstreams.php on line 208
492+
493+ Notice: Undefined index: in
/usr/local/src/php-4.3.3RC4/ext/standard/tests/file/userstreams.php on line 208
494+
495+ Notice: Undefined index: in
/usr/local/src/php-4.3.3RC4/ext/standard/tests/file/userstreams.php on line 208
496+
497+ Notice: Undefined index: in
/usr/local/src/php-4.3.3RC4/ext/standard/tests/file/userstreams.php on line 208
498+
499+ Notice: Undefined index: in
/usr/local/src/php-4.3.3RC4/ext/standard/tests/file/userstreams.php on line 208
500+
501+ Notice: Undefined index: in
/usr/local/src/php-4.3.3RC4/ext/standard/tests/file/userstreams.php on line 208
502+
503+ Notice: Undefined index: in
/usr/local/src/php-4.3.3RC4/ext/standard/tests/file/userstreams.php on line 208
504+
505+ Notice: Undefined index: in
/usr/local/src/php-4.3.3RC4/ext/standard/tests/file/userstreams.php on line 208
506+
507+ Notice: Undefined index: in
/usr/local/src/php-4.3.3RC4/ext/standard/tests/file/userstreams.php on line 208
508+
509+ Notice: Undefined index: in
/usr/local/src/php-4.3.3RC4/ext/standard/tests/file/userstreams.php on line 208
510+
511+ Notice: Undefined index: in
/usr/local/src/php-4.3.3RC4/ext/standard/tests/file/userstreams.php on line 208
512+
513+ Notice: Undefined index: in
/usr/local/src/php-4.3.3RC4/ext/standard/tests/file/userstreams.php on line 208
514+
515+ Notice: Undefined index: in
/usr/local/src/php-4.3.3RC4/ext/standard/tests/file/userstreams.php on line 208
516+
517+ --[0] whence=SEEK_SET offset=0 line_length=1024 position_should_be=0 --
518+ REAL: pos=(0,0,0) ret=0 line[33]=`...naq gur ebnq orpbzrf zl oevqr
519+ '
520+ USER: pos=(0,0,0) ret=0 line[33]=`...naq gur ebnq orpbzrf zl oevqr
521+ '
522+
523+ --[1] whence=SEEK_CUR offset=8450 line_length=1024 position_should_be=8450 --
524+ REAL: pos=(0,8450,8450) ret=0 line[6]=`where
525+ '
526+ USER: pos=(0,8450,8450) ret=0 line[6]=`where
527+ '
528+
529+ --[2] whence=SEEK_CUR offset=-7904 line_length=1024 position_should_be=546 --
530+ REAL: pos=(8450,546,546) ret=0 line[17]=`er frirerq pyrna
531+ '
532+ USER: pos=(8450,546,546) ret=0 line[17]=`er frirerq pyrna
533+ '
534+
535+ --[3] whence=SEEK_CUR offset=12456 line_length=1024 position_should_be=13002 --
536+ REAL: pos=(546,13002,13002) ret=0 line[18]=`erever I May Roam
537+ '
538+ USER: pos=(546,13002,13002) ret=0 line[18]=`erever I May Roam
539+ '
540+
541+ --[4] whence=SEEK_SET offset=0 line_length=1024 position_should_be=0 --
542+ REAL: pos=(13002,0,0) ret=0 line[33]=`...naq gur ebnq orpbzrf zl oevqr
543+ '
544+ USER: pos=(13002,0,0) ret=0 line[33]=`...naq gur ebnq orpbzrf zl oevqr
545+ '
546+
547+ Notice: Undefined index: in
/usr/local/src/php-4.3.3RC4/ext/standard/tests/file/userstreams.php on line 255
548+
549+ --[5] whence= offset=429861302 line_length=1024 position_should_be=429861302 --
550+ REAL: pos=(0,429861302,429861302) ret=0 line[0]=`'
551+ USER: pos=(0,0,0) ret=0 line[33]=`...naq gur ebnq orpbzrf zl oevqr
552+ '
553+ ###################################### FAIL!
554+ array(7) {
555+ ["wrapper_data"]=>
556+ &object(mystream)(5) {
557+ ["path"]=>
558+ string(11) "test://DATA"
559+ ["mode"]=>
560+ string(2) "rb"
561+ ["options"]=>
562+ int(4)
563+ ["position"]=>
564+ int(0)
565+ ["varname"]=>
566+ string(4) "DATA"
567+ }
568+ ["wrapper_type"]=>
569+ string(10) "user-space"
570+ ["stream_type"]=>
571+ string(10) "user-space"
572+ ["unread_bytes"]=>
573+ int(0)
574+ ["timed_out"]=>
575+ bool(false)
576+ ["blocked"]=>
577+ bool(true)
578+ ["eof"]=>
579+ bool(false)
580+ }
581+ SEEK: FAIL
582+ FGETS: OK
583+ int(0)
584+ ...and the road becomes my bride
================================================================================
================================================================================
/usr/local/src/php-4.3.3RC4/ext/standard/tests/strings/004.phpt
================================================================================
---- EXPECTED OUTPUT
shuffle
1234: 3[0-9][0-9][0-9]: 0.0[3-4][0-9]
1243: 3[0-9][0-9][0-9]: 0.0[3-4][0-9]
1324: 3[0-9][0-9][0-9]: 0.0[3-4][0-9]
1342: 3[0-9][0-9][0-9]: 0.0[3-4][0-9]
1423: 3[0-9][0-9][0-9]: 0.0[3-4][0-9]
1432: 3[0-9][0-9][0-9]: 0.0[3-4][0-9]
2134: 3[0-9][0-9][0-9]: 0.0[3-4][0-9]
2143: 3[0-9][0-9][0-9]: 0.0[3-4][0-9]
2314: 3[0-9][0-9][0-9]: 0.0[3-4][0-9]
2341: 3[0-9][0-9][0-9]: 0.0[3-4][0-9]
2413: 3[0-9][0-9][0-9]: 0.0[3-4][0-9]
2431: 3[0-9][0-9][0-9]: 0.0[3-4][0-9]
3124: 3[0-9][0-9][0-9]: 0.0[3-4][0-9]
3142: 3[0-9][0-9][0-9]: 0.0[3-4][0-9]
3214: 3[0-9][0-9][0-9]: 0.0[3-4][0-9]
3241: 3[0-9][0-9][0-9]: 0.0[3-4][0-9]
3412: 3[0-9][0-9][0-9]: 0.0[3-4][0-9]
3421: 3[0-9][0-9][0-9]: 0.0[3-4][0-9]
4123: 3[0-9][0-9][0-9]: 0.0[3-4][0-9]
4132: 3[0-9][0-9][0-9]: 0.0[3-4][0-9]
4213: 3[0-9][0-9][0-9]: 0.0[3-4][0-9]
4231: 3[0-9][0-9][0-9]: 0.0[3-4][0-9]
4312: 3[0-9][0-9][0-9]: 0.0[3-4][0-9]
4321: 3[0-9][0-9][0-9]: 0.0[3-4][0-9]
str_shuffle
1234: 3[0-9][0-9][0-9]: 0.0[3-4][0-9]
1243: 3[0-9][0-9][0-9]: 0.0[3-4][0-9]
1324: 3[0-9][0-9][0-9]: 0.0[3-4][0-9]
1342: 3[0-9][0-9][0-9]: 0.0[3-4][0-9]
1423: 3[0-9][0-9][0-9]: 0.0[3-4][0-9]
1432: 3[0-9][0-9][0-9]: 0.0[3-4][0-9]
2134: 3[0-9][0-9][0-9]: 0.0[3-4][0-9]
2143: 3[0-9][0-9][0-9]: 0.0[3-4][0-9]
2314: 3[0-9][0-9][0-9]: 0.0[3-4][0-9]
2341: 3[0-9][0-9][0-9]: 0.0[3-4][0-9]
2413: 3[0-9][0-9][0-9]: 0.0[3-4][0-9]
2431: 3[0-9][0-9][0-9]: 0.0[3-4][0-9]
3124: 3[0-9][0-9][0-9]: 0.0[3-4][0-9]
3142: 3[0-9][0-9][0-9]: 0.0[3-4][0-9]
3214: 3[0-9][0-9][0-9]: 0.0[3-4][0-9]
3241: 3[0-9][0-9][0-9]: 0.0[3-4][0-9]
3412: 3[0-9][0-9][0-9]: 0.0[3-4][0-9]
3421: 3[0-9][0-9][0-9]: 0.0[3-4][0-9]
4123: 3[0-9][0-9][0-9]: 0.0[3-4][0-9]
4132: 3[0-9][0-9][0-9]: 0.0[3-4][0-9]
4213: 3[0-9][0-9][0-9]: 0.0[3-4][0-9]
4231: 3[0-9][0-9][0-9]: 0.0[3-4][0-9]
4312: 3[0-9][0-9][0-9]: 0.0[3-4][0-9]
4321: 3[0-9][0-9][0-9]: 0.0[3-4][0-9]
---- ACTUAL OUTPUT
---- FAILED
================================================================================
001- shuffle
001+
002- 1234: 3[0-9][0-9][0-9]: 0.0[3-4][0-9]
003- 1243: 3[0-9][0-9][0-9]: 0.0[3-4][0-9]
004- 1324: 3[0-9][0-9][0-9]: 0.0[3-4][0-9]
005- 1342: 3[0-9][0-9][0-9]: 0.0[3-4][0-9]
006- 1423: 3[0-9][0-9][0-9]: 0.0[3-4][0-9]
007- 1432: 3[0-9][0-9][0-9]: 0.0[3-4][0-9]
008- 2134: 3[0-9][0-9][0-9]: 0.0[3-4][0-9]
009- 2143: 3[0-9][0-9][0-9]: 0.0[3-4][0-9]
010- 2314: 3[0-9][0-9][0-9]: 0.0[3-4][0-9]
011- 2341: 3[0-9][0-9][0-9]: 0.0[3-4][0-9]
012- 2413: 3[0-9][0-9][0-9]: 0.0[3-4][0-9]
013- 2431: 3[0-9][0-9][0-9]: 0.0[3-4][0-9]
014- 3124: 3[0-9][0-9][0-9]: 0.0[3-4][0-9]
015- 3142: 3[0-9][0-9][0-9]: 0.0[3-4][0-9]
016- 3214: 3[0-9][0-9][0-9]: 0.0[3-4][0-9]
017- 3241: 3[0-9][0-9][0-9]: 0.0[3-4][0-9]
018- 3412: 3[0-9][0-9][0-9]: 0.0[3-4][0-9]
019- 3421: 3[0-9][0-9][0-9]: 0.0[3-4][0-9]
020- 4123: 3[0-9][0-9][0-9]: 0.0[3-4][0-9]
021- 4132: 3[0-9][0-9][0-9]: 0.0[3-4][0-9]
022- 4213: 3[0-9][0-9][0-9]: 0.0[3-4][0-9]
023- 4231: 3[0-9][0-9][0-9]: 0.0[3-4][0-9]
024- 4312: 3[0-9][0-9][0-9]: 0.0[3-4][0-9]
025- 4321: 3[0-9][0-9][0-9]: 0.0[3-4][0-9]
026- str_shuffle
027- 1234: 3[0-9][0-9][0-9]: 0.0[3-4][0-9]
028- 1243: 3[0-9][0-9][0-9]: 0.0[3-4][0-9]
029- 1324: 3[0-9][0-9][0-9]: 0.0[3-4][0-9]
030- 1342: 3[0-9][0-9][0-9]: 0.0[3-4][0-9]
031- 1423: 3[0-9][0-9][0-9]: 0.0[3-4][0-9]
032- 1432: 3[0-9][0-9][0-9]: 0.0[3-4][0-9]
033- 2134: 3[0-9][0-9][0-9]: 0.0[3-4][0-9]
034- 2143: 3[0-9][0-9][0-9]: 0.0[3-4][0-9]
035- 2314: 3[0-9][0-9][0-9]: 0.0[3-4][0-9]
036- 2341: 3[0-9][0-9][0-9]: 0.0[3-4][0-9]
037- 2413: 3[0-9][0-9][0-9]: 0.0[3-4][0-9]
038- 2431: 3[0-9][0-9][0-9]: 0.0[3-4][0-9]
039- 3124: 3[0-9][0-9][0-9]: 0.0[3-4][0-9]
040- 3142: 3[0-9][0-9][0-9]: 0.0[3-4][0-9]
041- 3214: 3[0-9][0-9][0-9]: 0.0[3-4][0-9]
042- 3241: 3[0-9][0-9][0-9]: 0.0[3-4][0-9]
043- 3412: 3[0-9][0-9][0-9]: 0.0[3-4][0-9]
044- 3421: 3[0-9][0-9][0-9]: 0.0[3-4][0-9]
045- 4123: 3[0-9][0-9][0-9]: 0.0[3-4][0-9]
046- 4132: 3[0-9][0-9][0-9]: 0.0[3-4][0-9]
047- 4213: 3[0-9][0-9][0-9]: 0.0[3-4][0-9]
048- 4231: 3[0-9][0-9][0-9]: 0.0[3-4][0-9]
049- 4312: 3[0-9][0-9][0-9]: 0.0[3-4][0-9]
050- 4321: 3[0-9][0-9][0-9]: 0.0[3-4][0-9]
================================================================================
================================================================================
/usr/local/src/php-4.3.3RC4/ext/standard/tests/strings/str_shuffle.phpt
================================================================================
---- EXPECTED OUTPUT
string(3) %s
string(3) "123"
---- ACTUAL OUTPUT
---- FAILED
================================================================================
001- string(3) %s
001+
002- string(3) "123"
================================================================================
================================================================================
BUILD ENVIRONMENT
================================================================================
OS:
SunOS - SunOS gaia 5.6 Generic_105181-23 sun4u
Automake:
automake (GNU automake) 1.7.6
Written by Tom Tromey <tromey@redhat.com>.
Copyright 2003 Free Software Foundation, Inc.
This is free software; see the source for copying conditions. There is NO
warranty; not even for MERCHANTABILITY or FITNESS FOR A PARTICULAR PURPOSE.
Autoconf:
autoconf (GNU Autoconf) 2.57
Written by David J. MacKenzie and Akim Demaille.
Copyright 2002 Free Software Foundation, Inc.
This is free software; see the source for copying conditions. There is NO
warranty; not even for MERCHANTABILITY or FITNESS FOR A PARTICULAR PURPOSE.
Libtool:
ltmain.sh (GNU libtool) 1.4.3 (1.922.2.110 2002/10/23 01:39:54)
Compiler:
Reading specs from /usr/local/lib/gcc-lib/sparc-sun-solaris2.6/2.95.2/specs
gcc version 2.95.2 19991024 (release)
Bison:
GNU Bison version 1.28
Libraries:
libpq.so.3 => /usr/local/pgsql/lib/libpq.so.3
libmysqlclient.so.10 => /usr/local/etc/mysql-3.23.54/lib/mysql/libmysqlclient.so.10
libresolv.so.2 => /usr/lib/libresolv.so.2
libm.so.1 => /usr/lib/libm.so.1
libdl.so.1 => /usr/lib/libdl.so.1
libnsl.so.1 => /usr/lib/libnsl.so.1
libsocket.so.1 => /usr/lib/libsocket.so.1
libc.so.1 => /usr/lib/libc.so.1
libmp.so.2 => /usr/lib/libmp.so.2
/usr/platform/SUNW,Ultra-5_10/lib/libc_psr.so.1
User's E-mail: s dot masugata at digicom dot dnp dot co dot jp
================================================================================
PHPINFO
================================================================================
phpinfo()
PHP Version => 4.3.3RC4
System => SunOS gaia 5.6 Generic_105181-23 sun4u
Build Date => Aug 20 2003 14:08:28
Configure Command => './configure'
'--with-apxs=/usr/local/Apache1.3.27_PHP4/bin/apxs' '--without-pear'
'--disable-cgi' '--enable-zend-multibyte' '--enable-mbstring=all'
'--enable-mbregex' '--with-mysql=/usr/local/mysql'
'--with-pgsql=/usr/local/pgsql' '--enable-versioning'
Server API => Command Line Interface
Virtual Directory Support => disabled
Configuration File (php.ini) Path => /usr/local/lib/php.ini
PHP API => 20020918
PHP Extension => 20020429
Zend Extension => 20021010
Debug Build => no
Thread Safety => disabled
Registered PHP Streams => php, http, ftp
This program makes use of the Zend Scripting Language Engine:
Zend Engine v1.3.0, Copyright (c) 1998-2003 Zend Technologies
_______________________________________________________________________
Configuration
PHP Core
Directive => Local Value => Master Value
allow_call_time_pass_reference => On => On
allow_url_fopen => On => On
always_populate_raw_post_data => Off => Off
arg_separator.input => & => &
arg_separator.output => & => &
asp_tags => Off => Off
auto_append_file => no value => no value
auto_prepend_file => no value => no value
browscap => no value => no value
default_charset => iso-8859-1 => iso-8859-1
default_mimetype => text/html => text/html
define_syslog_variables => Off => Off
disable_classes => no value => no value
disable_functions => no value => no value
display_errors => On => On
display_startup_errors => Off => Off
doc_root => no value => no value
docref_ext => no value => no value
docref_root => no value => no value
enable_dl => On => On
error_append_string => no value => no value
error_log => no value => no value
error_prepend_string => no value => no value
error_reporting => 2039 => 2039
expose_php => On => On
extension_dir => /usr/local/lib/php/extensions/no-debug-non-zts-20020429 =>
/usr/local/lib/php/extensions/no-debug-non-zts-20020429
file_uploads => On => On
gpc_order => GPC => GPC
highlight.bg => #FFFFFF => #FFFFFF
highlight.comment => #FF9900 => #FF9900
highlight.default => #0000CC => #0000CC
highlight.html => #000000 => #000000
highlight.keyword => #006600 => #006600
highlight.string => #CC0000 => #CC0000
html_errors => On => On
ignore_repeated_errors => Off => Off
ignore_repeated_source => Off => Off
ignore_user_abort => Off => Off
implicit_flush => Off => Off
include_path => .:/usr/local/lib/php:/WWW/PHP/phpsub/PHP4:/WWW/PHP:/WWW/php-scripts =>
.:/usr/local/lib/php:/WWW/PHP/phpsub/PHP4:/WWW/PHP:/WWW/php-scripts
log_errors => Off => Off
log_errors_max_len => 1024 => 1024
magic_quotes_gpc => On => On
magic_quotes_runtime => Off => Off
magic_quotes_sybase => Off => Off
max_execution_time => 30 => 30
max_input_time => -1 => -1
open_basedir => no value => no value
output_buffering => 1 => 1
output_handler => mb_output_handler => mb_output_handler
post_max_size => 8M => 8M
precision => 14 => 14
register_argc_argv => On => On
register_globals => Off => Off
report_memleaks => On => On
safe_mode => Off => Off
safe_mode_exec_dir => no value => no value
safe_mode_gid => Off => Off
safe_mode_include_dir => no value => no value
sendmail_from => me@localhost.com => me@localhost.com
sendmail_path => /usr/lib/sendmail -t -i => /usr/lib/sendmail -t -i
serialize_precision => 100 => 100
short_open_tag => On => On
SMTP => localhost => localhost
smtp_port => 25 => 25
sql.safe_mode => Off => Off
track_errors => Off => Off
unserialize_callback_func => no value => no value
upload_max_filesize => 2M => 2M
upload_tmp_dir => no value => no value
user_dir => no value => no value
variables_order => EGPCS => EGPCS
xmlrpc_error_number => 0 => 0
xmlrpc_errors => Off => Off
y2k_compliance => Off => Off
ctype
ctype functions => enabled
mbstring
Multibyte Support => enabled
Japanese support => enabled
Simplified chinese support => enabled
Traditional chinese support => enabled
Korean support => enabled
Russian support => enabled
HTTP input encoding translation => enabled
Multibyte (japanese) regex support => enabled
mbstring extension makes use of "streamable kanji code
filter and converter", which is distributed under the GNU Lesser General Public License version
2.1.
Directive => Local Value => Master Value
mbstring.detect_order => SJIS-win,SJIS,eucJP-win,EUC_JP,UTF-8,UTF-7,ISO-2022-JP,JIS,ASCII =>
SJIS-win,SJIS,eucJP-win,EUC_JP,UTF-8,UTF-7,ISO-2022-JP,JIS,ASCII
mbstring.encoding_translation => On => On
mbstring.func_overload => 1 => 1
mbstring.http_input => auto => auto
mbstring.http_output => SJIS => SJIS
mbstring.internal_encoding => EUC-JP => EUC-JP
mbstring.language => Japanese => Japanese
mbstring.script_encoding => SJIS => SJIS
mbstring.substitute_character => no value => no value
mysql
MySQL Support => enabled
Active Persistent Links => 0
Active Links => 0
Client API version => 3.23.54
MYSQL_MODULE_TYPE => external
MYSQL_SOCKET => /tmp/mysqld.32354.sock
MYSQL_INCLUDE => -I/usr/local/mysql/include/mysql
MYSQL_LIBS => -L/usr/local/mysql/lib/mysql -lmysqlclient
Directive => Local Value => Master Value
mysql.allow_persistent => On => On
mysql.connect_timeout => 60 => 60
mysql.default_host => no value => no value
mysql.default_password => no value => no value
mysql.default_port => no value => no value
mysql.default_socket => no value => no value
mysql.default_user => no value => no value
mysql.max_links => Unlimited => Unlimited
mysql.max_persistent => Unlimited => Unlimited
mysql.trace_mode => Off => Off
overload
User-Space Object Overloading Support => enabled
pcre
PCRE (Perl Compatible Regular Expressions) Support => enabled
PCRE Library Version => 4.3 21-May-2003
pgsql
PostgreSQL Support => enabled
PostgreSQL(libpq) Version => 7.3.3
Multibyte character support => enabled
SSL support => disabled
Active Persistent Links => 0
Active Links => 0
Directive => Local Value => Master Value
pgsql.allow_persistent => On => On
pgsql.auto_reset_persistent => Off => Off
pgsql.ignore_notice => Off => Off
pgsql.log_notice => Off => Off
pgsql.max_links => Unlimited => Unlimited
pgsql.max_persistent => Unlimited => Unlimited
posix
Revision => $Revision: 1.51.2.2 $
session
Session Support => enabled
Registered save handlers => files user
Directive => Local Value => Master Value
session.auto_start => Off => Off
session.bug_compat_42 => On => On
session.bug_compat_warn => On => On
session.cache_expire => 180 => 180
session.cache_limiter => nocache => nocache
session.cookie_domain => no value => no value
session.cookie_lifetime => 0 => 0
session.cookie_path => / => /
session.cookie_secure => Off => Off
session.entropy_file => no value => no value
session.entropy_length => 0 => 0
session.gc_divisor => 100 => 100
session.gc_maxlifetime => 1440 => 1440
session.gc_probability => 1 => 1
session.name => PHPSESSID => PHPSESSID
session.referer_check => no value => no value
session.save_handler => files => files
session.save_path => /tmp => /tmp
session.serialize_handler => php => php
session.use_cookies => On => On
session.use_only_cookies => Off => Off
session.use_trans_sid => On => On
standard
Regex Library => Bundled library enabled
Dynamic Library Support => enabled
Path to sendmail => /usr/lib/sendmail -t -i
Directive => Local Value => Master Value
assert.active => 1 => 1
assert.bail => 0 => 0
assert.callback => no value => no value
assert.quiet_eval => 0 => 0
assert.warning => 1 => 1
auto_detect_line_endings => 0 => 0
default_socket_timeout => 60 => 60
safe_mode_allowed_env_vars => PHP_ => PHP_
safe_mode_protected_env_vars => LD_LIBRARY_PATH => LD_LIBRARY_PATH
url_rewriter.tags => a=href,area=href,frame=src,input=src,form=fakeentry =>
a=href,area=href,frame=src,input=src,form=fakeentry
user_agent => no value => no value
tokenizer
Tokenizer Support => enabled
xml
XML Support => active
XML Namespace Support => active
EXPAT Version => 1.95.6
Additional Modules
Module Name
Environment
Variable => Value
CATALINA_BASE => /usr/local/tomcat4
CATALINA_HOME => /usr/local/tomcat4
CATALINA_TMPDIR => /usr/local/tomcat/temp
CC => gcc
CLASSPATH =>
.:/usr/local/tomcat/lib/servlet.jar:/usr/local/java/lib/mail/mail.jar:/usr/local/java/lib/mail/mailapi.jar:/usr/local/java/lib/mail/activation.jar:/usr/local/pgsql-7.3.3/share/java/postgresql.jar:/usr/local/mysql/share/java/mysql-connector-java-2.0.14-bin.jar
CONTENT_LENGTH =>
CONTENT_TYPE =>
DISPLAY => 10.44.52.14:0
EDITOR => vi
GROUP => cgi
HOME => /home/seiji
HOST => gaia
HOSTTYPE => sun4
HZ => 100
JAVA_HOME => /usr/local/java
JLESSCHARSET => japanese-euc
LANG => C
LC_TIME => C
LOGNAME => seiji
MACHTYPE => sparc
MAIL => /var/mail/seiji
MAKEFLAGS =>
MAKELEVEL => 1
MANPATH => /usr/share/man:/usr/local/pgsql-7.3.2/man
MFLAGS =>
OSTYPE => solaris
PATH => /usr/local/bin:/usr/ccs/bin:/bin:/usr/ucb:/usr/sbin
PATH_TRANSLATED =>
PGDATA => /WWW/DB/pgsql-7.3.3
PGLIB => /usr/local/pgsql-7.3.3/lib
PS1 => #
PWD => /usr/local/src/php-4.3.3RC4
QUERY_STRING =>
REDIRECT_STATUS =>
REMOTEHOST => 10.44.52.14
REQUEST_METHOD =>
SCRIPT_FILENAME =>
SHELL => /bin/sh
SHLVL => 1
TERM => vt100
TEST_PHP_EXECUTABLE => /usr/local/src/php-4.3.3RC4/sapi/cli/php
TEST_PHP_SRCDIR => /usr/local/src/php-4.3.3RC4
TOMCAT_HOME => /usr/local/tomcat4
TZ => Japan
USER => seiji
VENDOR => sun
WEBLINTRC => /opt/weblint/weblint-1.017/weblintrc
PHP Variables
Variable => Value
_SERVER["CATALINA_BASE"] => /usr/local/tomcat4
_SERVER["CATALINA_HOME"] => /usr/local/tomcat4
_SERVER["CATALINA_TMPDIR"] => /usr/local/tomcat/temp
_SERVER["CC"] => gcc
_SERVER["CLASSPATH"] =>
.:/usr/local/tomcat/lib/servlet.jar:/usr/local/java/lib/mail/mail.jar:/usr/local/java/lib/mail/mailapi.jar:/usr/local/java/lib/mail/activation.jar:/usr/local/pgsql-7.3.3/share/java/postgresql.jar:/usr/local/mysql/share/java/mysql-connector-java-2.0.14-bin.jar
_SERVER["CONTENT_LENGTH"] =>
_SERVER["CONTENT_TYPE"] =>
_SERVER["DISPLAY"] => 10.44.52.14:0
_SERVER["EDITOR"] => vi
_SERVER["GROUP"] => cgi
_SERVER["HOME"] => /home/seiji
_SERVER["HOST"] => gaia
_SERVER["HOSTTYPE"] => sun4
_SERVER["HZ"] => 100
_SERVER["JAVA_HOME"] => /usr/local/java
_SERVER["JLESSCHARSET"] => japanese-euc
_SERVER["LANG"] => C
_SERVER["LC_TIME"] => C
_SERVER["LOGNAME"] => seiji
_SERVER["MACHTYPE"] => sparc
_SERVER["MAIL"] => /var/mail/seiji
_SERVER["MAKEFLAGS"] =>
_SERVER["MAKELEVEL"] => 1
_SERVER["MANPATH"] => /usr/share/man:/usr/local/pgsql-7.3.2/man
_SERVER["MFLAGS"] =>
_SERVER["OSTYPE"] => solaris
_SERVER["PATH"] => /usr/local/bin:/usr/ccs/bin:/bin:/usr/ucb:/usr/sbin
_SERVER["PATH_TRANSLATED"] =>
_SERVER["PGDATA"] => /WWW/DB/pgsql-7.3.3
_SERVER["PGLIB"] => /usr/local/pgsql-7.3.3/lib
_SERVER["PS1"] => #
_SERVER["PWD"] => /usr/local/src/php-4.3.3RC4
_SERVER["QUERY_STRING"] =>
_SERVER["REDIRECT_STATUS"] =>
_SERVER["REMOTEHOST"] => 10.44.52.14
_SERVER["REQUEST_METHOD"] =>
_SERVER["SCRIPT_FILENAME"] =>
_SERVER["SHELL"] => /bin/sh
_SERVER["SHLVL"] => 1
_SERVER["TERM"] => vt100
_SERVER["TEST_PHP_EXECUTABLE"] => /usr/local/src/php-4.3.3RC4/sapi/cli/php
_SERVER["TEST_PHP_SRCDIR"] => /usr/local/src/php-4.3.3RC4
_SERVER["TOMCAT_HOME"] => /usr/local/tomcat4
_SERVER["TZ"] => Japan
_SERVER["USER"] => seiji
_SERVER["VENDOR"] => sun
_SERVER["WEBLINTRC"] => /opt/weblint/weblint-1.017/weblintrc
_SERVER["PHP_SELF"] =>
_SERVER["SCRIPT_NAME"] =>
_SERVER["DOCUMENT_ROOT"] =>
_SERVER["argv"] => Array
(
)
_SERVER["argc"] => 0
_ENV["CATALINA_BASE"] => /usr/local/tomcat4
_ENV["CATALINA_HOME"] => /usr/local/tomcat4
_ENV["CATALINA_TMPDIR"] => /usr/local/tomcat/temp
_ENV["CC"] => gcc
_ENV["CLASSPATH"] =>
.:/usr/local/tomcat/lib/servlet.jar:/usr/local/java/lib/mail/mail.jar:/usr/local/java/lib/mail/mailapi.jar:/usr/local/java/lib/mail/activation.jar:/usr/local/pgsql-7.3.3/share/java/postgresql.jar:/usr/local/mysql/share/java/mysql-connector-java-2.0.14-bin.jar
_ENV["CONTENT_LENGTH"] =>
_ENV["CONTENT_TYPE"] =>
_ENV["DISPLAY"] => 10.44.52.14:0
_ENV["EDITOR"] => vi
_ENV["GROUP"] => cgi
_ENV["HOME"] => /home/seiji
_ENV["HOST"] => gaia
_ENV["HOSTTYPE"] => sun4
_ENV["HZ"] => 100
_ENV["JAVA_HOME"] => /usr/local/java
_ENV["JLESSCHARSET"] => japanese-euc
_ENV["LANG"] => C
_ENV["LC_TIME"] => C
_ENV["LOGNAME"] => seiji
_ENV["MACHTYPE"] => sparc
_ENV["MAIL"] => /var/mail/seiji
_ENV["MAKEFLAGS"] =>
_ENV["MAKELEVEL"] => 1
_ENV["MANPATH"] => /usr/share/man:/usr/local/pgsql-7.3.2/man
_ENV["MFLAGS"] =>
_ENV["OSTYPE"] => solaris
_ENV["PATH"] => /usr/local/bin:/usr/ccs/bin:/bin:/usr/ucb:/usr/sbin
_ENV["PATH_TRANSLATED"] =>
_ENV["PGDATA"] => /WWW/DB/pgsql-7.3.3
_ENV["PGLIB"] => /usr/local/pgsql-7.3.3/lib
_ENV["PS1"] => #
_ENV["PWD"] => /usr/local/src/php-4.3.3RC4
_ENV["QUERY_STRING"] =>
_ENV["REDIRECT_STATUS"] =>
_ENV["REMOTEHOST"] => 10.44.52.14
_ENV["REQUEST_METHOD"] =>
_ENV["SCRIPT_FILENAME"] =>
_ENV["SHELL"] => /bin/sh
_ENV["SHLVL"] => 1
_ENV["TERM"] => vt100
_ENV["TEST_PHP_EXECUTABLE"] => /usr/local/src/php-4.3.3RC4/sapi/cli/php
_ENV["TEST_PHP_SRCDIR"] => /usr/local/src/php-4.3.3RC4
_ENV["TOMCAT_HOME"] => /usr/local/tomcat4
_ENV["TZ"] => Japan
_ENV["USER"] => seiji
_ENV["VENDOR"] => sun
_ENV["WEBLINTRC"] => /opt/weblint/weblint-1.017/weblintrc
PHP License
This program is free software; you can redistribute it and/or modify
it under the terms of the PHP License as published by the PHP Group
and included in the distribution in the file: LICENSE
This program is distributed in the hope that it will be useful,
but WITHOUT ANY WARRANTY; without even the implied warranty of
MERCHANTABILITY or FITNESS FOR A PARTICULAR PURPOSE.
If you did not receive a copy of the PHP license, or have any
questions about PHP licensing, please contact license@php.net.