php_test_results
| From: | Efrain Soto R. Cta. Especial | Date: | Wed, 26 Nov 2003 21:23:55 +0000 |
| Subject: | php_test_results | ||
| Groups: | php.qa | ||
| Request: | Send a blank email to php-qa+get-15804@lists.php.net to get a copy of this message | ||
Glacier
Atentamente
Efraín Soto R.
Seguridad Informática
Dirección de Tecnología de Información
Grupo Pujol-Martí
La información y archivos contenidos en este mensaje son confidenciales y
para utilización exclusiva de los destinatarios consignados. Si Usted no
reviste ese carácter, no se encuentra autorizado para divulgar, copiar,
distribuir o retener todo o parte de la información y archivos, y deberá
notificarlo de inmediato al remitente y eliminarlo de su sistema. Muchas
gracias.
===================================================================== FAILED TEST SUMMARY --------------------------------------------------------------------- Bug #25547 (error_handler and array index with function call) [tests/lang/bug25547.phpt] ctype on integers [ext/ctype/tests/001.phpt] Bug #25665 (var_dump () hangs on Nan and INF) [ext/standard/tests/math/bug25665.phpt] mktime() [ext/standard/tests/time/mktime.phpt] ===================================================================== ===================================================================== TEST RESULT SUMMARY --------------------------------------------------------------------- Exts skipped : 75 Exts tested : 12 --------------------------------------------------------------------- Number of tests : 535 Tests skipped : 243 (45.4%) Tests warned : 0 ( 0.0%) Tests failed : 4 ( 0.7%) Tests passed : 288 (53.8%) --------------------------------------------------------------------- Time taken : 31 seconds ===================================================================== ================================================================================ /root/instalar/tmp/php-4.3.4/tests/lang/bug25547.phpt ================================================================================ ---- EXPECTED OUTPUT handler(Undefined index: foo) Array ( [foo] => 1 ) Done ---- ACTUAL OUTPUT handler(Undefined index: foo) Array ( [ 0] => 1 ) Done ---- FAILED ================================================================================ 004- [foo] => 1 004+ [ 0] => 1 ================================================================================ ================================================================================ /root/instalar/tmp/php-4.3.4/ext/ctype/tests/001.phpt ================================================================================ ---- EXPECTED OUTPUT ctype_lower 26 ctype_upper 26 ctype_alpha 52 ctype_digit 10 ctype_alnum 62 ctype_cntrl 33 ctype_graph 94 ctype_print 95 ctype_punct 32 ctype_space 6 ctype_xdigit 22 ---- ACTUAL OUTPUT ctype_lower 26 ctype_upper 26 ctype_alpha 52 ctype_digit 10 ctype_alnum 62 ctype_cntrl 65 ctype_graph 189 ctype_print 191 ctype_punct 127 ctype_space 12 ctype_xdigit 22 ---- FAILED ================================================================================ 006- ctype_cntrl 33 006+ ctype_cntrl 65 007- ctype_graph 94 007+ ctype_graph 189 008- ctype_print 95 008+ ctype_print 191 009- ctype_punct 32 009+ ctype_punct 127 010- ctype_space 6 010+ ctype_space 12 ================================================================================ ================================================================================ /root/instalar/tmp/php-4.3.4/ext/standard/tests/math/bug25665.phpt ================================================================================ ---- EXPECTED OUTPUT float(NAN) float(-INF) ---- ACTUAL OUTPUT float(0) float(-INF) ---- FAILED ================================================================================ 001- float(NAN) 001+ float(0) ================================================================================ ================================================================================ /root/instalar/tmp/php-4.3.4/ext/standard/tests/time/mktime.phpt ================================================================================ ---- EXPECTED OUTPUT int(1009843200) int(1009843200) int(1009843200) int(1009843200) int(1025481600) int(1025481600) int(1025481600) int(1025481600) int(1009839600) int(1009839600) int(1009839600) int(1009836000) int(1025474400) int(1025474400) int(1025478000) int(1025474400) ---- ACTUAL OUTPUT int(1009843200) int(1009843200) int(1009843200) int(-3662) int(1025481600) int(1025481600) int(1025481600) int(-3662) int(1009839600) int(1009839600) int(1009839600) int(1009836000) int(1025474400) int(1025474400) int(1025478000) int(1025474400) ---- FAILED ================================================================================ 004- int(1009843200) 004+ int(-3662) 008- int(1025481600) 008+ int(-3662) ================================================================================ ================================================================================ BUILD ENVIRONMENT ================================================================================ OS: OpenBSD - OpenBSD sdsob001.red.corp.gpujol.com 3.4 GENERIC#18 i386 Automake: Autoconf: Libtool: ltmain.sh (GNU libtool) 1.4.3 (1.922.2.110 2002/10/23 01:39:54) Compiler: Reading specs from /usr/lib/gcc-lib/i386-unknown-openbsd3.4/2.95.3/specs gcc version 2.95.3 20010125 (prerelease, propolice) Bison: Libraries: /root/instalar/tmp/php-4.3.4/sapi/cli/php: Start End Type Ref Name 00000000 00000000 exe 1 /root/instalar/tmp/php-4.3.4/sapi/cli/php 053d1000 253da000 rlib 1 /usr/local/mysql/lib/mysql/libmysqlclient.so.12.0 0f89c000 2f8a3000 rlib 1 /usr/local/lib/libpng.so.3.1 06d89000 26d90000 rlib 2 /usr/lib/libm.so.1.0 0f14a000 2f183000 rlib 1 /usr/lib/libc.so.30.1 0db2d000 2db33000 rlib 2 /usr/lib/libz.so.2.0 06bfc000 06bfc000 rtld 1 /usr/libexec/ld.so User's E-mail: esoto at costarricense dot cr ================================================================================ PHPINFO ================================================================================ phpinfo() PHP Version => 4.3.4 System => OpenBSD sdsob001.red.corp.gpujol.com 3.4 GENERIC#18 i386 Build Date => Nov 26 2003 15:12:01 Configure Command => './configure' '--prefix=/www/php' '--with-apxs2=/www/bin/apxs' '--with-config-file-path=/www/php' '--enable-sockets' '--with-mysql=/usr/local/mysql' '--with-zlib-dir=/usr/local' '--with-gd' Server API => Command Line Interface Virtual Directory Support => disabled Configuration File (php.ini) Path => /www/php PHP API => 20020918 PHP Extension => 20020429 Zend Extension => 20021010 Debug Build => no Thread Safety => disabled Registered PHP Streams => php, http, ftp, compress.zlib This program makes use of the Zend Scripting Language Engine: Zend Engine v1.3.0, Copyright (c) 1998-2003 Zend Technologies _______________________________________________________________________ Configuration PHP Core Directive => Local Value => Master Value allow_call_time_pass_reference => On => On allow_url_fopen => On => On always_populate_raw_post_data => Off => Off arg_separator.input => & => & arg_separator.output => & => & asp_tags => Off => Off auto_append_file => no value => no value auto_prepend_file => no value => no value browscap => no value => no value default_charset => no value => no value default_mimetype => text/html => text/html define_syslog_variables => Off => Off disable_classes => no value => no value disable_functions => no value => no value display_errors => On => On display_startup_errors => Off => Off doc_root => no value => no value docref_ext => no value => no value docref_root => no value => no value enable_dl => On => On error_append_string => no value => no value error_log => no value => no value error_prepend_string => no value => no value error_reporting => no value => no value expose_php => On => On extension_dir => /www/php/lib/php/extensions/no-debug-non-zts-20020429 => /www/php/lib/php/extensions/no-debug-non-zts-20020429 file_uploads => On => On gpc_order => GPC => GPC highlight.bg => #FFFFFF => #FFFFFF highlight.comment => #FF8000 => #FF8000 highlight.default => #0000BB => #0000BB highlight.html => #000000 => #000000 highlight.keyword => #007700 => #007700 highlight.string => #DD0000 => #DD0000 html_errors => On => On ignore_repeated_errors => Off => Off ignore_repeated_source => Off => Off ignore_user_abort => Off => Off implicit_flush => Off => Off include_path => .:/www/php/lib/php => .:/www/php/lib/php log_errors => Off => Off log_errors_max_len => 1024 => 1024 magic_quotes_gpc => On => On magic_quotes_runtime => Off => Off magic_quotes_sybase => Off => Off max_execution_time => 30 => 30 max_input_time => -1 => -1 open_basedir => no value => no value output_buffering => 0 => 0 output_handler => no value => no value post_max_size => 8M => 8M precision => 14 => 14 register_argc_argv => On => On register_globals => Off => Off report_memleaks => On => On safe_mode => Off => Off safe_mode_exec_dir => /usr/local/php/bin => /usr/local/php/bin safe_mode_gid => Off => Off safe_mode_include_dir => no value => no value sendmail_from => no value => no value sendmail_path => /usr/sbin/sendmail -t -i => /usr/sbin/sendmail -t -i serialize_precision => 100 => 100 short_open_tag => On => On SMTP => localhost => localhost smtp_port => 25 => 25 sql.safe_mode => Off => Off track_errors => Off => Off unserialize_callback_func => no value => no value upload_max_filesize => 2M => 2M upload_tmp_dir => no value => no value user_dir => no value => no value variables_order => no value => no value xmlrpc_error_number => 0 => 0 xmlrpc_errors => Off => Off y2k_compliance => On => On ctype ctype functions => enabled gd GD Support => enabled GD Version => bundled (2.0.15 compatible) GIF Read Support => enabled PNG Support => enabled WBMP Support => enabled XBM Support => enabled mysql MySQL Support => enabled Active Persistent Links => 0 Active Links => 0 Client API version => 4.0.16 MYSQL_MODULE_TYPE => external MYSQL_SOCKET => /tmp/mysql.sock MYSQL_INCLUDE => -I/usr/local/mysql/include/mysql MYSQL_LIBS => -L/usr/local/mysql/lib/mysql -lmysqlclient Directive => Local Value => Master Value mysql.allow_persistent => On => On mysql.connect_timeout => 60 => 60 mysql.default_host => no value => no value mysql.default_password => no value => no value mysql.default_port => no value => no value mysql.default_socket => no value => no value mysql.default_user => no value => no value mysql.max_links => Unlimited => Unlimited mysql.max_persistent => Unlimited => Unlimited mysql.trace_mode => Off => Off overload User-Space Object Overloading Support => enabled pcre PCRE (Perl Compatible Regular Expressions) Support => enabled PCRE Library Version => 4.3 21-May-2003 posix Revision => $Revision: 1.51.2.2 $ session Session Support => enabled Registered save handlers => files user Directive => Local Value => Master Value session.auto_start => Off => Off session.bug_compat_42 => On => On session.bug_compat_warn => On => On session.cache_expire => 180 => 180 session.cache_limiter => nocache => nocache session.cookie_domain => no value => no value session.cookie_lifetime => 0 => 0 session.cookie_path => / => / session.cookie_secure => Off => Off session.entropy_file => no value => no value session.entropy_length => 0 => 0 session.gc_divisor => 100 => 100 session.gc_maxlifetime => 1440 => 1440 session.gc_probability => 1 => 1 session.name => PHPSESSID => PHPSESSID session.referer_check => no value => no value session.save_handler => files => files session.save_path => /tmp => /tmp session.serialize_handler => php => php session.use_cookies => On => On session.use_only_cookies => Off => Off session.use_trans_sid => Off => Off sockets Sockets Support => enabled standard Regex Library => Bundled library enabled Dynamic Library Support => enabled Path to sendmail => /usr/sbin/sendmail -t -i Directive => Local Value => Master Value assert.active => 1 => 1 assert.bail => 0 => 0 assert.callback => no value => no value assert.quiet_eval => 0 => 0 assert.warning => 1 => 1 auto_detect_line_endings => 0 => 0 default_socket_timeout => 60 => 60 safe_mode_allowed_env_vars => PHP_ => PHP_ safe_mode_protected_env_vars => LD_LIBRARY_PATH => LD_LIBRARY_PATH url_rewriter.tags => a=href,area=href,frame=src,form=,fieldset= => a=href,area=href,frame=src,form=,fieldset= user_agent => no value => no value tokenizer Tokenizer Support => enabled xml XML Support => active XML Namespace Support => active EXPAT Version => 1.95.6 zlib ZLib Support => enabled Compiled Version => 1.2.1 Linked Version => 1.2.1 Directive => Local Value => Master Value zlib.output_compression => Off => Off zlib.output_compression_level => -1 => -1 zlib.output_handler => no value => no value Additional Modules Module Name Environment Variable => Value SSH_CONNECTION => 10.0.22.6 1342 10.0.22.126 22 PS1 => # PATH => /sbin:/usr/sbin:/bin:/usr/bin:/usr/local/mysql/bin SHELL => /usr/local/bin/bash MAKEFLAGS => USER => root MAIL => /var/mail/root HOME => /root PWD => /root/instalar/tmp/php-4.3.4 OLDPWD => /root/instalar/tmp SSH_CLIENT => 10.0.22.6 1342 22 CC => gcc QUERY_STRING => TERM => xterm _ => /usr/bin/make CONTENT_TYPE => TEST_PHP_EXECUTABLE => /root/instalar/tmp/php-4.3.4/sapi/cli/php CONTENT_LENGTH => LOGNAME => root SHLVL => 1 REDIRECT_STATUS => REQUEST_METHOD => TERMCAP => xterm:am:bs:km:mi:ms:xn:co#80:it#8:li#24:AL=\E[%dL:DC=\E[%dP:DL=\E[%dM:DO=\E[%dB:LE=\E[%dD:RI=\E[%dC:UP=\E[%dA:ae=^O:al=\E[L:as=^N:bl=^G:cd=\E[J:ce=\E[K:cl=\E[H\E[2J:cm=\E[%i%d;%dH:cr=^M:cs=\E[%i%d;%dr:ct=\E[3g:dc=\E[P:dl=\E[M:do=^J:ei=\E[4l:ho=\E[H:im=\E[4h:is=\E7\E[r\E[m\E[?7h\E[?1;3;4;6l\E[4l\E8\E>:k1=\E[11~:k2=\E[12~:k3=\E[13~:k4=\E[14~:k5=\E[15~:k6=\E[17~:k7=\E[18~:k8=\E[19~:k9=\E[20~:kD=\E[3~:kI=\E[2~:kN=\E[6~:kP=\E[5~:kb=\177:kd=\EOB:ke=\E[?1l\E>:kh=\EOH:kl=\EOD:kr=\EOC:ks=\E[?1h\E=:ku=\EOA:le=^H:md=\E[1m:me=\E[m:mr=\E[7m:nd=\E[C:rc=\E8:rs=\E7\E[r\E8\E[m\E[?7h\E[?1;3;4;6l\E[4l\E>:sc=\E7:se=\E[m:sf=^J:so=\E[7m:sr=\EM:st=\EH:ta=^I:te=\E[2J\E[?47l\E8:ti=\E7\E[?47h:ue=\E[m:up=\E[A:us=\E[4m: TEST_PHP_SRCDIR => /root/instalar/tmp/php-4.3.4 SSH_TTY => /dev/ttyp0 PATH_TRANSLATED => SCRIPT_FILENAME => PHP Variables Variable => Value _SERVER["SSH_CONNECTION"] => 10.0.22.6 1342 10.0.22.126 22 _SERVER["PS1"] => # _SERVER["PATH"] => /sbin:/usr/sbin:/bin:/usr/bin:/usr/local/mysql/bin _SERVER["SHELL"] => /usr/local/bin/bash _SERVER["MAKEFLAGS"] => _SERVER["USER"] => root _SERVER["MAIL"] => /var/mail/root _SERVER["HOME"] => /root _SERVER["PWD"] => /root/instalar/tmp/php-4.3.4 _SERVER["OLDPWD"] => /root/instalar/tmp _SERVER["SSH_CLIENT"] => 10.0.22.6 1342 22 _SERVER["CC"] => gcc _SERVER["QUERY_STRING"] => _SERVER["TERM"] => xterm _SERVER["_"] => /usr/bin/make _SERVER["CONTENT_TYPE"] => _SERVER["TEST_PHP_EXECUTABLE"] => /root/instalar/tmp/php-4.3.4/sapi/cli/php _SERVER["CONTENT_LENGTH"] => _SERVER["LOGNAME"] => root _SERVER["SHLVL"] => 1 _SERVER["REDIRECT_STATUS"] => _SERVER["REQUEST_METHOD"] => _SERVER["TERMCAP"] => xterm:am:bs:km:mi:ms:xn:co#80:it#8:li#24:AL=\\E[%dL:DC=\\E[%dP:DL=\\E[%dM:DO=\\E[%dB:LE=\\E[%dD:RI=\\E[%dC:UP=\\E[%dA:ae=^O:al=\\E[L:as=^N:bl=^G:cd=\\E[J:ce=\\E[K:cl=\\E[H\\E[2J:cm=\\E[%i%d;%dH:cr=^M:cs=\\E[%i%d;%dr:ct=\\E[3g:dc=\\E[P:dl=\\E[M:do=^J:ei=\\E[4l:ho=\\E[H:im=\\E[4h:is=\\E7\\E[r\\E[m\\E[?7h\\E[?1;3;4;6l\\E[4l\\E8\\E>:k1=\\E[11~:k2=\\E[12~:k3=\\E[13~:k4=\\E[14~:k5=\\E[15~:k6=\\E[17~:k7=\\E[18~:k8=\\E[19~:k9=\\E[20~:kD=\\E[3~:kI=\\E[2~:kN=\\E[6~:kP=\\E[5~:kb=\\177:kd=\\EOB:ke=\\E[?1l\\E>:kh=\\EOH:kl=\\EOD:kr=\\EOC:ks=\\E[?1h\\E=:ku=\\EOA:le=^H:md=\\E[1m:me=\\E[m:mr=\\E[7m:nd=\\E[C:rc=\\E8:rs=\\E7\\E[r\\E8\\E[m\\E[?7h\\E[?1;3;4;6l\\E[4l\\E>:sc=\\E7:se=\\E[m:sf=^J:so=\\E[7m:sr=\\EM:st=\\EH:ta=^I:te=\\E[2J\\E[?47l\\E8:ti=\\E7\\E[?47h:ue=\\E[m:up=\\E[A:us=\\E[4m: _SERVER["TEST_PHP_SRCDIR"] => /root/instalar/tmp/php-4.3.4 _SERVER["SSH_TTY"] => /dev/ttyp0 _SERVER["PATH_TRANSLATED"] => _SERVER["SCRIPT_FILENAME"] => _SERVER["PHP_SELF"] => _SERVER["SCRIPT_NAME"] => _SERVER["DOCUMENT_ROOT"] => _SERVER["argv"] => Array ( ) _SERVER["argc"] => 0 _ENV["SSH_CONNECTION"] => 10.0.22.6 1342 10.0.22.126 22 _ENV["PS1"] => # _ENV["PATH"] => /sbin:/usr/sbin:/bin:/usr/bin:/usr/local/mysql/bin _ENV["SHELL"] => /usr/local/bin/bash _ENV["MAKEFLAGS"] => _ENV["USER"] => root _ENV["MAIL"] => /var/mail/root _ENV["HOME"] => /root _ENV["PWD"] => /root/instalar/tmp/php-4.3.4 _ENV["OLDPWD"] => /root/instalar/tmp _ENV["SSH_CLIENT"] => 10.0.22.6 1342 22 _ENV["CC"] => gcc _ENV["QUERY_STRING"] => _ENV["TERM"] => xterm _ENV["_"] => /usr/bin/make _ENV["CONTENT_TYPE"] => _ENV["TEST_PHP_EXECUTABLE"] => /root/instalar/tmp/php-4.3.4/sapi/cli/php _ENV["CONTENT_LENGTH"] => _ENV["LOGNAME"] => root _ENV["SHLVL"] => 1 _ENV["REDIRECT_STATUS"] => _ENV["REQUEST_METHOD"] => _ENV["TERMCAP"] => xterm:am:bs:km:mi:ms:xn:co#80:it#8:li#24:AL=\\E[%dL:DC=\\E[%dP:DL=\\E[%dM:DO=\\E[%dB:LE=\\E[%dD:RI=\\E[%dC:UP=\\E[%dA:ae=^O:al=\\E[L:as=^N:bl=^G:cd=\\E[J:ce=\\E[K:cl=\\E[H\\E[2J:cm=\\E[%i%d;%dH:cr=^M:cs=\\E[%i%d;%dr:ct=\\E[3g:dc=\\E[P:dl=\\E[M:do=^J:ei=\\E[4l:ho=\\E[H:im=\\E[4h:is=\\E7\\E[r\\E[m\\E[?7h\\E[?1;3;4;6l\\E[4l\\E8\\E>:k1=\\E[11~:k2=\\E[12~:k3=\\E[13~:k4=\\E[14~:k5=\\E[15~:k6=\\E[17~:k7=\\E[18~:k8=\\E[19~:k9=\\E[20~:kD=\\E[3~:kI=\\E[2~:kN=\\E[6~:kP=\\E[5~:kb=\\177:kd=\\EOB:ke=\\E[?1l\\E>:kh=\\EOH:kl=\\EOD:kr=\\EOC:ks=\\E[?1h\\E=:ku=\\EOA:le=^H:md=\\E[1m:me=\\E[m:mr=\\E[7m:nd=\\E[C:rc=\\E8:rs=\\E7\\E[r\\E8\\E[m\\E[?7h\\E[?1;3;4;6l\\E[4l\\E>:sc=\\E7:se=\\E[m:sf=^J:so=\\E[7m:sr=\\EM:st=\\EH:ta=^I:te=\\E[2J\\E[?47l\\E8:ti=\\E7\\E[?47h:ue=\\E[m:up=\\E[A:us=\\E[4m: _ENV["TEST_PHP_SRCDIR"] => /root/instalar/tmp/php-4.3.4 _ENV["SSH_TTY"] => /dev/ttyp0 _ENV["PATH_TRANSLATED"] => _ENV["SCRIPT_FILENAME"] => PHP License This program is free software; you can redistribute it and/or modify it under the terms of the PHP License as published by the PHP Group and included in the distribution in the file: LICENSE This program is distributed in the hope that it will be useful, but WITHOUT ANY WARRANTY; without even the implied warranty of MERCHANTABILITY or FITNESS FOR A PARTICULAR PURPOSE. If you did not receive a copy of the PHP license, or have any questions about PHP licensing, please contact license@php.net.
===================================================================== FAILED TEST SUMMARY --------------------------------------------------------------------- Bug #25547 (error_handler and array index with function call) [tests/lang/bug25547.phpt] ctype on integers [ext/ctype/tests/001.phpt] Bug #25665 (var_dump () hangs on Nan and INF) [ext/standard/tests/math/bug25665.phpt] mktime() [ext/standard/tests/time/mktime.phpt] ===================================================================== ===================================================================== TEST RESULT SUMMARY --------------------------------------------------------------------- Exts skipped : 75 Exts tested : 12 --------------------------------------------------------------------- Number of tests : 535 Tests skipped : 243 (45.4%) Tests warned : 0 ( 0.0%) Tests failed : 4 ( 0.7%) Tests passed : 288 (53.8%) --------------------------------------------------------------------- Time taken : 31 seconds ===================================================================== ================================================================================ /root/instalar/tmp/php-4.3.4/tests/lang/bug25547.phpt ================================================================================ ---- EXPECTED OUTPUT handler(Undefined index: foo) Array ( [foo] => 1 ) Done ---- ACTUAL OUTPUT handler(Undefined index: foo) Array ( [ 0] => 1 ) Done ---- FAILED ================================================================================ 004- [foo] => 1 004+ [ 0] => 1 ================================================================================ ================================================================================ /root/instalar/tmp/php-4.3.4/ext/ctype/tests/001.phpt ================================================================================ ---- EXPECTED OUTPUT ctype_lower 26 ctype_upper 26 ctype_alpha 52 ctype_digit 10 ctype_alnum 62 ctype_cntrl 33 ctype_graph 94 ctype_print 95 ctype_punct 32 ctype_space 6 ctype_xdigit 22 ---- ACTUAL OUTPUT ctype_lower 26 ctype_upper 26 ctype_alpha 52 ctype_digit 10 ctype_alnum 62 ctype_cntrl 65 ctype_graph 189 ctype_print 191 ctype_punct 127 ctype_space 12 ctype_xdigit 22 ---- FAILED ================================================================================ 006- ctype_cntrl 33 006+ ctype_cntrl 65 007- ctype_graph 94 007+ ctype_graph 189 008- ctype_print 95 008+ ctype_print 191 009- ctype_punct 32 009+ ctype_punct 127 010- ctype_space 6 010+ ctype_space 12 ================================================================================ ================================================================================ /root/instalar/tmp/php-4.3.4/ext/standard/tests/math/bug25665.phpt ================================================================================ ---- EXPECTED OUTPUT float(NAN) float(-INF) ---- ACTUAL OUTPUT float(0) float(-INF) ---- FAILED ================================================================================ 001- float(NAN) 001+ float(0) ================================================================================ ================================================================================ /root/instalar/tmp/php-4.3.4/ext/standard/tests/time/mktime.phpt ================================================================================ ---- EXPECTED OUTPUT int(1009843200) int(1009843200) int(1009843200) int(1009843200) int(1025481600) int(1025481600) int(1025481600) int(1025481600) int(1009839600) int(1009839600) int(1009839600) int(1009836000) int(1025474400) int(1025474400) int(1025478000) int(1025474400) ---- ACTUAL OUTPUT int(1009843200) int(1009843200) int(1009843200) int(-3662) int(1025481600) int(1025481600) int(1025481600) int(-3662) int(1009839600) int(1009839600) int(1009839600) int(1009836000) int(1025474400) int(1025474400) int(1025478000) int(1025474400) ---- FAILED ================================================================================ 004- int(1009843200) 004+ int(-3662) 008- int(1025481600) 008+ int(-3662) ================================================================================ ================================================================================ BUILD ENVIRONMENT ================================================================================ OS: OpenBSD - OpenBSD sdsob001.red.corp.gpujol.com 3.4 GENERIC#18 i386 Automake: Autoconf: Libtool: ltmain.sh (GNU libtool) 1.4.3 (1.922.2.110 2002/10/23 01:39:54) Compiler: Reading specs from /usr/lib/gcc-lib/i386-unknown-openbsd3.4/2.95.3/specs gcc version 2.95.3 20010125 (prerelease, propolice) Bison: Libraries: /root/instalar/tmp/php-4.3.4/sapi/cli/php: Start End Type Ref Name 00000000 00000000 exe 1 /root/instalar/tmp/php-4.3.4/sapi/cli/php 053d1000 253da000 rlib 1 /usr/local/mysql/lib/mysql/libmysqlclient.so.12.0 0f89c000 2f8a3000 rlib 1 /usr/local/lib/libpng.so.3.1 06d89000 26d90000 rlib 2 /usr/lib/libm.so.1.0 0f14a000 2f183000 rlib 1 /usr/lib/libc.so.30.1 0db2d000 2db33000 rlib 2 /usr/lib/libz.so.2.0 06bfc000 06bfc000 rtld 1 /usr/libexec/ld.so User's E-mail: esoto at costarricense dot cr ================================================================================ PHPINFO ================================================================================ phpinfo() PHP Version => 4.3.4 System => OpenBSD sdsob001.red.corp.gpujol.com 3.4 GENERIC#18 i386 Build Date => Nov 26 2003 15:12:01 Configure Command => './configure' '--prefix=/www/php' '--with-apxs2=/www/bin/apxs' '--with-config-file-path=/www/php' '--enable-sockets' '--with-mysql=/usr/local/mysql' '--with-zlib-dir=/usr/local' '--with-gd' Server API => Command Line Interface Virtual Directory Support => disabled Configuration File (php.ini) Path => /www/php PHP API => 20020918 PHP Extension => 20020429 Zend Extension => 20021010 Debug Build => no Thread Safety => disabled Registered PHP Streams => php, http, ftp, compress.zlib This program makes use of the Zend Scripting Language Engine: Zend Engine v1.3.0, Copyright (c) 1998-2003 Zend Technologies _______________________________________________________________________ Configuration PHP Core Directive => Local Value => Master Value allow_call_time_pass_reference => On => On allow_url_fopen => On => On always_populate_raw_post_data => Off => Off arg_separator.input => & => & arg_separator.output => & => & asp_tags => Off => Off auto_append_file => no value => no value auto_prepend_file => no value => no value browscap => no value => no value default_charset => no value => no value default_mimetype => text/html => text/html define_syslog_variables => Off => Off disable_classes => no value => no value disable_functions => no value => no value display_errors => On => On display_startup_errors => Off => Off doc_root => no value => no value docref_ext => no value => no value docref_root => no value => no value enable_dl => On => On error_append_string => no value => no value error_log => no value => no value error_prepend_string => no value => no value error_reporting => no value => no value expose_php => On => On extension_dir => /www/php/lib/php/extensions/no-debug-non-zts-20020429 => /www/php/lib/php/extensions/no-debug-non-zts-20020429 file_uploads => On => On gpc_order => GPC => GPC highlight.bg => #FFFFFF => #FFFFFF highlight.comment => #FF8000 => #FF8000 highlight.default => #0000BB => #0000BB highlight.html => #000000 => #000000 highlight.keyword => #007700 => #007700 highlight.string => #DD0000 => #DD0000 html_errors => On => On ignore_repeated_errors => Off => Off ignore_repeated_source => Off => Off ignore_user_abort => Off => Off implicit_flush => Off => Off include_path => .:/www/php/lib/php => .:/www/php/lib/php log_errors => Off => Off log_errors_max_len => 1024 => 1024 magic_quotes_gpc => On => On magic_quotes_runtime => Off => Off magic_quotes_sybase => Off => Off max_execution_time => 30 => 30 max_input_time => -1 => -1 open_basedir => no value => no value output_buffering => 0 => 0 output_handler => no value => no value post_max_size => 8M => 8M precision => 14 => 14 register_argc_argv => On => On register_globals => Off => Off report_memleaks => On => On safe_mode => Off => Off safe_mode_exec_dir => /usr/local/php/bin => /usr/local/php/bin safe_mode_gid => Off => Off safe_mode_include_dir => no value => no value sendmail_from => no value => no value sendmail_path => /usr/sbin/sendmail -t -i => /usr/sbin/sendmail -t -i serialize_precision => 100 => 100 short_open_tag => On => On SMTP => localhost => localhost smtp_port => 25 => 25 sql.safe_mode => Off => Off track_errors => Off => Off unserialize_callback_func => no value => no value upload_max_filesize => 2M => 2M upload_tmp_dir => no value => no value user_dir => no value => no value variables_order => no value => no value xmlrpc_error_number => 0 => 0 xmlrpc_errors => Off => Off y2k_compliance => On => On ctype ctype functions => enabled gd GD Support => enabled GD Version => bundled (2.0.15 compatible) GIF Read Support => enabled PNG Support => enabled WBMP Support => enabled XBM Support => enabled mysql MySQL Support => enabled Active Persistent Links => 0 Active Links => 0 Client API version => 4.0.16 MYSQL_MODULE_TYPE => external MYSQL_SOCKET => /tmp/mysql.sock MYSQL_INCLUDE => -I/usr/local/mysql/include/mysql MYSQL_LIBS => -L/usr/local/mysql/lib/mysql -lmysqlclient Directive => Local Value => Master Value mysql.allow_persistent => On => On mysql.connect_timeout => 60 => 60 mysql.default_host => no value => no value mysql.default_password => no value => no value mysql.default_port => no value => no value mysql.default_socket => no value => no value mysql.default_user => no value => no value mysql.max_links => Unlimited => Unlimited mysql.max_persistent => Unlimited => Unlimited mysql.trace_mode => Off => Off overload User-Space Object Overloading Support => enabled pcre PCRE (Perl Compatible Regular Expressions) Support => enabled PCRE Library Version => 4.3 21-May-2003 posix Revision => $Revision: 1.51.2.2 $ session Session Support => enabled Registered save handlers => files user Directive => Local Value => Master Value session.auto_start => Off => Off session.bug_compat_42 => On => On session.bug_compat_warn => On => On session.cache_expire => 180 => 180 session.cache_limiter => nocache => nocache session.cookie_domain => no value => no value session.cookie_lifetime => 0 => 0 session.cookie_path => / => / session.cookie_secure => Off => Off session.entropy_file => no value => no value session.entropy_length => 0 => 0 session.gc_divisor => 100 => 100 session.gc_maxlifetime => 1440 => 1440 session.gc_probability => 1 => 1 session.name => PHPSESSID => PHPSESSID session.referer_check => no value => no value session.save_handler => files => files session.save_path => /tmp => /tmp session.serialize_handler => php => php session.use_cookies => On => On session.use_only_cookies => Off => Off session.use_trans_sid => Off => Off sockets Sockets Support => enabled standard Regex Library => Bundled library enabled Dynamic Library Support => enabled Path to sendmail => /usr/sbin/sendmail -t -i Directive => Local Value => Master Value assert.active => 1 => 1 assert.bail => 0 => 0 assert.callback => no value => no value assert.quiet_eval => 0 => 0 assert.warning => 1 => 1 auto_detect_line_endings => 0 => 0 default_socket_timeout => 60 => 60 safe_mode_allowed_env_vars => PHP_ => PHP_ safe_mode_protected_env_vars => LD_LIBRARY_PATH => LD_LIBRARY_PATH url_rewriter.tags => a=href,area=href,frame=src,form=,fieldset= => a=href,area=href,frame=src,form=,fieldset= user_agent => no value => no value tokenizer Tokenizer Support => enabled xml XML Support => active XML Namespace Support => active EXPAT Version => 1.95.6 zlib ZLib Support => enabled Compiled Version => 1.2.1 Linked Version => 1.2.1 Directive => Local Value => Master Value zlib.output_compression => Off => Off zlib.output_compression_level => -1 => -1 zlib.output_handler => no value => no value Additional Modules Module Name Environment Variable => Value SSH_CONNECTION => 10.0.22.6 1342 10.0.22.126 22 PS1 => # PATH => /sbin:/usr/sbin:/bin:/usr/bin:/usr/local/mysql/bin SHELL => /usr/local/bin/bash MAKEFLAGS => USER => root MAIL => /var/mail/root HOME => /root PWD => /root/instalar/tmp/php-4.3.4 OLDPWD => /root/instalar/tmp SSH_CLIENT => 10.0.22.6 1342 22 CC => gcc QUERY_STRING => TERM => xterm _ => /usr/bin/make CONTENT_TYPE => TEST_PHP_EXECUTABLE => /root/instalar/tmp/php-4.3.4/sapi/cli/php CONTENT_LENGTH => LOGNAME => root SHLVL => 1 REDIRECT_STATUS => REQUEST_METHOD => TERMCAP => xterm:am:bs:km:mi:ms:xn:co#80:it#8:li#24:AL=\E[%dL:DC=\E[%dP:DL=\E[%dM:DO=\E[%dB:LE=\E[%dD:RI=\E[%dC:UP=\E[%dA:ae=^O:al=\E[L:as=^N:bl=^G:cd=\E[J:ce=\E[K:cl=\E[H\E[2J:cm=\E[%i%d;%dH:cr=^M:cs=\E[%i%d;%dr:ct=\E[3g:dc=\E[P:dl=\E[M:do=^J:ei=\E[4l:ho=\E[H:im=\E[4h:is=\E7\E[r\E[m\E[?7h\E[?1;3;4;6l\E[4l\E8\E>:k1=\E[11~:k2=\E[12~:k3=\E[13~:k4=\E[14~:k5=\E[15~:k6=\E[17~:k7=\E[18~:k8=\E[19~:k9=\E[20~:kD=\E[3~:kI=\E[2~:kN=\E[6~:kP=\E[5~:kb=\177:kd=\EOB:ke=\E[?1l\E>:kh=\EOH:kl=\EOD:kr=\EOC:ks=\E[?1h\E=:ku=\EOA:le=^H:md=\E[1m:me=\E[m:mr=\E[7m:nd=\E[C:rc=\E8:rs=\E7\E[r\E8\E[m\E[?7h\E[?1;3;4;6l\E[4l\E>:sc=\E7:se=\E[m:sf=^J:so=\E[7m:sr=\EM:st=\EH:ta=^I:te=\E[2J\E[?47l\E8:ti=\E7\E[?47h:ue=\E[m:up=\E[A:us=\E[4m: TEST_PHP_SRCDIR => /root/instalar/tmp/php-4.3.4 SSH_TTY => /dev/ttyp0 PATH_TRANSLATED => SCRIPT_FILENAME => PHP Variables Variable => Value _SERVER["SSH_CONNECTION"] => 10.0.22.6 1342 10.0.22.126 22 _SERVER["PS1"] => # _SERVER["PATH"] => /sbin:/usr/sbin:/bin:/usr/bin:/usr/local/mysql/bin _SERVER["SHELL"] => /usr/local/bin/bash _SERVER["MAKEFLAGS"] => _SERVER["USER"] => root _SERVER["MAIL"] => /var/mail/root _SERVER["HOME"] => /root _SERVER["PWD"] => /root/instalar/tmp/php-4.3.4 _SERVER["OLDPWD"] => /root/instalar/tmp _SERVER["SSH_CLIENT"] => 10.0.22.6 1342 22 _SERVER["CC"] => gcc _SERVER["QUERY_STRING"] => _SERVER["TERM"] => xterm _SERVER["_"] => /usr/bin/make _SERVER["CONTENT_TYPE"] => _SERVER["TEST_PHP_EXECUTABLE"] => /root/instalar/tmp/php-4.3.4/sapi/cli/php _SERVER["CONTENT_LENGTH"] => _SERVER["LOGNAME"] => root _SERVER["SHLVL"] => 1 _SERVER["REDIRECT_STATUS"] => _SERVER["REQUEST_METHOD"] => _SERVER["TERMCAP"] => xterm:am:bs:km:mi:ms:xn:co#80:it#8:li#24:AL=\\E[%dL:DC=\\E[%dP:DL=\\E[%dM:DO=\\E[%dB:LE=\\E[%dD:RI=\\E[%dC:UP=\\E[%dA:ae=^O:al=\\E[L:as=^N:bl=^G:cd=\\E[J:ce=\\E[K:cl=\\E[H\\E[2J:cm=\\E[%i%d;%dH:cr=^M:cs=\\E[%i%d;%dr:ct=\\E[3g:dc=\\E[P:dl=\\E[M:do=^J:ei=\\E[4l:ho=\\E[H:im=\\E[4h:is=\\E7\\E[r\\E[m\\E[?7h\\E[?1;3;4;6l\\E[4l\\E8\\E>:k1=\\E[11~:k2=\\E[12~:k3=\\E[13~:k4=\\E[14~:k5=\\E[15~:k6=\\E[17~:k7=\\E[18~:k8=\\E[19~:k9=\\E[20~:kD=\\E[3~:kI=\\E[2~:kN=\\E[6~:kP=\\E[5~:kb=\\177:kd=\\EOB:ke=\\E[?1l\\E>:kh=\\EOH:kl=\\EOD:kr=\\EOC:ks=\\E[?1h\\E=:ku=\\EOA:le=^H:md=\\E[1m:me=\\E[m:mr=\\E[7m:nd=\\E[C:rc=\\E8:rs=\\E7\\E[r\\E8\\E[m\\E[?7h\\E[?1;3;4;6l\\E[4l\\E>:sc=\\E7:se=\\E[m:sf=^J:so=\\E[7m:sr=\\EM:st=\\EH:ta=^I:te=\\E[2J\\E[?47l\\E8:ti=\\E7\\E[?47h:ue=\\E[m:up=\\E[A:us=\\E[4m: _SERVER["TEST_PHP_SRCDIR"] => /root/instalar/tmp/php-4.3.4 _SERVER["SSH_TTY"] => /dev/ttyp0 _SERVER["PATH_TRANSLATED"] => _SERVER["SCRIPT_FILENAME"] => _SERVER["PHP_SELF"] => _SERVER["SCRIPT_NAME"] => _SERVER["DOCUMENT_ROOT"] => _SERVER["argv"] => Array ( ) _SERVER["argc"] => 0 _ENV["SSH_CONNECTION"] => 10.0.22.6 1342 10.0.22.126 22 _ENV["PS1"] => # _ENV["PATH"] => /sbin:/usr/sbin:/bin:/usr/bin:/usr/local/mysql/bin _ENV["SHELL"] => /usr/local/bin/bash _ENV["MAKEFLAGS"] => _ENV["USER"] => root _ENV["MAIL"] => /var/mail/root _ENV["HOME"] => /root _ENV["PWD"] => /root/instalar/tmp/php-4.3.4 _ENV["OLDPWD"] => /root/instalar/tmp _ENV["SSH_CLIENT"] => 10.0.22.6 1342 22 _ENV["CC"] => gcc _ENV["QUERY_STRING"] => _ENV["TERM"] => xterm _ENV["_"] => /usr/bin/make _ENV["CONTENT_TYPE"] => _ENV["TEST_PHP_EXECUTABLE"] => /root/instalar/tmp/php-4.3.4/sapi/cli/php _ENV["CONTENT_LENGTH"] => _ENV["LOGNAME"] => root _ENV["SHLVL"] => 1 _ENV["REDIRECT_STATUS"] => _ENV["REQUEST_METHOD"] => _ENV["TERMCAP"] => xterm:am:bs:km:mi:ms:xn:co#80:it#8:li#24:AL=\\E[%dL:DC=\\E[%dP:DL=\\E[%dM:DO=\\E[%dB:LE=\\E[%dD:RI=\\E[%dC:UP=\\E[%dA:ae=^O:al=\\E[L:as=^N:bl=^G:cd=\\E[J:ce=\\E[K:cl=\\E[H\\E[2J:cm=\\E[%i%d;%dH:cr=^M:cs=\\E[%i%d;%dr:ct=\\E[3g:dc=\\E[P:dl=\\E[M:do=^J:ei=\\E[4l:ho=\\E[H:im=\\E[4h:is=\\E7\\E[r\\E[m\\E[?7h\\E[?1;3;4;6l\\E[4l\\E8\\E>:k1=\\E[11~:k2=\\E[12~:k3=\\E[13~:k4=\\E[14~:k5=\\E[15~:k6=\\E[17~:k7=\\E[18~:k8=\\E[19~:k9=\\E[20~:kD=\\E[3~:kI=\\E[2~:kN=\\E[6~:kP=\\E[5~:kb=\\177:kd=\\EOB:ke=\\E[?1l\\E>:kh=\\EOH:kl=\\EOD:kr=\\EOC:ks=\\E[?1h\\E=:ku=\\EOA:le=^H:md=\\E[1m:me=\\E[m:mr=\\E[7m:nd=\\E[C:rc=\\E8:rs=\\E7\\E[r\\E8\\E[m\\E[?7h\\E[?1;3;4;6l\\E[4l\\E>:sc=\\E7:se=\\E[m:sf=^J:so=\\E[7m:sr=\\EM:st=\\EH:ta=^I:te=\\E[2J\\E[?47l\\E8:ti=\\E7\\E[?47h:ue=\\E[m:up=\\E[A:us=\\E[4m: _ENV["TEST_PHP_SRCDIR"] => /root/instalar/tmp/php-4.3.4 _ENV["SSH_TTY"] => /dev/ttyp0 _ENV["PATH_TRANSLATED"] => _ENV["SCRIPT_FILENAME"] => PHP License This program is free software; you can redistribute it and/or modify it under the terms of the PHP License as published by the PHP Group and included in the distribution in the file: LICENSE This program is distributed in the hope that it will be useful, but WITHOUT ANY WARRANTY; without even the implied warranty of MERCHANTABILITY or FITNESS FOR A PARTICULAR PURPOSE. If you did not receive a copy of the PHP license, or have any questions about PHP licensing, please contact license@php.net.