php_test_results_20031201.txt

From: Date: Mon, 01 Dec 2003 20:23:15 +0000
Subject: php_test_results_20031201.txt
Groups: php.qa 
Request: Send a blank email to php-qa+get-15817@lists.php.net to get a copy of this message
Attached the file php_test_results_20031201.txt

===================================================================== FAILED TEST SUMMARY --------------------------------------------------------------------- Bug #25547 (error_handler and array index with function call) [tests/lang/bug25547.phpt] Bug #25665 (var_dump () hangs on Nan and INF) [ext/standard/tests/math/bug25665.phpt] Various pow() tests [ext/standard/tests/math/pow.phpt] Test strtoupper on non-ASCII characters [ext/standard/tests/strings/strtoupper.phpt] strtotime() function [ext/standard/tests/time/002.phpt] Bug #13142 strtotime handling of "M d H:i:s Y" format [ext/standard/tests/time/bug13142.phpt] ===================================================================== ===================================================================== TEST RESULT SUMMARY --------------------------------------------------------------------- Exts skipped : 78 Exts tested : 9 --------------------------------------------------------------------- Number of tests : 535 Tests skipped : 248 (46.4%) Tests warned : 0 ( 0.0%) Tests failed : 6 ( 1.1%) Tests passed : 281 (52.5%) --------------------------------------------------------------------- Time taken : 214 seconds ===================================================================== ================================================================================ /dsk2/fischer/php-4.3.4/tests/lang/bug25547.phpt ================================================================================ ---- EXPECTED OUTPUT handler(Undefined index: foo) Array ( [foo] => 1 ) Done ---- ACTUAL OUTPUT handler(Undefined index: foo) Array ( [(o] => 1 ) Done ---- FAILED ================================================================================ 004- [foo] => 1 004+ [(o] => 1 ================================================================================ ================================================================================ /dsk2/fischer/php-4.3.4/ext/standard/tests/math/bug25665.phpt ================================================================================ ---- EXPECTED OUTPUT float(NAN) float(-INF) ---- ACTUAL OUTPUT float(0) float(-1.7976931348623E+308) ---- FAILED ================================================================================ 001- float(NAN) 001+ float(0) 002- float(-INF) 002+ float(-1.7976931348623E+308) ================================================================================ ================================================================================ /dsk2/fischer/php-4.3.4/ext/standard/tests/math/pow.phpt ================================================================================ ---- EXPECTED OUTPUT 1,1,0,0 On failure, please mail result to php-dev@lists.php.net OK ---- ACTUAL OUTPUT 1,1,0,0 On failure, please mail result to php-dev@lists.php.net Assert failed: TRUE === is_infinite(pow(0,-2)) Left: bool(true) Right: bool(false) Assert failed: TRUE === is_infinite(pow(0,-1)) Left: bool(true) Right: bool(false) Assert failed: TRUE === is_infinite(pow(0,-2.0)) Left: bool(true) Right: bool(false) Assert failed: TRUE === is_infinite(pow(0,-1.0)) Left: bool(true) Right: bool(false) Assert failed: TRUE === is_infinite(pow(0.0,-2.0)) Left: bool(true) Right: bool(false) Assert failed: TRUE === is_infinite(pow(0.0,-1.0)) Left: bool(true) Right: bool(false) Assert failed: TRUE === is_infinite(pow( 0.0,-2)) Left: bool(true) Right: bool(false) Assert failed: TRUE === is_infinite(pow( 0.0,-1)) Left: bool(true) Right: bool(false) ---- FAILED ================================================================================ 003- OK 003+ 004+ Assert failed: 005+ TRUE === is_infinite(pow(0,-2)) 006+ Left: bool(true) 007+ Right: bool(false) 008+ 009+ Assert failed: 010+ TRUE === is_infinite(pow(0,-1)) 011+ Left: bool(true) 012+ Right: bool(false) 013+ 014+ Assert failed: 015+ TRUE === is_infinite(pow(0,-2.0)) 016+ Left: bool(true) 017+ Right: bool(false) 018+ 019+ Assert failed: 020+ TRUE === is_infinite(pow(0,-1.0)) 021+ Left: bool(true) 022+ Right: bool(false) 023+ 024+ Assert failed: 025+ TRUE === is_infinite(pow(0.0,-2.0)) 026+ Left: bool(true) 027+ Right: bool(false) 028+ 029+ Assert failed: 030+ TRUE === is_infinite(pow(0.0,-1.0)) 031+ Left: bool(true) 032+ Right: bool(false) 033+ 034+ Assert failed: 035+ TRUE === is_infinite(pow( 0.0,-2)) 036+ Left: bool(true) 037+ Right: bool(false) 038+ 039+ Assert failed: 040+ TRUE === is_infinite(pow( 0.0,-1)) 041+ Left: bool(true) 042+ Right: bool(false) ================================================================================ ================================================================================ /dsk2/fischer/php-4.3.4/ext/standard/tests/strings/strtoupper.phpt ================================================================================ ---- EXPECTED OUTPUT ÄÖÜ ---- ACTUAL OUTPUT ãöü ---- FAILED ================================================================================ 001- ÄÖÜ 001+ ãöü ================================================================================ ================================================================================ /dsk2/fischer/php-4.3.4/ext/standard/tests/time/002.phpt ================================================================================ ---- EXPECTED OUTPUT 1999-10-13 00:00:00 1999-10-13 00:00:00 2000-01-19 00:00:00 2000-01-19 00:00:00 2001-12-21 00:00:00 2001-12-21 00:00:00 2001-12-21 12:16:00 2001-12-21 12:16:00 1969-12-31 23:59:59 2001-10-22 21:19:58 2001-10-22 23:19:58 2001-10-22 23:32:58 2001-10-22 19:19:58 2001-10-22 19:06:58 1999-10-13 00:00:00 1999-10-13 00:00:00 2000-01-19 00:00:00 2000-01-19 00:00:00 2001-12-21 00:00:00 2001-12-21 00:00:00 2001-12-21 12:16:00 2001-12-21 12:16:00 1969-12-31 18:59:59 2001-10-22 21:19:58 2001-10-22 19:19:58 2001-10-22 19:32:58 2001-10-22 15:19:58 2001-10-22 15:06:58 ---- ACTUAL OUTPUT 1999-10-13 00:00:00 1999-10-13 00:00:00 2000-01-19 00:00:00 2000-01-19 00:00:00 2001-12-21 00:00:00 2001-12-21 00:00:00 2001-12-21 12:16:00 2001-12-21 12:16:00 1969-12-31 23:59:59 2001-10-22 21:19:58 2001-10-22 23:19:58 2001-10-22 23:32:58 2001-10-22 19:19:58 2001-10-22 19:06:58 1999-10-13 00:00:00 1999-10-13 00:00:00 2000-01-19 00:00:00 2000-01-19 00:00:00 2001-12-21 00:00:00 2001-12-21 00:00:00 2001-12-21 12:16:00 2001-12-21 12:16:00 1969-12-31 23:59:59 2001-10-22 21:19:58 2001-10-22 23:19:58 2001-10-22 23:32:58 2001-10-22 19:19:58 2001-10-22 19:06:58 ---- FAILED ================================================================================ 023- 1969-12-31 18:59:59 023+ 1969-12-31 23:59:59 025- 2001-10-22 19:19:58 025+ 2001-10-22 23:19:58 026- 2001-10-22 19:32:58 026+ 2001-10-22 23:32:58 027- 2001-10-22 15:19:58 027+ 2001-10-22 19:19:58 028- 2001-10-22 15:06:58 028+ 2001-10-22 19:06:58 ================================================================================ ================================================================================ /dsk2/fischer/php-4.3.4/ext/standard/tests/time/bug13142.phpt ================================================================================ ---- EXPECTED OUTPUT Tue, 4 Sep 2001 16:39:45 -0400 Tue, 4 Sep 2001 16:39:45 -0400 ---- ACTUAL OUTPUT Tue, 4 Sep 2001 16:39:45 +0000 Tue, 4 Sep 2001 16:39:45 +0000 ---- FAILED ================================================================================ 001- Tue, 4 Sep 2001 16:39:45 -0400 001+ Tue, 4 Sep 2001 16:39:45 +0000 002- Tue, 4 Sep 2001 16:39:45 -0400 002+ Tue, 4 Sep 2001 16:39:45 +0000 ================================================================================ ================================================================================ BUILD ENVIRONMENT ================================================================================ OS: HP-UX - HP-UX servidor B.10.20 A 9000/811 Automake: automake (GNU automake) 1.7.7 Written by Tom Tromey <tromey@redhat.com>. Copyright 2003 Free Software Foundation, Inc. This is free software; see the source for copying conditions. There is NO warranty; not even for MERCHANTABILITY or FITNESS FOR A PARTICULAR PURPOSE. Autoconf: autoconf (GNU Autoconf) 2.57 Written by David J. MacKenzie and Akim Demaille. Copyright 2002 Free Software Foundation, Inc. This is free software; see the source for copying conditions. There is NO warranty; not even for MERCHANTABILITY or FITNESS FOR A PARTICULAR PURPOSE. Libtool: ltmain.sh (GNU libtool) 1.4.3 (1.922.2.110 2002/10/23 01:39:54) Compiler: Reading specs from /usr/local/lib/gcc-lib/hppa1.1-hp-hpux10.20/3.3.2/specs Configured with: ../gcc-3.3.2/configure --with-gnu-as --with-as=/usr/local/bin/as Thread model: single gcc version 3.3.2 Bison: bison (GNU Bison) 1.875 Written by Robert Corbett and Richard Stallman. Copyright (C) 2002 Free Software Foundation, Inc. This is free software; see the source for copying conditions. There is NO warranty; not even for MERCHANTABILITY or FITNESS FOR A PARTICULAR PURPOSE. Libraries: ================================================================================ PHPINFO ================================================================================ phpinfo() PHP Version => 4.3.4 System => HP-UX servidor B.10.20 A 9000/811 Build Date => Dec 1 2003 08:57:24 Configure Command => './configure' Server API => Command Line Interface Virtual Directory Support => disabled Configuration File (php.ini) Path => /usr/local/lib PHP API => 20020918 PHP Extension => 20020429 Zend Extension => 20021010 Debug Build => no Thread Safety => disabled Registered PHP Streams => php, http, ftp This program makes use of the Zend Scripting Language Engine: Zend Engine v1.3.0, Copyright (c) 1998-2003 Zend Technologies _______________________________________________________________________ Configuration PHP Core Directive => Local Value => Master Value allow_call_time_pass_reference => On => On allow_url_fopen => On => On always_populate_raw_post_data => Off => Off arg_separator.input => & => & arg_separator.output => & => & asp_tags => Off => Off auto_append_file => no value => no value auto_prepend_file => no value => no value browscap => no value => no value default_charset => no value => no value default_mimetype => text/html => text/html define_syslog_variables => Off => Off disable_classes => no value => no value disable_functions => no value => no value display_errors => On => On display_startup_errors => Off => Off doc_root => no value => no value docref_ext => no value => no value docref_root => no value => no value enable_dl => On => On error_append_string => no value => no value error_log => no value => no value error_prepend_string => no value => no value error_reporting => no value => no value expose_php => On => On extension_dir => /usr/local/lib/php/extensions/no-debug-non-zts-20020429 => /usr/local/lib/php/extensions/no-debug-non-zts-20020429 file_uploads => On => On gpc_order => GPC => GPC highlight.bg => #FFFFFF => #FFFFFF highlight.comment => #FF8000 => #FF8000 highlight.default => #0000BB => #0000BB highlight.html => #000000 => #000000 highlight.keyword => #007700 => #007700 highlight.string => #DD0000 => #DD0000 html_errors => On => On ignore_repeated_errors => Off => Off ignore_repeated_source => Off => Off ignore_user_abort => Off => Off implicit_flush => Off => Off include_path => .:/usr/local/lib/php => .:/usr/local/lib/php log_errors => Off => Off log_errors_max_len => 1024 => 1024 magic_quotes_gpc => On => On magic_quotes_runtime => Off => Off magic_quotes_sybase => Off => Off max_execution_time => 30 => 30 max_input_time => -1 => -1 open_basedir => no value => no value output_buffering => 0 => 0 output_handler => no value => no value post_max_size => 8M => 8M precision => 14 => 14 register_argc_argv => On => On register_globals => Off => Off report_memleaks => On => On safe_mode => Off => Off safe_mode_exec_dir => /usr/local/php/bin => /usr/local/php/bin safe_mode_gid => Off => Off safe_mode_include_dir => no value => no value sendmail_from => no value => no value sendmail_path => /usr/sbin/sendmail -t -i => /usr/sbin/sendmail -t -i serialize_precision => 100 => 100 short_open_tag => On => On SMTP => localhost => localhost smtp_port => 25 => 25 sql.safe_mode => Off => Off track_errors => Off => Off unserialize_callback_func => no value => no value upload_max_filesize => 2M => 2M upload_tmp_dir => no value => no value user_dir => no value => no value variables_order => no value => no value xmlrpc_error_number => 0 => 0 xmlrpc_errors => Off => Off y2k_compliance => On => On ctype ctype functions => enabled mysql MySQL Support => enabled Active Persistent Links => 0 Active Links => 0 Client API version => 3.23.49 MYSQL_MODULE_TYPE => builtin MYSQL_SOCKET => /tmp/mysql.sock MYSQL_INCLUDE => MYSQL_LIBS => Directive => Local Value => Master Value mysql.allow_persistent => On => On mysql.connect_timeout => 60 => 60 mysql.default_host => no value => no value mysql.default_password => no value => no value mysql.default_port => no value => no value mysql.default_socket => no value => no value mysql.default_user => no value => no value mysql.max_links => Unlimited => Unlimited mysql.max_persistent => Unlimited => Unlimited mysql.trace_mode => Off => Off overload User-Space Object Overloading Support => enabled pcre PCRE (Perl Compatible Regular Expressions) Support => enabled PCRE Library Version => 4.3 21-May-2003 posix Revision => $Revision: 1.51.2.2 $ session Session Support => enabled Registered save handlers => files user Directive => Local Value => Master Value session.auto_start => Off => Off session.bug_compat_42 => On => On session.bug_compat_warn => On => On session.cache_expire => 180 => 180 session.cache_limiter => nocache => nocache session.cookie_domain => no value => no value session.cookie_lifetime => 0 => 0 session.cookie_path => / => / session.cookie_secure => Off => Off session.entropy_file => no value => no value session.entropy_length => 0 => 0 session.gc_divisor => 100 => 100 session.gc_maxlifetime => 1440 => 1440 session.gc_probability => 1 => 1 session.name => PHPSESSID => PHPSESSID session.referer_check => no value => no value session.save_handler => files => files session.save_path => /tmp => /tmp session.serialize_handler => php => php session.use_cookies => On => On session.use_only_cookies => Off => Off session.use_trans_sid => Off => Off standard Regex Library => Bundled library enabled Dynamic Library support not available<br />. Path to sendmail => /usr/sbin/sendmail -t -i Directive => Local Value => Master Value assert.active => 1 => 1 assert.bail => 0 => 0 assert.callback => no value => no value assert.quiet_eval => 0 => 0 assert.warning => 1 => 1 auto_detect_line_endings => 0 => 0 default_socket_timeout => 60 => 60 safe_mode_allowed_env_vars => PHP_ => PHP_ safe_mode_protected_env_vars => LD_LIBRARY_PATH => LD_LIBRARY_PATH url_rewriter.tags => a=href,area=href,frame=src,form=,fieldset= => a=href,area=href,frame=src,form=,fieldset= user_agent => no value => no value tokenizer Tokenizer Support => enabled xml XML Support => active XML Namespace Support => active EXPAT Version => 1.95.6 Additional Modules Module Name Environment Variable => Value _ => /dsk2/fischer/php-4.3.4/sapi/cli/php MANPATH => /usr/share/man/%L:/usr/share/man:/usr/contrib/man/%L:/usr/contrib/man:/usr/local/man/%L:/usr/local/man:/opt/pd/share/man/%L:/opt/pd/share/man:/opt/hparray/share/man/%L:/opt/hparray/share/man:/opt/pred/share/man/%L:/opt/pred/share/man QUERY_STRING => SSH_TTY => /dev/pts/3 PATH => /usr/local/bin:/usr/sbin:/usr/bin:/usr/ccs/bin:/usr/local/bin:/usr/contrib/bin:/opt/nettladm/bin:/opt/pd/bin:/usr/bin/X11:/usr/contrib/bin/X11:/opt/upgrade/bin:/opt/hparray/bin:/opt/pred/bin:/sbin:/home/root:. SCRIPT_FILENAME => CONTENT_TYPE => COLUMNS => 80 EDITOR => vi HISTFILE => //.sh_history.20031130224646 LOGNAME => root REDIRECT_STATUS => MAKEFLAGS => MAIL => /var/mail/root ERASE => ^H PS1 => servidor:$PWD> REQUEST_METHOD => USER => root PATH_TRANSLATED => LDFLAGS => -L/usr/local/lib CC => gcc CONTENT_LENGTH => MAKELEVEL => 1 TEST_PHP_EXECUTABLE => /dsk2/fischer/php-4.3.4/sapi/cli/php SHELL => /bin/sh CPPFLAGS => -I/usr/local/include -I/dsk2/fischer/php-4.3.4/TSRM HISTSIZE => 1024 HOME => / SSH_CONNECTION => 192.168.1.11 1667 192.168.1.1 22 SSH_CLIENT => 192.168.1.11 1667 22 TEST_PHP_SRCDIR => /dsk2/fischer/php-4.3.4 TERM => xterm MFLAGS => PWD => /dsk2/fischer/php-4.3.4 TZ => BrasilVerao2 LINES => 43 PHP Variables Variable => Value _SERVER["_"] => /dsk2/fischer/php-4.3.4/sapi/cli/php _SERVER["MANPATH"] => /usr/share/man/%L:/usr/share/man:/usr/contrib/man/%L:/usr/contrib/man:/usr/local/man/%L:/usr/local/man:/opt/pd/share/man/%L:/opt/pd/share/man:/opt/hparray/share/man/%L:/opt/hparray/share/man:/opt/pred/share/man/%L:/opt/pred/share/man _SERVER["QUERY_STRING"] => _SERVER["SSH_TTY"] => /dev/pts/3 _SERVER["PATH"] => /usr/local/bin:/usr/sbin:/usr/bin:/usr/ccs/bin:/usr/local/bin:/usr/contrib/bin:/opt/nettladm/bin:/opt/pd/bin:/usr/bin/X11:/usr/contrib/bin/X11:/opt/upgrade/bin:/opt/hparray/bin:/opt/pred/bin:/sbin:/home/root:. _SERVER["SCRIPT_FILENAME"] => _SERVER["CONTENT_TYPE"] => _SERVER["COLUMNS"] => 80 _SERVER["EDITOR"] => vi _SERVER["HISTFILE"] => //.sh_history.20031130224646 _SERVER["LOGNAME"] => root _SERVER["REDIRECT_STATUS"] => _SERVER["MAKEFLAGS"] => _SERVER["MAIL"] => /var/mail/root _SERVER["ERASE"] => ^H _SERVER["PS1"] => servidor:$PWD> _SERVER["REQUEST_METHOD"] => _SERVER["USER"] => root _SERVER["PATH_TRANSLATED"] => _SERVER["LDFLAGS"] => -L/usr/local/lib _SERVER["CC"] => gcc _SERVER["CONTENT_LENGTH"] => _SERVER["MAKELEVEL"] => 1 _SERVER["TEST_PHP_EXECUTABLE"] => /dsk2/fischer/php-4.3.4/sapi/cli/php _SERVER["SHELL"] => /bin/sh _SERVER["CPPFLAGS"] => -I/usr/local/include -I/dsk2/fischer/php-4.3.4/TSRM _SERVER["HISTSIZE"] => 1024 _SERVER["HOME"] => / _SERVER["SSH_CONNECTION"] => 192.168.1.11 1667 192.168.1.1 22 _SERVER["SSH_CLIENT"] => 192.168.1.11 1667 22 _SERVER["TEST_PHP_SRCDIR"] => /dsk2/fischer/php-4.3.4 _SERVER["TERM"] => xterm _SERVER["MFLAGS"] => _SERVER["PWD"] => /dsk2/fischer/php-4.3.4 _SERVER["TZ"] => BrasilVerao2 _SERVER["LINES"] => 43 _SERVER["PHP_SELF"] => _SERVER["SCRIPT_NAME"] => _SERVER["DOCUMENT_ROOT"] => _SERVER["argv"] => Array ( ) _SERVER["argc"] => 0 _ENV["_"] => /dsk2/fischer/php-4.3.4/sapi/cli/php _ENV["MANPATH"] => /usr/share/man/%L:/usr/share/man:/usr/contrib/man/%L:/usr/contrib/man:/usr/local/man/%L:/usr/local/man:/opt/pd/share/man/%L:/opt/pd/share/man:/opt/hparray/share/man/%L:/opt/hparray/share/man:/opt/pred/share/man/%L:/opt/pred/share/man _ENV["QUERY_STRING"] => _ENV["SSH_TTY"] => /dev/pts/3 _ENV["PATH"] => /usr/local/bin:/usr/sbin:/usr/bin:/usr/ccs/bin:/usr/local/bin:/usr/contrib/bin:/opt/nettladm/bin:/opt/pd/bin:/usr/bin/X11:/usr/contrib/bin/X11:/opt/upgrade/bin:/opt/hparray/bin:/opt/pred/bin:/sbin:/home/root:. _ENV["SCRIPT_FILENAME"] => _ENV["CONTENT_TYPE"] => _ENV["COLUMNS"] => 80 _ENV["EDITOR"] => vi _ENV["HISTFILE"] => //.sh_history.20031130224646 _ENV["LOGNAME"] => root _ENV["REDIRECT_STATUS"] => _ENV["MAKEFLAGS"] => _ENV["MAIL"] => /var/mail/root _ENV["ERASE"] => ^H _ENV["PS1"] => servidor:$PWD> _ENV["REQUEST_METHOD"] => _ENV["USER"] => root _ENV["PATH_TRANSLATED"] => _ENV["LDFLAGS"] => -L/usr/local/lib _ENV["CC"] => gcc _ENV["CONTENT_LENGTH"] => _ENV["MAKELEVEL"] => 1 _ENV["TEST_PHP_EXECUTABLE"] => /dsk2/fischer/php-4.3.4/sapi/cli/php _ENV["SHELL"] => /bin/sh _ENV["CPPFLAGS"] => -I/usr/local/include -I/dsk2/fischer/php-4.3.4/TSRM _ENV["HISTSIZE"] => 1024 _ENV["HOME"] => / _ENV["SSH_CONNECTION"] => 192.168.1.11 1667 192.168.1.1 22 _ENV["SSH_CLIENT"] => 192.168.1.11 1667 22 _ENV["TEST_PHP_SRCDIR"] => /dsk2/fischer/php-4.3.4 _ENV["TERM"] => xterm _ENV["MFLAGS"] => _ENV["PWD"] => /dsk2/fischer/php-4.3.4 _ENV["TZ"] => BrasilVerao2 _ENV["LINES"] => 43 PHP License This program is free software; you can redistribute it and/or modify it under the terms of the PHP License as published by the PHP Group and included in the distribution in the file: LICENSE This program is distributed in the hope that it will be useful, but WITHOUT ANY WARRANTY; without even the implied warranty of MERCHANTABILITY or FITNESS FOR A PARTICULAR PURPOSE. If you did not receive a copy of the PHP license, or have any questions about PHP licensing, please contact license@php.net.
« previous php.qa (#15817) next »