PHP test results
| From: | Jeff W. Stewart | Date: | Wed, 07 Jan 2004 19:16:37 +0000 |
| Subject: | PHP test results | ||
| Groups: | php.qa | ||
| Request: | Send a blank email to php-qa+get-15863@lists.php.net to get a copy of this message | ||
=====================================================================
FAILED TEST SUMMARY
---------------------------------------------------------------------
Bug #25547 (error_handler and array index with function call) [tests/lang/bug25547.phpt]
Bug #25665 (var_dump () hangs on Nan and INF) [ext/standard/tests/math/bug25665.phpt]
strtotime() function [ext/standard/tests/time/002.phpt]
Bug #13142 strtotime handling of "M d H:i:s Y" format
[ext/standard/tests/time/bug13142.phpt]
=====================================================================
=====================================================================
TEST RESULT SUMMARY
---------------------------------------------------------------------
Exts skipped : 78
Exts tested : 9
---------------------------------------------------------------------
Number of tests : 535
Tests skipped : 255 (47.7%)
Tests warned : 0 ( 0.0%)
Tests failed : 4 ( 0.7%)
Tests passed : 276 (51.6%)
---------------------------------------------------------------------
Time taken : 123 seconds
=====================================================================
================================================================================
/junk/jws/php/work/php-4.3.4/tests/lang/bug25547.phpt
================================================================================
---- EXPECTED OUTPUT
handler(Undefined index: foo)
Array
(
[foo] => 1
)
Done
---- ACTUAL OUTPUT
handler(Undefined index: foo)
Array
(
[(o] => 1
)
Done
---- FAILED
================================================================================
004- [foo] => 1
004+ [(o] => 1
================================================================================
================================================================================
/junk/jws/php/work/php-4.3.4/ext/standard/tests/math/bug25665.phpt
================================================================================
---- EXPECTED OUTPUT
float(NAN)
float(-INF)
---- ACTUAL OUTPUT
Fatal error: Maximum execution time of 5 seconds exceeded in
/junk/jws/php/work/php-4.3.4/ext/standard/tests/math/bug25665.php on line 3
---- FAILED
================================================================================
001- float(NAN)
001+ Fatal error: Maximum execution time of 5 seconds exceeded in
/junk/jws/php/work/php-4.3.4/ext/standard/tests/math/bug25665.php on line 3
002- float(-INF)
================================================================================
================================================================================
/junk/jws/php/work/php-4.3.4/ext/standard/tests/time/002.phpt
================================================================================
---- EXPECTED OUTPUT
1999-10-13 00:00:00
1999-10-13 00:00:00
2000-01-19 00:00:00
2000-01-19 00:00:00
2001-12-21 00:00:00
2001-12-21 00:00:00
2001-12-21 12:16:00
2001-12-21 12:16:00
1969-12-31 23:59:59
2001-10-22 21:19:58
2001-10-22 23:19:58
2001-10-22 23:32:58
2001-10-22 19:19:58
2001-10-22 19:06:58
1999-10-13 00:00:00
1999-10-13 00:00:00
2000-01-19 00:00:00
2000-01-19 00:00:00
2001-12-21 00:00:00
2001-12-21 00:00:00
2001-12-21 12:16:00
2001-12-21 12:16:00
1969-12-31 18:59:59
2001-10-22 21:19:58
2001-10-22 19:19:58
2001-10-22 19:32:58
2001-10-22 15:19:58
2001-10-22 15:06:58
---- ACTUAL OUTPUT
1999-10-13 00:00:00
1999-10-13 00:00:00
2000-01-19 00:00:00
2000-01-19 00:00:00
2001-12-21 00:00:00
2001-12-21 00:00:00
2001-12-21 12:16:00
2001-12-21 12:16:00
1969-12-31 23:59:59
2001-10-22 21:19:58
2001-10-22 23:19:58
2001-10-22 23:32:58
2001-10-22 19:19:58
2001-10-22 19:06:58
1999-10-13 00:00:00
1999-10-13 00:00:00
2000-01-19 00:00:00
2000-01-19 00:00:00
2001-12-21 00:00:00
2001-12-21 00:00:00
2001-12-21 12:16:00
2001-12-21 12:16:00
1969-12-31 23:59:59
2001-10-22 21:19:58
2001-10-22 23:19:58
2001-10-22 23:32:58
2001-10-22 19:19:58
2001-10-22 19:06:58
---- FAILED
================================================================================
023- 1969-12-31 18:59:59
023+ 1969-12-31 23:59:59
025- 2001-10-22 19:19:58
025+ 2001-10-22 23:19:58
026- 2001-10-22 19:32:58
026+ 2001-10-22 23:32:58
027- 2001-10-22 15:19:58
027+ 2001-10-22 19:19:58
028- 2001-10-22 15:06:58
028+ 2001-10-22 19:06:58
================================================================================
================================================================================
/junk/jws/php/work/php-4.3.4/ext/standard/tests/time/bug13142.phpt
================================================================================
---- EXPECTED OUTPUT
Tue, 4 Sep 2001 16:39:45 -0400
Tue, 4 Sep 2001 16:39:45 -0400
---- ACTUAL OUTPUT
Tue, 4 Sep 2001 16:39:45 +0100
Tue, 4 Sep 2001 16:39:45 +0100
---- FAILED
================================================================================
001- Tue, 4 Sep 2001 16:39:45 -0400
001+ Tue, 4 Sep 2001 16:39:45 +0100
002- Tue, 4 Sep 2001 16:39:45 -0400
002+ Tue, 4 Sep 2001 16:39:45 +0100
================================================================================
================================================================================
BUILD ENVIRONMENT
================================================================================
OS:
AIX - AIX newquest 2 5 000024004C00
Automake:
automake (GNU automake) 1.5
Written by Tom Tromey <tromey@cygnus.com>.
Copyright 1994, 1995, 1996, 1997, 1998, 1999, 2000, 2001
Free Software Foundation, Inc.
This is free software; see the source for copying conditions. There is NO
warranty; not even for MERCHANTABILITY or FITNESS FOR A PARTICULAR PURPOSE.
Autoconf:
autoconf (GNU Autoconf) 2.53
Written by David J. MacKenzie and Akim Demaille.
Copyright 2002 Free Software Foundation, Inc.
This is free software; see the source for copying conditions. There is NO
warranty; not even for MERCHANTABILITY or FITNESS FOR A PARTICULAR PURPOSE.
Libtool:
ltmain.sh (GNU libtool) 1.4.3 (1.922.2.110 2002/10/23 01:39:54)
Compiler:
N/A
Bison:
GNU Bison version 1.28
Libraries:
/junk/jws/php/work/php-4.3.4/sapi/cli/php needs:
/usr/lib/libc.a(shr.o)
/unix
/usr/lib/libcrypt.a(shr.o)
================================================================================
PHPINFO
================================================================================
phpinfo()
PHP Version => 4.3.4
System => AIX newquest 2 5 000024004C00
Build Date => Jan 7 2004 13:54:58
Configure Command => './configure' '--prefix=/opt/php-4.3.4'
'--with-mysql' '--with-apxs=/opt/apache-1.3.28-perl-ssl/bin/apxs'
Server API => Command Line Interface
Virtual Directory Support => disabled
Configuration File (php.ini) Path => /opt/php-4.3.4/lib
PHP API => 20020918
PHP Extension => 20020429
Zend Extension => 20021010
Debug Build => no
Thread Safety => disabled
Registered PHP Streams => php, http, ftp
This program makes use of the Zend Scripting Language Engine:
Zend Engine v1.3.0, Copyright (c) 1998-2003 Zend Technologies
_______________________________________________________________________
Configuration
PHP Core
Directive => Local Value => Master Value
allow_call_time_pass_reference => On => On
allow_url_fopen => On => On
always_populate_raw_post_data => Off => Off
arg_separator.input => & => &
arg_separator.output => & => &
asp_tags => Off => Off
auto_append_file => no value => no value
auto_prepend_file => no value => no value
browscap => no value => no value
default_charset => no value => no value
default_mimetype => text/html => text/html
define_syslog_variables => Off => Off
disable_classes => no value => no value
disable_functions => no value => no value
display_errors => On => On
display_startup_errors => Off => Off
doc_root => no value => no value
docref_ext => no value => no value
docref_root => no value => no value
enable_dl => On => On
error_append_string => no value => no value
error_log => no value => no value
error_prepend_string => no value => no value
error_reporting => no value => no value
expose_php => On => On
extension_dir => /opt/php-4.3.4/lib/php/extensions/no-debug-non-zts-20020429 =>
/opt/php-4.3.4/lib/php/extensions/no-debug-non-zts-20020429
file_uploads => On => On
gpc_order => GPC => GPC
highlight.bg => #FFFFFF => #FFFFFF
highlight.comment => #FF8000 => #FF8000
highlight.default => #0000BB => #0000BB
highlight.html => #000000 => #000000
highlight.keyword => #007700 => #007700
highlight.string => #DD0000 => #DD0000
html_errors => On => On
ignore_repeated_errors => Off => Off
ignore_repeated_source => Off => Off
ignore_user_abort => Off => Off
implicit_flush => Off => Off
include_path => .:/opt/php-4.3.4/lib/php => .:/opt/php-4.3.4/lib/php
log_errors => Off => Off
log_errors_max_len => 1024 => 1024
magic_quotes_gpc => On => On
magic_quotes_runtime => Off => Off
magic_quotes_sybase => Off => Off
max_execution_time => 30 => 30
max_input_time => -1 => -1
open_basedir => no value => no value
output_buffering => 0 => 0
output_handler => no value => no value
post_max_size => 8M => 8M
precision => 14 => 14
register_argc_argv => On => On
register_globals => Off => Off
report_memleaks => On => On
safe_mode => Off => Off
safe_mode_exec_dir => /usr/local/php/bin => /usr/local/php/bin
safe_mode_gid => Off => Off
safe_mode_include_dir => no value => no value
sendmail_from => no value => no value
sendmail_path => /usr/sbin/sendmail -t -i => /usr/sbin/sendmail -t -i
serialize_precision => 100 => 100
short_open_tag => On => On
SMTP => localhost => localhost
smtp_port => 25 => 25
sql.safe_mode => Off => Off
track_errors => Off => Off
unserialize_callback_func => no value => no value
upload_max_filesize => 2M => 2M
upload_tmp_dir => no value => no value
user_dir => no value => no value
variables_order => no value => no value
xmlrpc_error_number => 0 => 0
xmlrpc_errors => Off => Off
y2k_compliance => On => On
ctype
ctype functions => enabled
mysql
MySQL Support => enabled
Active Persistent Links => 0
Active Links => 0
Client API version => 3.23.49
MYSQL_MODULE_TYPE => builtin
MYSQL_SOCKET => /tmp/mysql.sock
MYSQL_INCLUDE =>
MYSQL_LIBS =>
Directive => Local Value => Master Value
mysql.allow_persistent => On => On
mysql.connect_timeout => 60 => 60
mysql.default_host => no value => no value
mysql.default_password => no value => no value
mysql.default_port => no value => no value
mysql.default_socket => no value => no value
mysql.default_user => no value => no value
mysql.max_links => Unlimited => Unlimited
mysql.max_persistent => Unlimited => Unlimited
mysql.trace_mode => Off => Off
overload
User-Space Object Overloading Support => enabled
pcre
PCRE (Perl Compatible Regular Expressions) Support => enabled
PCRE Library Version => 4.3 21-May-2003
posix
Revision => $Revision: 1.51.2.2 $
session
Session Support => enabled
Registered save handlers => files user
Directive => Local Value => Master Value
session.auto_start => Off => Off
session.bug_compat_42 => On => On
session.bug_compat_warn => On => On
session.cache_expire => 180 => 180
session.cache_limiter => nocache => nocache
session.cookie_domain => no value => no value
session.cookie_lifetime => 0 => 0
session.cookie_path => / => /
session.cookie_secure => Off => Off
session.entropy_file => no value => no value
session.entropy_length => 0 => 0
session.gc_divisor => 100 => 100
session.gc_maxlifetime => 1440 => 1440
session.gc_probability => 1 => 1
session.name => PHPSESSID => PHPSESSID
session.referer_check => no value => no value
session.save_handler => files => files
session.save_path => /tmp => /tmp
session.serialize_handler => php => php
session.use_cookies => On => On
session.use_only_cookies => Off => Off
session.use_trans_sid => Off => Off
standard
Regex Library => Bundled library enabled
Dynamic Library Support => enabled
Path to sendmail => /usr/sbin/sendmail -t -i
Directive => Local Value => Master Value
assert.active => 1 => 1
assert.bail => 0 => 0
assert.callback => no value => no value
assert.quiet_eval => 0 => 0
assert.warning => 1 => 1
auto_detect_line_endings => 0 => 0
default_socket_timeout => 60 => 60
safe_mode_allowed_env_vars => PHP_ => PHP_
safe_mode_protected_env_vars => LD_LIBRARY_PATH => LD_LIBRARY_PATH
url_rewriter.tags => a=href,area=href,frame=src,form=,fieldset= =>
a=href,area=href,frame=src,form=,fieldset=
user_agent => no value => no value
tokenizer
Tokenizer Support => enabled
xml
XML Support => active
XML Namespace Support => active
EXPAT Version => 1.95.6
Additional Modules
Module Name
Environment
Variable => Value
_ => /junk/jws/php/work/php-4.3.4/sapi/cli/php
ESCDELAY => 3900
LANG => en_US
RNINIT => -e -m -S -q
LOGIN => jws
PAGER => /usr/local/bin/less
QUERY_STRING =>
SSH_TTY => /dev/pts/0
PATH =>
/home/clerk/u76/jws/.bin:/usr/site/rcd-admin/bin:/usr/local/bin:/usr/bin:/usr/sbin:/usr/bin/X11:/opt/freeware/bin:/usr/site/rcd/bin:/usr/ucb:/usr/unsup/bin:/usr/etc:/usr/local/etc:/usr/local/X11:/opt/ports/bin
SCRIPT_FILENAME =>
CONTENT_TYPE =>
NAME => Jeff W. Stewart
LC__FASTMSG => true
SSH_AUTH_SOCK => /tmp/ssh-NhF11394/agent.11394
EDITOR => /usr/bin/vi
LOGNAME => jws
REDIRECT_STATUS =>
MAIL => /usr/spool/mail/jws
LOCPATH => /usr/lib/nls/loc
REQUEST_METHOD =>
USER => jws
PATH_TRANSLATED =>
AUTHSTATE => compat
CC => cc
CONTENT_LENGTH =>
TEST_PHP_EXECUTABLE => /junk/jws/php/work/php-4.3.4/sapi/cli/php
SHELL => /bin/sh
ODMDIR => /etc/objrepos
HOME => /home/clerk/u76/jws
FCEDIT => /usr/bin/vi
TEST_PHP_SRCDIR => /junk/jws/php/work/php-4.3.4
TERM => xterm
MAILMSG => [You have new mail]
PWD => /junk/jws/php/work/php-4.3.4
TZ => EST5
ENV => /home/clerk/u76/jws/.kshrc
LESS => -qesc
PREVIEWER => -full
A__z => ! LOGNAME
NLSPATH => /usr/lib/nls/msg/%L/%N:/usr/lib/nls/msg/%L/%N.cat
PHP Variables
Variable => Value
_SERVER["_"] => /junk/jws/php/work/php-4.3.4/sapi/cli/php
_SERVER["ESCDELAY"] => 3900
_SERVER["LANG"] => en_US
_SERVER["LOGIN"] => jws
_SERVER["PAGER"] => /usr/local/bin/less
_SERVER["QUERY_STRING"] =>
_SERVER["SSH_TTY"] => /dev/pts/0
_SERVER["PATH"] =>
/home/clerk/u76/jws/.bin:/usr/site/rcd-admin/bin:/usr/local/bin:/usr/bin:/usr/sbin:/usr/bin/X11:/opt/freeware/bin:/usr/site/rcd/bin:/usr/ucb:/usr/unsup/bin:/usr/etc:/usr/local/etc:/usr/local/X11:/opt/ports/bin
_SERVER["SCRIPT_FILENAME"] =>
_SERVER["CONTENT_TYPE"] =>
_SERVER["NAME"] => Jeff W. Stewart
_SERVER["LC__FASTMSG"] => true
_SERVER["EDITOR"] => /usr/bin/vi
_SERVER["HISTFILE"] => /home/clerk/u76/jws/.sh_10646
_SERVER["LOGNAME"] => jws
_SERVER["REDIRECT_STATUS"] =>
_SERVER["MAIL"] => /usr/spool/mail/jws
_SERVER["LOCPATH"] => /usr/lib/nls/loc
_SERVER["REQUEST_METHOD"] =>
_SERVER["USER"] => jws
_SERVER["PATH_TRANSLATED"] =>
_SERVER["AUTHSTATE"] => compat
_SERVER["CC"] => cc
_SERVER["CONTENT_LENGTH"] =>
_SERVER["TEST_PHP_EXECUTABLE"] => /junk/jws/php/work/php-4.3.4/sapi/cli/php
_SERVER["SHELL"] => /bin/sh
_SERVER["ODMDIR"] => /etc/objrepos
_SERVER["HOME"] => /home/clerk/u76/jws
_SERVER["FCEDIT"] => /usr/bin/vi
_SERVER["TEST_PHP_SRCDIR"] => /junk/jws/php/work/php-4.3.4
_SERVER["TERM"] => xterm
_SERVER["MAILMSG"] => [You have new mail]
_SERVER["PWD"] => /junk/jws/php/work/php-4.3.4
_SERVER["TZ"] => EST5
_SERVER["ENV"] => /home/clerk/u76/jws/.kshrc
_SERVER["LESS"] => -qesc
_SERVER["A__z"] => ! LOGNAME
_SERVER["NLSPATH"] => /usr/lib/nls/msg/%L/%N:/usr/lib/nls/msg/%L/%N.cat
_SERVER["PHP_SELF"] =>
_SERVER["SCRIPT_NAME"] =>
_SERVER["DOCUMENT_ROOT"] =>
_SERVER["argv"] => Array
(
)
_SERVER["argc"] => 0
_ENV["_"] => /junk/jws/php/work/php-4.3.4/sapi/cli/php
_ENV["ESCDELAY"] => 3900
_ENV["LANG"] => en_US
_ENV["LOGIN"] => jws
_ENV["PAGER"] => /usr/local/bin/less
_ENV["QUERY_STRING"] =>
_ENV["SSH_TTY"] => /dev/pts/0
_ENV["PATH"] =>
/home/clerk/u76/jws/.bin:/usr/site/rcd-admin/bin:/usr/local/bin:/usr/bin:/usr/sbin:/usr/bin/X11:/opt/freeware/bin:/usr/site/rcd/bin:/usr/ucb:/usr/unsup/bin:/usr/etc:/usr/local/etc:/usr/local/X11:/opt/ports/bin
_ENV["SCRIPT_FILENAME"] =>
_ENV["CONTENT_TYPE"] =>
_ENV["NAME"] => Jeff W. Stewart
_ENV["LC__FASTMSG"] => true
_ENV["SSH_AUTH_SOCK"] => /tmp/ssh-NhF11394/agent.11394
_ENV["EDITOR"] => /usr/bin/vi
_ENV["HISTFILE"] => /home/clerk/u76/jws/.sh_10646
_ENV["LOGNAME"] => jws
_ENV["REDIRECT_STATUS"] =>
_ENV["MAIL"] => /usr/spool/mail/jws
_ENV["LOCPATH"] => /usr/lib/nls/loc
_ENV["REQUEST_METHOD"] =>
_ENV["USER"] => jws
_ENV["PATH_TRANSLATED"] =>
_ENV["AUTHSTATE"] => compat
_ENV["CC"] => cc
_ENV["CONTENT_LENGTH"] =>
_ENV["TEST_PHP_EXECUTABLE"] => /junk/jws/php/work/php-4.3.4/sapi/cli/php
_ENV["SHELL"] => /bin/sh
_ENV["ODMDIR"] => /etc/objrepos
_ENV["HOME"] => /home/clerk/u76/jws
_ENV["FCEDIT"] => /usr/bin/vi
_ENV["TEST_PHP_SRCDIR"] => /junk/jws/php/work/php-4.3.4
_ENV["TERM"] => xterm
_ENV["MAILMSG"] => [You have new mail]
_ENV["PWD"] => /junk/jws/php/work/php-4.3.4
_ENV["TZ"] => EST5
_ENV["ENV"] => /home/clerk/u76/jws/.kshrc
_ENV["LESS"] => -qesc
_ENV["A__z"] => ! LOGNAME
_ENV["NLSPATH"] => /usr/lib/nls/msg/%L/%N:/usr/lib/nls/msg/%L/%N.cat
PHP License
This program is free software; you can redistribute it and/or modify
it under the terms of the PHP License as published by the PHP Group
and included in the distribution in the file: LICENSE
This program is distributed in the hope that it will be useful,
but WITHOUT ANY WARRANTY; without even the implied warranty of
MERCHANTABILITY or FITNESS FOR A PARTICULAR PURPOSE.
If you did not receive a copy of the PHP license, or have any
questions about PHP licensing, please contact license@php.net.