PHP Test Results

From: Date: Sat, 07 Feb 2004 00:29:03 +0000
Subject: PHP Test Results
Groups: php.qa 
Request: Send a blank email to php-qa+get-15934@lists.php.net to get a copy of this message
Chris Gotstein chris@gotstein.com ------------------------------------------- SpamNet - help others stop spam immediately www.cloudmark.com ------------------------------------------- "Software engineering today is a race between programmers striving to build bigger and better idiot-proof programs, and the Universe striving to build bigger and better idiots. So far, the Universe is winning."

===================================================================== FAILED TEST SUMMARY --------------------------------------------------------------------- Bug #22592 (cascading assignments to strings with curly braces broken) [tests/lang/bug22592.phpt] Bug #24773 (unset() of integers treated as arrays causes a crash) [tests/lang/bug24773.phpt] Bug #24783 ($key not binary safe in "foreach($arr as $key => $val)") [tests/lang/bug24783.phpt] Bug #25547 (error_handler and array index with function call) [tests/lang/bug25547.phpt] Gettext basic test [ext/gettext/tests/gettext_basic.phpt] Bug #16069 [ext/iconv/tests/bug16069.phpt] OpenSSL private key functions [ext/openssl/tests/001.phpt] openssl: get public key from generated private key [ext/openssl/tests/bug25614.phpt] Check for mktime with out-of-range parameters [ext/standard/tests/time/003.phpt] mktime() [ext/standard/tests/time/mktime.phpt] wddx deserialization test [ext/wddx/tests/001.phpt] xslt_set_object function [ext/xslt/tests/xslt_set_object.phpt] ===================================================================== ===================================================================== TEST RESULT SUMMARY --------------------------------------------------------------------- Exts skipped : 61 Exts tested : 27 --------------------------------------------------------------------- Number of tests : 557 Tests skipped : 129 (23.2%) Tests warned : 0 ( 0.0%) Tests failed : 12 ( 2.2%) Tests passed : 416 (74.7%) --------------------------------------------------------------------- Time taken : 258 seconds ===================================================================== ================================================================================ /usr/local/src/php-4.3.5RC2/tests/lang/bug22592.phpt ================================================================================ ---- EXPECTED OUTPUT string(5) "* *-*" string(7) "* *-* *" string(7) "*4*-* *" string(7) "*4*s* *" string(8) "*4*s* *0" string(8) "*-*-* *0" string(8) "*-*s*s*0" string(8) "4-4s4s*0" string(9) "4-4s4s505" string(9) "454s4s505" string(1) "-" string(6) "string" int(4) int(5) string(1) "5" [Illegal string offset: -1] ---- ACTUAL OUTPUT string(5) "* *-*" string(7) "* *-* *" string(7) "*4*-* *" string(7) "*4*s* *" string(8) "*4*s* *0" string(8) "**-* *0" string(8) "***s*0" string(8) "4s*0" string(9) "4s05" string(9) "4s05" NULL NULL NULL NULL NULL [Illegal string offset: -1] ---- FAILED ================================================================================ 006- string(8) "*-*-* *0" 006+ string(8) "**-* *0" 007- string(8) "*-*s*s*0" 007+ string(8) "***s*0" 008- string(8) "4-4s4s*0" 008+ string(8) "4s*0" 009- string(9) "4-4s4s505" 009+ string(9) "4s05" 010- string(9) "454s4s505" 010+ string(9) "4s05" 011- string(1) "-" 011+ NULL 012- string(6) "string" 012+ NULL 013- int(4) 013+ NULL 014- int(5) 014+ NULL 015- string(1) "5" 015+ NULL ================================================================================ ================================================================================ /usr/local/src/php-4.3.5RC2/tests/lang/bug24773.phpt ================================================================================ ---- EXPECTED OUTPUT Fatal error: Cannot unset string offsets in %s on line %d ---- ACTUAL OUTPUT Segmentation fault (core dumped) ---- FAILED ================================================================================ 001- Fatal error: Cannot unset string offsets in %s on line %d 001+ Segmentation fault (core dumped) ================================================================================ ================================================================================ /usr/local/src/php-4.3.5RC2/tests/lang/bug24783.phpt ================================================================================ ---- EXPECTED OUTPUT 7: foo%00bar => foo%00bar ---- ACTUAL OUTPUT 3: foo => foo%00bar ---- FAILED ================================================================================ 001- 7: foo%00bar => foo%00bar 001+ 3: foo => foo%00bar ================================================================================ ================================================================================ /usr/local/src/php-4.3.5RC2/tests/lang/bug25547.phpt ================================================================================ ---- EXPECTED OUTPUT handler(Undefined index: foo) Array ( [foo] => 1 ) Done ---- ACTUAL OUTPUT handler(Undefined index: foo) Array ( [(o] => 1 ) Done ---- FAILED ================================================================================ 004- [foo] => 1 004+ [(o] => 1 ================================================================================ ================================================================================ /usr/local/src/php-4.3.5RC2/ext/gettext/tests/gettext_basic.phpt ================================================================================ ---- EXPECTED OUTPUT Perustesti Perustesti ---- ACTUAL OUTPUT Basic test Basic test ---- FAILED ================================================================================ 001- Perustesti 001+ Basic test 002- Perustesti 002+ Basic test ================================================================================ ================================================================================ /usr/local/src/php-4.3.5RC2/ext/iconv/tests/bug16069.phpt ================================================================================ ---- EXPECTED OUTPUT ¥ß¥ê¥Ð¡¼¥ë¥ß¥ê¥Ð¡¼¥ë¥ß¥ê¥Ð¡¼¥ë¥ß¥ê¥Ð¡¼¥ë¥ß¥ê¥Ð¡¼¥ë¥ß¥ê¥Ð¡¼¥ë¥ß¥ê¥Ð¡¼¥ë¥ß¥ê¥Ð¡¼¥ë¥ß¥ê¥Ð¡¼¥ë¥ß¥ê¥Ð¡¼¥ë¥ß¥ê¥Ð¡¼¥ë¥ß¥ê¥Ð¡¼¥ë¥ß¥ê¥Ð¡¼¥ë¥ß¥ê¥Ð¡¼¥ë¥ß¥ê¥Ð¡¼¥ë¥ß¥ê¥Ð¡¼¥ë¥ß¥ê¥Ð¡¼¥ë¥ß¥ê¥Ð¡¼¥ë¥ß¥ê¥Ð¡¼¥ë¥ß¥ê¥Ð¡¼¥ë¥ß¥ê¥Ð¡¼¥ë¥ß¥ê¥Ð¡¼¥ë¥ß¥ê¥Ð¡¼¥ë¥ß¥ê¥Ð¡¼¥ë¥ß¥ê¥Ð¡¼¥ë¥ß¥ê¥Ð¡¼¥ë¥ß¥ê¥Ð¡¼¥ë¥ß¥ê¥Ð¡¼¥ë¥ß¥ê¥Ð¡¼¥ë¥ß¥ê¥Ð¡¼¥ë¥ß¥ê¥Ð¡¼¥ë¥ß¥ê¥Ð¡¼¥ë¥ß¥ê¥Ð¡¼¥ë¥ß¥ê¥Ð¡¼¥ë¥ß¥ê¥Ð¡¼¥ë¥ß¥ê¥Ð¡¼¥ë¥ß¥ê¥Ð¡¼¥ë¥ß¥ê¥Ð¡¼¥ë¥ß¥ê¥Ð¡¼¥ë¥ß¥ê¥Ð¡¼¥ë(¡ë§¥¡ë) ---- ACTUAL OUTPUT (¡ë§¥¡ë) ---- FAILED ================================================================================ 001- ¥ß¥ê¥Ð¡¼¥ë¥ß¥ê¥Ð¡¼¥ë¥ß¥ê¥Ð¡¼¥ë¥ß¥ê¥Ð¡¼¥ë¥ß¥ê¥Ð¡¼¥ë¥ß¥ê¥Ð¡¼¥ë¥ß¥ê¥Ð¡¼¥ë¥ß¥ê¥Ð¡¼¥ë¥ß¥ê¥Ð¡¼¥ë¥ß¥ê¥Ð¡¼¥ë¥ß¥ê¥Ð¡¼¥ë¥ß¥ê¥Ð¡¼¥ë¥ß¥ê¥Ð¡¼¥ë¥ß¥ê¥Ð¡¼¥ë¥ß¥ê¥Ð¡¼¥ë¥ß¥ê¥Ð¡¼¥ë¥ß¥ê¥Ð¡¼¥ë¥ß¥ê¥Ð¡¼¥ë¥ß¥ê¥Ð¡¼¥ë¥ß¥ê¥Ð¡¼¥ë¥ß¥ê¥Ð¡¼¥ë¥ß¥ê¥Ð¡¼¥ë¥ß¥ê¥Ð¡¼¥ë¥ß¥ê¥Ð¡¼¥ë¥ß¥ê¥Ð¡¼¥ë¥ß¥ê¥Ð¡¼¥ë¥ß¥ê¥Ð¡¼¥ë¥ß¥ê¥Ð¡¼¥ë¥ß¥ê¥Ð¡¼¥ë¥ß¥ê¥Ð¡¼¥ë¥ß¥ê¥Ð¡¼¥ë¥ß¥ê¥Ð¡¼¥ë¥ß¥ê¥Ð¡¼¥ë¥ß¥ê¥Ð¡¼¥ë¥ß¥ê¥Ð¡¼¥ë¥ß¥ê¥Ð¡¼¥ë¥ß¥ê¥Ð¡¼¥ë¥ß¥ê¥Ð¡¼¥ë¥ß¥ê¥Ð¡¼¥ë¥ß¥ê¥Ð¡¼¥ë(¡ë§¥¡ë) 001+ (¡ë§¥¡ë) ================================================================================ ================================================================================ /usr/local/src/php-4.3.5RC2/ext/openssl/tests/001.phpt ================================================================================ ---- EXPECTED OUTPUT Creating private key Export key to file Load key from file - array syntax Load key using direct syntax Load key manually and use string syntax OK! ---- ACTUAL OUTPUT Creating private key failed to create private key ---- FAILED ================================================================================ 002- Export key to file 002+ failed to create private key 003- Load key from file - array syntax 004- Load key using direct syntax 005- Load key manually and use string syntax 006- OK! ================================================================================ ================================================================================ /usr/local/src/php-4.3.5RC2/ext/openssl/tests/bug25614.phpt ================================================================================ ---- EXPECTED OUTPUT Warning: openssl_pkey_get_public(): Don't know how to get public key from this private key (the documentation lied) %s ---- ACTUAL OUTPUT ---- FAILED ================================================================================ 001- Warning: openssl_pkey_get_public(): Don't know how to get public key from this private key (the documentation lied) %s 001+ ================================================================================ ================================================================================ /usr/local/src/php-4.3.5RC2/ext/standard/tests/time/003.phpt ================================================================================ ---- EXPECTED OUTPUT 2000-02-29 2000-02-28 2000-02-29 2001-02-28 2001-03-01 1999-11-30 2000-05-29 12:00:00 2000-05-29 13:00:00 2000-05-29 12:00:00 2000-01-31 12:00:00 2000-01-31 12:00:00 2000-01-31 11:00:00 2000-04-29 12:00:00 2000-04-29 13:00:00 2000-04-29 12:00:00 ---- ACTUAL OUTPUT 2000-02-29 2000-02-28 2000-02-29 2001-02-28 2001-03-01 1999-11-30 2000-05-29 12:00:00 2000-05-29 07:00:00 2000-05-29 12:00:00 2000-01-31 12:00:00 2000-01-31 06:00:00 2000-01-31 11:00:00 2000-04-29 12:00:00 2000-04-29 07:00:00 2000-04-29 12:00:00 ---- FAILED ================================================================================ 008- 2000-05-29 13:00:00 008+ 2000-05-29 07:00:00 011- 2000-01-31 12:00:00 011+ 2000-01-31 06:00:00 014- 2000-04-29 13:00:00 014+ 2000-04-29 07:00:00 ================================================================================ ================================================================================ /usr/local/src/php-4.3.5RC2/ext/standard/tests/time/mktime.phpt ================================================================================ ---- EXPECTED OUTPUT int(1009843200) int(1009843200) int(1009843200) int(1009843200) int(1025481600) int(1025481600) int(1025481600) int(1025481600) int(1009839600) int(1009839600) int(1009839600) int(1009836000) int(1025474400) int(1025474400) int(1025478000) int(1025474400) ---- ACTUAL OUTPUT int(1009843200) int(1009843200) int(1009843200) int(-3662) int(1025481600) int(1025481600) int(1025481600) int(-3662) int(1009839600) int(1009839600) int(1009839600) int(1009857600) int(1025474400) int(1025474400) int(1025456400) int(1025474400) ---- FAILED ================================================================================ 004- int(1009843200) 004+ int(-3662) 008- int(1025481600) 008+ int(-3662) 012- int(1009836000) 012+ int(1009857600) 015- int(1025478000) 015+ int(1025456400) ================================================================================ ================================================================================ /usr/local/src/php-4.3.5RC2/ext/wddx/tests/001.phpt ================================================================================ ---- EXPECTED OUTPUT array(11) { ["aNull"]=> NULL ["aString"]=> string(8) "a string" ["aNumber"]=> float(-12.456) ["aDateTime"]=> int(897600732) ["aDateTime2"]=> int(329607132) ["aDateTime3"]=> string(19) "2040-06-12T04:32:12" ["aBoolean"]=> bool(true) ["anArray"]=> array(2) { [0]=> int(10) [1]=> string(14) "second element" } ["aBinary"]=> string(11) "binary data" ["anObject"]=> array(2) { ["s"]=> string(8) "a string" ["n"]=> float(-12.456) } ["aRecordset"]=> array(2) { ["NAME"]=> array(2) { [0]=> string(8) "John Doe" [1]=> string(8) "Jane Doe" } ["AGE"]=> array(2) { [0]=> int(34) [1]=> int(31) } } } ---- ACTUAL OUTPUT array(11) { ["aNull"]=> NULL ["aString"]=> string(8) "a string" ["aNumber"]=> float(-12.456) ["aDateTime"]=> int(897651132) ["aDateTime2"]=> int(329657532) ["aDateTime3"]=> string(19) "2040-06-12T04:32:12" ["aBoolean"]=> bool(true) ["anArray"]=> array(2) { [0]=> int(10) [1]=> string(14) "second element" } ["aBinary"]=> string(11) "binary data" ["anObject"]=> array(2) { ["s"]=> string(8) "a string" ["n"]=> float(-12.456) } ["aRecordset"]=> array(2) { ["NAME"]=> array(2) { [0]=> string(8) "John Doe" [1]=> string(8) "Jane Doe" } ["AGE"]=> array(2) { [0]=> int(34) [1]=> int(31) } } } ---- FAILED ================================================================================ 009- int(897600732) 009+ int(897651132) 011- int(329607132) 011+ int(329657532) ================================================================================ ================================================================================ /usr/local/src/php-4.3.5RC2/ext/xslt/tests/xslt_set_object.phpt ================================================================================ ---- EXPECTED OUTPUT OK OK ---- ACTUAL OUTPUT Warning: Sablotron error on line 1: XML parser error 4: not well-formed (invalid token) in /usr/local/src/php-4.3.5RC2/ext/xslt/tests/xslt_set_object.php on line 19 Warning: Sablotron error on line 1: XML parser error 4: not well-formed (invalid token) in /usr/local/src/php-4.3.5RC2/ext/xslt/tests/xslt_set_object.php on line 30 OK OK ---- FAILED ================================================================================ 001- OK 001+ Warning: Sablotron error on line 1: XML parser error 4: not well-formed (invalid token) in /usr/local/src/php-4.3.5RC2/ext/xslt/tests/xslt_set_object.php on line 19 002- OK 002+ 003+ Warning: Sablotron error on line 1: XML parser error 4: not well-formed (invalid token) in /usr/local/src/php-4.3.5RC2/ext/xslt/tests/xslt_set_object.php on line 30 004+ OK 005+ OK ================================================================================ ================================================================================ BUILD ENVIRONMENT ================================================================================ OS: FreeBSD - FreeBSD www.gotstein.org 5.2-RELEASE FreeBSD 5.2-RELEASE #0: Sun Jan 11 04:21:45 GMT 2004 root@wv1u.btc.adaptec.com:/usr/obj/usr/src/sys/GENERIC i386 Automake: Autoconf: Libtool: ltmain.sh (GNU libtool) 1.4.3 (1.922.2.110 2002/10/23 01:39:54) Compiler: Using built-in specs. Configured with: FreeBSD/i386 system compiler Thread model: posix gcc version 3.3.3 [FreeBSD] 20031106 Bison: bison (GNU Bison) 1.875 Written by Robert Corbett and Richard Stallman. Copyright (C) 2002 Free Software Foundation, Inc. This is free software; see the source for copying conditions. There is NO warranty; not even for MERCHANTABILITY or FITNESS FOR A PARTICULAR PURPOSE. Libraries: /usr/local/src/php-4.3.5RC2/sapi/cli/php: libcrypt.so.2 => /lib/libcrypt.so.2 (0x28361000) libsablot.so.70 => /usr/local/lib/libsablot.so.70 (0x2837a000) libstdc++.so.4 => /usr/lib/libstdc++.so.4 (0x2843c000) libexpat.so.4 => /usr/local/lib/libexpat.so.4 (0x284f8000) libpdf.so.6 => /usr/local/lib/libpdf.so.6 (0x28518000) libz.so.2 => /lib/libz.so.2 (0x285db000) libtiff.so.4 => /usr/local/lib/libtiff.so.4 (0x285e9000) libpng.so.5 => /usr/local/lib/libpng.so.5 (0x28636000) libjpeg.so.9 => /usr/local/lib/libjpeg.so.9 (0x2865b000) libmysqlclient.so.14 => /usr/local/lib/mysql/libmysqlclient.so.14 (0x28679000) libming.so.3 => /usr/local/lib/libming.so.3 (0x286ae000) libm.so.2 => /lib/libm.so.2 (0x286e4000) libintl.so.6 => /usr/local/lib/libintl.so.6 (0x286fd000) libt1.so.5 => /usr/local/lib/libt1.so.5 (0x28706000) libfreetype.so.9 => /usr/local/lib/libfreetype.so.9 (0x28756000) libX11.so.6 => /usr/X11R6/lib/libX11.so.6 (0x287c0000) libXpm.so.4 => /usr/X11R6/lib/libXpm.so.4 (0x28888000) libxml2.so.5 => /usr/local/lib/libxml2.so.5 (0x28897000) libxslt.so.2 => /usr/local/lib/libxslt.so.2 (0x28985000) libcurl.so.2 => /usr/local/lib/libcurl.so.2 (0x289b4000) libbz2.so.1 => /usr/lib/libbz2.so.1 (0x289de000) libssl.so.3 => /usr/local/lib/libssl.so.3 (0x289ed000) libcrypto.so.3 => /usr/local/lib/libcrypto.so.3 (0x28a1e000) libiconv.so.3 => /usr/local/lib/libiconv.so.3 (0x28b24000) libnetsnmp.so.6 => /usr/local/lib/libnetsnmp.so.6 (0x28c13000) libkvm.so.2 => /lib/libkvm.so.2 (0x28c9c000) libdevstat.so.4 => /lib/libdevstat.so.4 (0x28ca2000) libc.so.5 => /lib/libc.so.5 (0x28ca7000) libssl.so.3 => /usr/lib/libssl.so.3 (0x28d81000) libcrypto.so.3 => /lib/libcrypto.so.3 (0x28db3000) ================================================================================ PHPINFO ================================================================================ phpinfo() PHP Version => 4.3.5RC2 System => FreeBSD www.gotstein.org 5.2-RELEASE FreeBSD 5.2-RELEASE #0: Sun Jan 11 04:21:45 GMT 2004 root@wv1u.btc.adaptec.com:/usr/obj/usr/src/sys/GENERIC i386 Build Date => Feb 6 2004 18:09:37 Configure Command => './configure' '--with-apxs2=/usr/local/apache2/bin/apxs' '--enable-fastcgi' '--with-openssl' '--with-zlib' '--with-bz2' '--enable-calendar' '--with-curl' '--with-dom' '--with-dom-xslt' '--enable-exif' '--enable-ftp' '--with-gd' '--enable-gd-native-ttf' '--with-jpeg-dir=/usr/local' '--with-png-dir=/usr/local' '--with-ttf=/usr/local' '--with-freetype-dir=/usr/local' '--with-tiff-dir=/usr/local' '--with-t1lib=/usr/local' '--with-xpm-dir' '--with-gettext' '--with-iconv' '--enable-mbstring' '--with-ming' '--with-mysql=/usr/local' '--with-pdflib=/usr/local' '--enable-xslt' '--with-xslt-sablot' '--with-pear' '--enable-wddx' '--with-snmp' '--with-tsrm-pth' Server API => Command Line Interface Virtual Directory Support => disabled Configuration File (php.ini) Path => /usr/local/Zend/etc/php.ini PHP API => 20020918 PHP Extension => 20020429 Zend Extension => 20021010 Debug Build => no Thread Safety => disabled Registered PHP Streams => php, http, ftp, https, ftps, compress.bzip2, compress.zlib This program makes use of the Zend Scripting Language Engine: Zend Engine v1.3.0, Copyright (c) 1998-2004 Zend Technologies with Zend Extension Manager v1.0.0, Copyright (c) 2003, by Zend Technologies with Zend Optimizer v2.1.0, Copyright (c) 1998-2003, by Zend Technologies _______________________________________________________________________ Configuration PHP Core Directive => Local Value => Master Value allow_call_time_pass_reference => On => On allow_url_fopen => On => On always_populate_raw_post_data => Off => Off arg_separator.input => & => & arg_separator.output => & => & asp_tags => Off => Off auto_append_file => no value => no value auto_prepend_file => no value => no value browscap => no value => no value default_charset => no value => no value default_mimetype => text/html => text/html define_syslog_variables => Off => Off disable_classes => no value => no value disable_functions => no value => no value display_errors => On => On display_startup_errors => Off => Off doc_root => no value => no value docref_ext => no value => no value docref_root => no value => no value enable_dl => On => On error_append_string => no value => no value error_log => no value => no value error_prepend_string => no value => no value error_reporting => 2039 => 2039 expose_php => On => On extension_dir => ./ => ./ file_uploads => On => On gpc_order => GPC => GPC highlight.bg => #FFFFFF => #FFFFFF highlight.comment => #FF8000 => #FF8000 highlight.default => #0000BB => #0000BB highlight.html => #000000 => #000000 highlight.keyword => #007700 => #007700 highlight.string => #DD0000 => #DD0000 html_errors => On => On ignore_repeated_errors => Off => Off ignore_repeated_source => Off => Off ignore_user_abort => Off => Off implicit_flush => Off => Off include_path => .:/usr/local/lib/php => .:/usr/local/lib/php log_errors => Off => Off log_errors_max_len => 1024 => 1024 magic_quotes_gpc => Off => Off magic_quotes_runtime => Off => Off magic_quotes_sybase => Off => Off max_execution_time => 30 => 30 max_input_time => 60 => 60 open_basedir => no value => no value output_buffering => no value => no value output_handler => no value => no value post_max_size => 8M => 8M precision => 12 => 12 register_argc_argv => On => On register_globals => Off => Off report_memleaks => On => On safe_mode => Off => Off safe_mode_exec_dir => no value => no value safe_mode_gid => Off => Off safe_mode_include_dir => no value => no value sendmail_from => no value => no value sendmail_path => /usr/sbin/sendmail -t -i => /usr/sbin/sendmail -t -i serialize_precision => 100 => 100 short_open_tag => On => On SMTP => localhost => localhost smtp_port => 25 => 25 sql.safe_mode => Off => Off track_errors => Off => Off unserialize_callback_func => no value => no value upload_max_filesize => 2M => 2M upload_tmp_dir => /tmp => /tmp user_dir => no value => no value variables_order => EGPCS => EGPCS xmlrpc_error_number => 0 => 0 xmlrpc_errors => Off => Off y2k_compliance => On => On Zend Optimizer Optimization Pass 1 => enabled Optimization Pass 2 => enabled Optimization Pass 3 => enabled Optimization Pass 9 => disabled Optimization Pass 10 => disabled Zend Loader => enabled License Path => bz2 BZip2 Support => Enabled BZip2 Version => 1.0.2, 30-Dec-2001 calendar Calendar support => enabled ctype ctype functions => enabled curl CURL support => enabled CURL Information => libcurl/7.10.8 OpenSSL/0.9.7c ipv6 zlib/1.1.4 domxml DOM/XML => enabled DOM/XML API Version => 20020815 libxml Version => 20605 HTML Support => enabled XPath Support => enabled XPointer Support => enabled DOM/XSLT => enabled libxslt Version => 1.1.2 libxslt compiled against libxml Version => 2.6.4 exif EXIF Support => enabled EXIF Version => 1.4 $Id: exif.c,v 1.118.2.27 2003/12/17 09:08:37 helly Exp $ Supported EXIF Version => 0220 Supported filetypes => JPEG,TIFF ftp FTP support => enabled gd GD Support => enabled GD Version => bundled (2.0.17 compatible) FreeType Support => enabled FreeType Linkage => with freetype T1Lib Support => enabled GIF Read Support => enabled JPG Support => enabled PNG Support => enabled WBMP Support => enabled XBM Support => enabled gettext GetText Support => enabled iconv iconv support => enabled iconv implementation => unknown iconv library version => unknown Directive => Local Value => Master Value iconv.input_encoding => ISO-8859-1 => ISO-8859-1 iconv.internal_encoding => ISO-8859-1 => ISO-8859-1 iconv.output_encoding => ISO-8859-1 => ISO-8859-1 mbstring Multibyte Support => enabled Japanese support => enabled Simplified chinese support => enabled Traditional chinese support => enabled Korean support => enabled Russian support => enabled Multibyte (japanese) regex support => enabled mbstring extension makes use of "streamable kanji code filter and converter", which is distributed under the GNU Lesser General Public License version 2.1. Directive => Local Value => Master Value mbstring.detect_order => no value => no value mbstring.encoding_translation => Off => Off mbstring.func_overload => 0 => 0 mbstring.http_input => pass => pass mbstring.http_output => pass => pass mbstring.internal_encoding => ISO-8859-1 => no value mbstring.language => neutral => neutral mbstring.substitute_character => no value => no value ming Ming SWF output library => enabled Version => 0.2a mysql MySQL Support => enabled Active Persistent Links => 0 Active Links => 0 Client API version => 4.1.1-alpha MYSQL_MODULE_TYPE => external MYSQL_SOCKET => /tmp/mysql.sock MYSQL_INCLUDE => -I/usr/local/include/mysql MYSQL_LIBS => -L/usr/local/lib/mysql -lmysqlclient Directive => Local Value => Master Value mysql.allow_persistent => On => On mysql.connect_timeout => 60 => 60 mysql.default_host => no value => no value mysql.default_password => no value => no value mysql.default_port => no value => no value mysql.default_socket => no value => no value mysql.default_user => no value => no value mysql.max_links => Unlimited => Unlimited mysql.max_persistent => Unlimited => Unlimited mysql.trace_mode => Off => Off openssl OpenSSL support => enabled OpenSSL Version => OpenSSL 0.9.7c 30 Sep 2003 overload User-Space Object Overloading Support => enabled pcre PCRE (Perl Compatible Regular Expressions) Support => enabled PCRE Library Version => 4.5 01-December-2003 pdf PDF Support => enabled PDFlib GmbH Version => 5.0.3 Revision => $Revision: 1.112.2.7 $ posix Revision => $Revision: 1.51.2.2 $ session Session Support => enabled Registered save handlers => files user Directive => Local Value => Master Value session.auto_start => Off => Off session.bug_compat_42 => On => On session.bug_compat_warn => On => On session.cache_expire => 180 => 180 session.cache_limiter => nocache => nocache session.cookie_domain => no value => no value session.cookie_lifetime => 0 => 0 session.cookie_path => / => / session.cookie_secure => Off => Off session.entropy_file => no value => no value session.entropy_length => 0 => 0 session.gc_divisor => 100 => 100 session.gc_maxlifetime => 1440 => 1440 session.gc_probability => 1 => 1 session.name => PHPSESSID => PHPSESSID session.referer_check => no value => no value session.save_handler => files => files session.save_path => /tmp => /tmp session.serialize_handler => php => php session.use_cookies => On => On session.use_only_cookies => Off => Off session.use_trans_sid => Off => Off snmp NET-SNMP Support => enabled NET-SNMP Version => 5.1 standard Regex Library => Bundled library enabled Dynamic Library Support => enabled Path to sendmail => /usr/sbin/sendmail -t -i Directive => Local Value => Master Value assert.active => 1 => 1 assert.bail => 0 => 0 assert.callback => no value => no value assert.quiet_eval => 0 => 0 assert.warning => 1 => 1 auto_detect_line_endings => 0 => 0 default_socket_timeout => 60 => 60 safe_mode_allowed_env_vars => PHP_ => PHP_ safe_mode_protected_env_vars => LD_LIBRARY_PATH => LD_LIBRARY_PATH url_rewriter.tags => a=href,area=href,frame=src,input=src,form=,fieldset= => a=href,area=href,frame=src,input=src,form=,fieldset= user_agent => no value => no value tokenizer Tokenizer Support => enabled wddx WDDX Support => enabled WDDX Session Serializer => enabled xml XML Support => active XML Namespace Support => active EXPAT Version => 1.95.6 xslt XSLT support => enabled Backend => Sablotron Sablotron Version => 1.0 Sablotron Information => Cflags: -O -pipe -mcpu=pentiumpro Libs: -L/usr/local/lib -liconv -lexpat Prefix: /usr/local zlib ZLib Support => enabled Compiled Version => 1.1.4 Linked Version => 1.1.4 Directive => Local Value => Master Value zlib.output_compression => Off => Off zlib.output_compression_level => -1 => -1 zlib.output_handler => no value => no value Additional Modules Module Name Environment Variable => Value CONTENT_TYPE => SSH_CLIENT => 192.168.1.28 4724 22 USER => cgotstein MACHTYPE => i386 MAIL => /var/mail/cgotstein VENDOR => intel SHLVL => 1 QUERY_STRING => HOME => /root TEST_PHP_SRCDIR => /usr/local/src/php-4.3.5RC2 SSH_TTY => /dev/ttyp0 PAGER => more CONTENT_LENGTH => ENV => /home/cgotstein/.shrc SCRIPT_FILENAME => PATH_TRANSLATED => GROUP => wheel LOGNAME => cgotstein TEST_PHP_EXECUTABLE => /usr/local/src/php-4.3.5RC2/sapi/cli/php BLOCKSIZE => K TERM => vt100 PATH => /sbin:/bin:/usr/sbin:/usr/bin:/usr/games:/usr/local/sbin:/usr/local/bin:/usr/X11R6/bin:/root/bin REMOTEHOST => dell.gotstein.org SSH_AUTH_SOCK => /tmp/ssh-OnrQKtrn/agent.25592 SHELL => /bin/csh HOST => www.gotstein.org REDIRECT_STATUS => __MKLVL__ => 1 REQUEST_METHOD => OSTYPE => FreeBSD PWD => /usr/local/src/php-4.3.5RC2 SSH_CONNECTION => 192.168.1.28 4724 192.168.1.3 22 FTP_PASSIVE_MODE => YES CC => gcc HOSTTYPE => FreeBSD EDITOR => vi PHP Variables Variable => Value _SERVER["CONTENT_TYPE"] => _SERVER["SSH_CLIENT"] => 192.168.1.28 4724 22 _SERVER["USER"] => cgotstein _SERVER["MACHTYPE"] => i386 _SERVER["MAIL"] => /var/mail/cgotstein _SERVER["VENDOR"] => intel _SERVER["SHLVL"] => 1 _SERVER["QUERY_STRING"] => _SERVER["HOME"] => /root _SERVER["TEST_PHP_SRCDIR"] => /usr/local/src/php-4.3.5RC2 _SERVER["SSH_TTY"] => /dev/ttyp0 _SERVER["PAGER"] => more _SERVER["CONTENT_LENGTH"] => _SERVER["ENV"] => /home/cgotstein/.shrc _SERVER["SCRIPT_FILENAME"] => _SERVER["PATH_TRANSLATED"] => _SERVER["GROUP"] => wheel _SERVER["LOGNAME"] => cgotstein _SERVER["TEST_PHP_EXECUTABLE"] => /usr/local/src/php-4.3.5RC2/sapi/cli/php _SERVER["BLOCKSIZE"] => K _SERVER["TERM"] => vt100 _SERVER["PATH"] => /sbin:/bin:/usr/sbin:/usr/bin:/usr/games:/usr/local/sbin:/usr/local/bin:/usr/X11R6/bin:/root/bin _SERVER["REMOTEHOST"] => dell.gotstein.org _SERVER["SSH_AUTH_SOCK"] => /tmp/ssh-OnrQKtrn/agent.25592 _SERVER["SHELL"] => /bin/csh _SERVER["HOST"] => www.gotstein.org _SERVER["REDIRECT_STATUS"] => _SERVER["__MKLVL__"] => 1 _SERVER["REQUEST_METHOD"] => _SERVER["OSTYPE"] => FreeBSD _SERVER["PWD"] => /usr/local/src/php-4.3.5RC2 _SERVER["SSH_CONNECTION"] => 192.168.1.28 4724 192.168.1.3 22 _SERVER["FTP_PASSIVE_MODE"] => YES _SERVER["CC"] => gcc _SERVER["HOSTTYPE"] => FreeBSD _SERVER["EDITOR"] => vi _SERVER["PHP_SELF"] => _SERVER["SCRIPT_NAME"] => _SERVER["DOCUMENT_ROOT"] => _SERVER["argv"] => Array ( ) _SERVER["argc"] => 0 _ENV["CONTENT_TYPE"] => _ENV["SSH_CLIENT"] => 192.168.1.28 4724 22 _ENV["USER"] => cgotstein _ENV["MACHTYPE"] => i386 _ENV["MAIL"] => /var/mail/cgotstein _ENV["VENDOR"] => intel _ENV["SHLVL"] => 1 _ENV["QUERY_STRING"] => _ENV["HOME"] => /root _ENV["TEST_PHP_SRCDIR"] => /usr/local/src/php-4.3.5RC2 _ENV["SSH_TTY"] => /dev/ttyp0 _ENV["PAGER"] => more _ENV["CONTENT_LENGTH"] => _ENV["ENV"] => /home/cgotstein/.shrc _ENV["SCRIPT_FILENAME"] => _ENV["PATH_TRANSLATED"] => _ENV["GROUP"] => wheel _ENV["LOGNAME"] => cgotstein _ENV["TEST_PHP_EXECUTABLE"] => /usr/local/src/php-4.3.5RC2/sapi/cli/php _ENV["BLOCKSIZE"] => K _ENV["TERM"] => vt100 _ENV["PATH"] => /sbin:/bin:/usr/sbin:/usr/bin:/usr/games:/usr/local/sbin:/usr/local/bin:/usr/X11R6/bin:/root/bin _ENV["REMOTEHOST"] => dell.gotstein.org _ENV["SSH_AUTH_SOCK"] => /tmp/ssh-OnrQKtrn/agent.25592 _ENV["SHELL"] => /bin/csh _ENV["HOST"] => www.gotstein.org _ENV["REDIRECT_STATUS"] => _ENV["__MKLVL__"] => 1 _ENV["REQUEST_METHOD"] => _ENV["OSTYPE"] => FreeBSD _ENV["PWD"] => /usr/local/src/php-4.3.5RC2 _ENV["SSH_CONNECTION"] => 192.168.1.28 4724 192.168.1.3 22 _ENV["FTP_PASSIVE_MODE"] => YES _ENV["CC"] => gcc _ENV["HOSTTYPE"] => FreeBSD _ENV["EDITOR"] => vi PHP License This program is free software; you can redistribute it and/or modify it under the terms of the PHP License as published by the PHP Group and included in the distribution in the file: LICENSE This program is distributed in the hope that it will be useful, but WITHOUT ANY WARRANTY; without even the implied warranty of MERCHANTABILITY or FITNESS FOR A PARTICULAR PURPOSE. If you did not receive a copy of the PHP license, or have any questions about PHP licensing, please contact license@php.net.
« previous php.qa (#15934) next »