php4.3.5RC3 build on Suse Linux 9.0

From: Date: Wed, 18 Feb 2004 07:40:42 +0000
Subject: php4.3.5RC3 build on Suse Linux 9.0
Groups: php.qa 
Request: Send a blank email to php-qa+get-15978@lists.php.net to get a copy of this message
===================================================================== FAILED TEST SUMMARY --------------------------------------------------------------------- Bug #25547 (error_handler and array index with function call) [tests/lang/ bug25547.phpt] Bug #26384 (domxslt->process causes segfault with xsl:key) [ext/domxml/tests/ bug26384.phpt] wddx deserialization test [ext/wddx/tests/001.phpt] ===================================================================== ===================================================================== TEST RESULT SUMMARY --------------------------------------------------------------------- Exts skipped : 54 Exts tested : 33 --------------------------------------------------------------------- Number of tests : 578 Tests skipped : 130 (22.5%) Tests warned : 0 ( 0.0%) Tests failed : 3 ( 0.5%) Tests passed : 445 (77.0%) --------------------------------------------------------------------- Time taken : 457 seconds ===================================================================== ================================================================================ /tmp/php-4.3.5RC3/tests/lang/bug25547.phpt ================================================================================ ---- EXPECTED OUTPUT handler(Undefined index: foo) Array ( [foo] => 1 ) Done ---- ACTUAL OUTPUT handler(Undefined index: foo) Array ( [( o] => 1 ) Done ---- FAILED ================================================================================ 004- [foo] => 1 004+ [( o] => 1 ================================================================================ ================================================================================ /tmp/php-4.3.5RC3/ext/domxml/tests/bug26384.phpt ================================================================================ ---- EXPECTED OUTPUT Object ---- ACTUAL OUTPUT Fatal error: Call to undefined function: domxml_xslt_stylesheet_file() in / tmp/php-4.3.5RC3/ext/domxml/tests/bug26384.php on line 3 ---- FAILED ================================================================================ 001- Object 001+ Fatal error: Call to undefined function: domxml_xslt_stylesheet_file() in /tmp/php-4.3.5RC3/ext/domxml/tests/bug26384.php on line 3 ================================================================================ ================================================================================ /tmp/php-4.3.5RC3/ext/wddx/tests/001.phpt ================================================================================ ---- EXPECTED OUTPUT array(11) { ["aNull"]=> NULL ["aString"]=> string(8) "a string" ["aNumber"]=> float(-12.456) ["aDateTime"]=> int(897600732) ["aDateTime2"]=> int(329607132) ["aDateTime3"]=> string(19) "2040-06-12T04:32:12" ["aBoolean"]=> bool(true) ["anArray"]=> array(2) { [0]=> int(10) [1]=> string(14) "second element" } ["aBinary"]=> string(11) "binary data" ["anObject"]=> array(2) { ["s"]=> string(8) "a string" ["n"]=> float(-12.456) } ["aRecordset"]=> array(2) { ["NAME"]=> array(2) { [0]=> string(8) "John Doe" [1]=> string(8) "Jane Doe" } ["AGE"]=> array(2) { [0]=> int(34) [1]=> int(31) } } } ---- ACTUAL OUTPUT array(11) { ["aNull"]=> NULL ["aString"]=> string(8) "a string" ["aNumber"]=> float(-12.456) ["aDateTime"]=> int(897651132) ["aDateTime2"]=> int(329657532) ["aDateTime3"]=> string(19) "2040-06-12T04:32:12" ["aBoolean"]=> bool(true) ["anArray"]=> array(2) { [0]=> int(10) [1]=> string(14) "second element" } ["aBinary"]=> string(11) "binary data" ["anObject"]=> array(2) { ["s"]=> string(8) "a string" ["n"]=> float(-12.456) } ["aRecordset"]=> array(2) { ["NAME"]=> array(2) { [0]=> string(8) "John Doe" [1]=> string(8) "Jane Doe" } ["AGE"]=> array(2) { [0]=> int(34) [1]=> int(31) } } } ---- FAILED ================================================================================ 009- int(897600732) 009+ int(897651132) 011- int(329607132) 011+ int(329657532) ================================================================================ -- Peter Prochaska P551 Internet / E-Security Systeme, DATEV eG /(bb|[^b]{2})/ (Shakespeare)

« previous php.qa (#15978) next »