Test results for 5.0.3 [failed]

From: Date: Sun, 09 Jan 2005 17:06:21 +0000
Subject: Test results for 5.0.3 [failed]
Groups: php.qa 
Request: Send a blank email to php-qa+get-22827@lists.php.net to get a copy of this message
===================================================================== FAILED TEST SUMMARY --------------------------------------------------------------------- Test for buffering in core functions with implicit flush off [tests/func/008.phpt] Convert warnings to exceptions [tests/lang/038.phpt] Bug #22836 (returning references to NULL) [Zend/tests/bug22836.phpt] Bug #28444 (Cannot access undefined property for object with overloaded property access) [Zend/tests/bug28444.phpt] Test 3: Exception Test [ext/dom/tests/dom003.phpt] Bug #24155 (gdImageRotate270 rotation problem). [ext/gd/tests/bug24155.phpt] gdimagefill() function (Bug #19366 (fixed in bundled libgd)) [ext/gd/tests/bug27582_1.phpt] iconv stream filter [ext/iconv/tests/iconv_stream_filter.phpt] HTML input/output [ext/mbstring/tests/htmlent.phpt] mb_output_handler() (Shift_JIS) [ext/mbstring/tests/mb_output_handler_shift_jis.phpt] Bug #29992 (foreach by reference corrupts the array) [ext/standard/tests/array/bug29992.phpt] Bug #24142 (round() problems) [ext/standard/tests/math/bug24142.phpt] Bug #25694 (round() and number_format() inconsistency) [ext/standard/tests/math/bug25694.phpt] Bug #20382 (strtotime ("Monday", $date) produces wrong result on DST changeover) [ext/standard/tests/time/bug20382.phpt] wddx deserialization test [ext/wddx/tests/001.phpt] Bug #26614 (CDATA sections skipped on line count) [ext/xml/tests/bug26614.phpt] ===================================================================== ===================================================================== TEST RESULT SUMMARY --------------------------------------------------------------------- Exts skipped : 51 Exts tested : 32 --------------------------------------------------------------------- Number of tests : 1291 734 Tests skipped : 557 (43.1%) -------- Tests warned : 0 (0.0%) (0.0%) Tests failed : 16 (1.2%) (2.2%) Tests passed : 718 (55.6%) (97.8%) --------------------------------------------------------------------- Time taken : 46 seconds ===================================================================== ===================================================================== FAILED TEST SUMMARY --------------------------------------------------------------------- Test for buffering in core functions with implicit flush off [tests/func/008.phpt] Convert warnings to exceptions [tests/lang/038.phpt] Bug #22836 (returning references to NULL) [Zend/tests/bug22836.phpt] Bug #28444 (Cannot access undefined property for object with overloaded property access) [Zend/tests/bug28444.phpt] Test 3: Exception Test [ext/dom/tests/dom003.phpt] Bug #24155 (gdImageRotate270 rotation problem). [ext/gd/tests/bug24155.phpt] gdimagefill() function (Bug #19366 (fixed in bundled libgd)) [ext/gd/tests/bug27582_1.phpt] iconv stream filter [ext/iconv/tests/iconv_stream_filter.phpt] HTML input/output [ext/mbstring/tests/htmlent.phpt] mb_output_handler() (Shift_JIS) [ext/mbstring/tests/mb_output_handler_shift_jis.phpt] Bug #29992 (foreach by reference corrupts the array) [ext/standard/tests/array/bug29992.phpt] Bug #24142 (round() problems) [ext/standard/tests/math/bug24142.phpt] Bug #25694 (round() and number_format() inconsistency) [ext/standard/tests/math/bug25694.phpt] Bug #20382 (strtotime ("Monday", $date) produces wrong result on DST changeover) [ext/standard/tests/time/bug20382.phpt] wddx deserialization test [ext/wddx/tests/001.phpt] Bug #26614 (CDATA sections skipped on line count) [ext/xml/tests/bug26614.phpt] ===================================================================== ================================================================================ /root/php-5.0.3/tests/func/008.phpt ================================================================================ ---- EXPECTED OUTPUT 'foo1' 'foo2' ---- ACTUAL OUTPUT ---- FAILED ================================================================================ 001- 'foo1' 003- 'foo2' ================================================================================ ================================================================================ /root/php-5.0.3/tests/lang/038.phpt ================================================================================ ---- EXPECTED OUTPUT string(15) "Error2Exception" string(5) "fopen" ===DONE=== ---- ACTUAL OUTPUT string(15) "Error2Exception" string(15) "Error2Exception" ===DONE=== ---- FAILED ================================================================================ 002+ string(15) "Error2Exception" 002- string(5) "fopen" ================================================================================ ================================================================================ /root/php-5.0.3/Zend/tests/bug22836.phpt ================================================================================ ---- EXPECTED OUTPUT string(3) "foo" 'foo' Notice: Undefined variable: a in %s on line %d Strict Standards: Only variable references should be returned by reference in %s on line %d string(3) "foo" 'foo' Notice: Undefined variable: a in %s on line %d Strict Standards: Only variable references should be returned by reference in %s on line %d string(3) "foo" 'foo' Notice: Undefined variable: a in %s on line %d Strict Standards: Only variable references should be returned by reference in %s on line %d string(3) "foo" 'foo' Notice: Undefined variable: a in %s on line %d Strict Standards: Only variable references should be returned by reference in %s on line %d string(3) "foo" 'foo' Notice: Undefined variable: a in %s on line %d Strict Standards: Only variable references should be returned by reference in %s on line %d string(3) "foo" 'foo' Notice: Undefined variable: a in %s on line %d Strict Standards: Only variable references should be returned by reference in %s on line %d string(3) "foo" 'foo' Notice: Undefined variable: a in %s on line %d Strict Standards: Only variable references should be returned by reference in %s on line %d string(3) "foo" 'foo' Notice: Undefined variable: a in %s on line %d Strict Standards: Only variable references should be returned by reference in %s on line %d string(3) "foo" 'foo' Notice: Undefined variable: a in %s on line %d Strict Standards: Only variable references should be returned by reference in %s on line %d ---- ACTUAL OUTPUT string(3) "foo" 'foo' Notice: Undefined variable: a in /root/php-5.0.3/Zend/tests/bug22836.php on line 7 Strict Standards: Only variable references should be returned by reference in /root/php-5.0.3/Zend/tests/bug22836.php on line 7 string(3) "foo" 'foo' Notice: Undefined variable: a in /root/php-5.0.3/Zend/tests/bug22836.php on line 7 Strict Standards: Only variable references should be returned by reference in /root/php-5.0.3/Zend/tests/bug22836.php on line 7 NULL 'foo' Notice: Undefined variable: a in /root/php-5.0.3/Zend/tests/bug22836.php on line 7 NULL 'foo' Notice: Undefined variable: a in /root/php-5.0.3/Zend/tests/bug22836.php on line 7 NULL 'foo' Notice: Undefined variable: a in /root/php-5.0.3/Zend/tests/bug22836.php on line 7 NULL 'foo' Notice: Undefined variable: a in /root/php-5.0.3/Zend/tests/bug22836.php on line 7 NULL 'foo' Notice: Undefined variable: a in /root/php-5.0.3/Zend/tests/bug22836.php on line 7 NULL 'foo' Notice: Undefined variable: a in /root/php-5.0.3/Zend/tests/bug22836.php on line 7 ---- FAILED ================================================================================ 013+ NULL 013- string(3) "foo" 017+ NULL 018+ 'foo' 018- Strict Standards: Only variable references should be returned by reference in %s on line %d 019- string(3) "foo" 020+ Notice: Undefined variable: a in /root/php-5.0.3/Zend/tests/bug22836.php on line 7 021+ NULL 022+ 'foo' 023+ 024+ Notice: Undefined variable: a in /root/php-5.0.3/Zend/tests/bug22836.php on line 7 025+ NULL 026+ 'foo' 027+ 028+ Notice: Undefined variable: a in /root/php-5.0.3/Zend/tests/bug22836.php on line 7 029+ NULL 030+ 'foo' 031+ 032+ Notice: Undefined variable: a in /root/php-5.0.3/Zend/tests/bug22836.php on line 7 033+ NULL 023- 024- Strict Standards: Only variable references should be returned by reference in %s on line %d 025- string(3) "foo" 026- 'foo' 027- 028- Notice: Undefined variable: a in %s on line %d 029- 030- Strict Standards: Only variable references should be returned by reference in %s on line %d 031- string(3) "foo" 032- 'foo' 033- 034- Notice: Undefined variable: a in %s on line %d 035- 036- Strict Standards: Only variable references should be returned by reference in %s on line %d 037- string(3) "foo" 038- 'foo' 039- 040- Notice: Undefined variable: a in %s on line %d 041- 042- Strict Standards: Only variable references should be returned by reference in %s on line %d 043- string(3) "foo" 044- 'foo' 045- 046- Notice: Undefined variable: a in %s on line %d 047- 048- Strict Standards: Only variable references should be returned by reference in %s on line %d 049- string(3) "foo" 050- 'foo' 051- 052- Notice: Undefined variable: a in %s on line %d 053- 054- Strict Standards: Only variable references should be returned by reference in %s on line %d ================================================================================ ================================================================================ /root/php-5.0.3/Zend/tests/bug28444.phpt ================================================================================ ---- EXPECTED OUTPUT object(Object)#%d (1) { ["x"]=> int(2) } int(2) int(3) Overloaded::__set(y,3) int(3) Overloaded::__get(y) int(3) Overloaded::__set(z,Object id #3) object(Object)#%d (1) { ["x"]=> int(4) } Overloaded::__get(z) int(4) Overloaded::__get(z) int(5) Overloaded::__get(z) int(6) ===DONE=== ---- ACTUAL OUTPUT object(Object)#2 (1) { ["x"]=> int(2) } int(2) int(3) Overloaded::__set(y,3) int(3) Overloaded::__get(y) int(3) Overloaded::__set(z,Object id #3) object(Object)#3 (1) { ["x"]=> int(4) } Overloaded::__get(z) int(4) Overloaded::__get(z) int(5) Fatal error: Cannot access undefined property for object with overloaded property access in /root/php-5.0.3/Zend/tests/bug28444.php on line 45 ---- FAILED ================================================================================ 020+ 021+ Fatal error: Cannot access undefined property for object with overloaded property access in /root/php-5.0.3/Zend/tests/bug28444.php on line 45 020- Overloaded::__get(z) 021- int(6) 022- ===DONE=== ================================================================================ ================================================================================ /root/php-5.0.3/ext/dom/tests/dom003.phpt ================================================================================ ---- EXPECTED OUTPUT --- Catch exception with try/catch object(DOMException)#%d (6) { ["message:protected"]=> string(23) "Hierarchy Request Error" ["string:private"]=> string(0) "" ["file:protected"]=> string(%d) "%s/ext/dom/tests/dom003.php" ["line:protected"]=> int(8) ["trace:private"]=> array(0) { } ["code"]=> int(3) } --- Don't catch exception with try/catch Fatal error: Uncaught exception 'DOMException' with message 'Hierarchy Request Error' in %sdom003.php:%d Stack trace: #0 {main} thrown in %sdom003.php on line %d ---- ACTUAL OUTPUT --- Catch exception with try/catch object(DOMException)#3 (6) { ["message:protected"]=> string(23) "Hierarchy Request Error" ["string:private"]=> string(0) "" ["file:protected"]=> string(40) "/root/php-5.0.3/ext/dom/tests/dom003.php" ["line:protected"]=> int(8) ["trace:private"]=> array(1) { [0]=> array(6) { ["file"]=> string(40) "/root/php-5.0.3/ext/dom/tests/dom003.php" ["line"]=> int(8) ["function"]=> string(11) "appendChild" ["class"]=> string(10) "DOMElement" ["type"]=> string(2) "->" ["args"]=> array(1) { [0]=> object(DOMElement)#2 (0) { } } } } ["code"]=> int(3) } --- Don't catch exception with try/catch Fatal error: Uncaught exception 'DOMException' with message 'Hierarchy Request Error' in /root/php-5.0.3/ext/dom/tests/dom003.php:13 Stack trace: #0 /root/php-5.0.3/ext/dom/tests/dom003.php(13): DOMElement->appendChild(Object(DOMElement)) #1 {main} thrown in /root/php-5.0.3/ext/dom/tests/dom003.php on line 13 ---- FAILED ================================================================================ 012+ array(1) { 013+ [0]=> 014+ array(6) { 015+ ["file"]=> 016+ string(40) "/root/php-5.0.3/ext/dom/tests/dom003.php" 017+ ["line"]=> 018+ int(8) 019+ ["function"]=> 020+ string(11) "appendChild" 021+ ["class"]=> 022+ string(10) "DOMElement" 012- array(0) { 013- } 014- ["code"]=> 015- int(3) 016- } 017- --- Don't catch exception with try/catch 018- 019- Fatal error: Uncaught exception 'DOMException' with message 'Hierarchy Request Error' in %sdom003.php:%d 020- Stack trace: 021- #0 {main} 022- thrown in %sdom003.php on line %d 023+ ["type"]=> 024+ string(2) "->" 025+ ["args"]=> 026+ array(1) { 027+ [0]=> 028+ object(DOMElement)#2 (0) { 029+ } 030+ } 031+ } 032+ } 033+ ["code"]=> 034+ int(3) 035+ } 036+ --- Don't catch exception with try/catch 037+ 038+ Fatal error: Uncaught exception 'DOMException' with message 'Hierarchy Request Error' in /root/php-5.0.3/ext/dom/tests/dom003.php:13 039+ Stack trace: 040+ #0 /root/php-5.0.3/ext/dom/tests/dom003.php(13): DOMElement->appendChild(Object(DOMElement)) 041+ #1 {main} 042+ thrown in /root/php-5.0.3/ext/dom/tests/dom003.php on line 13 ================================================================================ ================================================================================ /root/php-5.0.3/ext/gd/tests/bug24155.phpt ================================================================================ ---- EXPECTED OUTPUT cc867fd65c30883463ce58d0341f0997 ---- ACTUAL OUTPUT 409d70b5d493746acc2255c759d73436 ---- FAILED ================================================================================ 001+ 409d70b5d493746acc2255c759d73436 001- cc867fd65c30883463ce58d0341f0997 ================================================================================ ================================================================================ /root/php-5.0.3/ext/gd/tests/bug27582_1.phpt ================================================================================ ---- EXPECTED OUTPUT 08287f8f5d406946009df5f04ca83dc0 ---- ACTUAL OUTPUT b6d55b399e27b895a1fee8a137bb8470 ---- FAILED ================================================================================ 001+ b6d55b399e27b895a1fee8a137bb8470 001- 08287f8f5d406946009df5f04ca83dc0 ================================================================================ ================================================================================ /root/php-5.0.3/ext/iconv/tests/iconv_stream_filter.phpt ================================================================================ ---- EXPECTED OUTPUT string(20) "1b244224332473244b24" string(10) "41244f1b28" string(2) "42" string(20) "a4b3a4f3a4cba4c1a4cf" string(10) "69636f6e76" string(2) "0a" Warning: fread(): iconv stream filter ("ISO-2022-JP"=>"EUC-JP"): invalid multibyte sequence in %s on line %d string(0) "" string(0) "" string(0) "" ---- ACTUAL OUTPUT string(20) "1b244224332473244b24" string(10) "41244f1b28" string(2) "42" string(20) "a4b3a4f3a4cba4c1a4cf" string(10) "69636f6e76" string(2) "0a" string(20) "1b244f24332466245824" string(10) "4e24421b28" string(2) "4f" ---- FAILED ================================================================================ 007+ string(20) "1b244f24332466245824" 008+ string(10) "4e24421b28" 009+ string(2) "4f" 007- 008- Warning: fread(): iconv stream filter ("ISO-2022-JP"=>"EUC-JP"): invalid multibyte sequence in %s on line %d 009- string(0) "" 010- string(0) "" 011- string(0) "" ================================================================================ ================================================================================ /root/php-5.0.3/ext/mbstring/tests/htmlent.phpt ================================================================================ ---- EXPECTED OUTPUT HTML-ENTITIES>UTF-8>HTML-ENTITIES test='&&;&@AB&#128;&#129;&#130;&auml;&ouml;&uuml;&euro;&lang;&rang;' ---- ACTUAL OUTPUT ---- FAILED ================================================================================ 001+ 001- HTML-ENTITIES>UTF-8>HTML-ENTITIES 002- test='&&;&@AB&#128;&#129;&#130;&auml;&ouml;&uuml;&euro;&lang;&rang;' ================================================================================ ================================================================================ /root/php-5.0.3/ext/mbstring/tests/mb_output_handler_shift_jis.phpt ================================================================================ ---- EXPECTED OUTPUT string(73) "¥Æ¥¹¥ÈÍÑÆüËܸìʸ»úÎ󡣤³¤Î¥â¥¸¥å¡¼¥ë¤ÏPHP¤Ë¥Þ¥ë¥Á¥Ð¥¤¥È´Ø¿ô¤òÄ󶡤·¤Þ¤¹¡£" ---- ACTUAL OUTPUT ---- FAILED ================================================================================ 001+ 001- string(73) "¥Æ¥¹¥ÈÍÑÆüËܸìʸ»úÎ󡣤³¤Î¥â¥¸¥å¡¼¥ë¤ÏPHP¤Ë¥Þ¥ë¥Á¥Ð¥¤¥È´Ø¿ô¤òÄ󶡤·¤Þ¤¹¡£" ================================================================================ ================================================================================ /root/php-5.0.3/ext/standard/tests/array/bug29992.phpt ================================================================================ ---- EXPECTED OUTPUT Array ( [0] => 1 [1] => 2 [2] => 3 ) int(1) int(2) int(3) int(1) int(2) int(3) int(1) int(2) int(3) int(1) int(2) int(3) Array ( [0] => 1 [1] => 2 [2] => 3 ) ===DONE=== ---- ACTUAL OUTPUT Array ( [0] => 1 [1] => 2 [2] => 3 ) int(1) int(2) int(3) int(1) int(2) int(3) int(1) int(2) int(3) int(1) int(2) int(2) Array ( [0] => 1 [1] => 2 [2] => 2 ) ===DONE=== ---- FAILED ================================================================================ 018+ int(2) 018- int(3) 023+ [2] => 2 023- [2] => 3 ================================================================================ ================================================================================ /root/php-5.0.3/ext/standard/tests/math/bug24142.phpt ================================================================================ ---- EXPECTED OUTPUT round(0.005, 2) -> 0.01 round(0.015, 2) -> 0.02 round(0.025, 2) -> 0.03 round(0.035, 2) -> 0.04 round(0.045, 2) -> 0.05 round(0.055, 2) -> 0.06 round(0.065, 2) -> 0.07 round(0.075, 2) -> 0.08 round(0.085, 2) -> 0.09 ---- ACTUAL OUTPUT round(0.005, 2) -> 0.01 round(0.015, 2) -> 0.01 round(0.025, 2) -> 0.03 round(0.035, 2) -> 0.04 round(0.045, 2) -> 0.05 round(0.055, 2) -> 0.06 round(0.065, 2) -> 0.07 round(0.075, 2) -> 0.07 round(0.085, 2) -> 0.08 ---- FAILED ================================================================================ 002+ round(0.015, 2) -> 0.01 002- round(0.015, 2) -> 0.02 008+ round(0.075, 2) -> 0.07 009+ round(0.085, 2) -> 0.08 008- round(0.075, 2) -> 0.08 009- round(0.085, 2) -> 0.09 ================================================================================ ================================================================================ /root/php-5.0.3/ext/standard/tests/math/bug25694.phpt ================================================================================ ---- EXPECTED OUTPUT round 0.045 = 0.05 number format 0.045 = 0.05 round 0.055 = 0.06 number format 0.055 = 0.06 round 5.045 = 5.05 number format 5.045 = 5.05 round 5.055 = 5.06 number format 5.055 = 5.06 round 3.025 = 3.03 number format 3.025 = 3.03 round 4.025 = 4.03 number format 4.025 = 4.03 ---- ACTUAL OUTPUT round 0.045 = 0.04 number format 0.045 = 0.04 round 0.055 = 0.06 number format 0.055 = 0.06 round 5.045 = 5.04 number format 5.045 = 5.04 round 5.055 = 5.05 number format 5.055 = 5.05 round 3.025 = 3.02 number format 3.025 = 3.02 round 4.025 = 4.03 number format 4.025 = 4.03 ---- FAILED ================================================================================ 001+ round 0.045 = 0.04 002+ number format 0.045 = 0.04 001- round 0.045 = 0.05 002- number format 0.045 = 0.05 007+ round 5.045 = 5.04 008+ number format 5.045 = 5.04 009+ 010+ round 5.055 = 5.05 011+ number format 5.055 = 5.05 012+ 013+ round 3.025 = 3.02 014+ number format 3.025 = 3.02 007- round 5.045 = 5.05 008- number format 5.045 = 5.05 010- round 5.055 = 5.06 011- number format 5.055 = 5.06 012- 013- round 3.025 = 3.03 014- number format 3.025 = 3.03 015- ================================================================================ ================================================================================ /root/php-5.0.3/ext/standard/tests/time/bug20382.phpt ================================================================================ ---- EXPECTED OUTPUT tStamp=Wednesday 2004-10-27 17:17:17 CEST result=Monday 2004-11-01 00:00:00 CET wanted=Monday 2004-11-01 00:00:00 CET ---- ACTUAL OUTPUT tStamp=Wednesday 2004-10-27 17:17:17 CEST result=Sunday 2004-10-31 23:00:00 CET wanted=Monday 2004-11-01 00:00:00 CET ---- FAILED ================================================================================ 002+ result=Sunday 2004-10-31 23:00:00 CET 002- result=Monday 2004-11-01 00:00:00 CET ================================================================================ ================================================================================ /root/php-5.0.3/ext/wddx/tests/001.phpt ================================================================================ ---- EXPECTED OUTPUT array(11) { ["aNull"]=> NULL ["aString"]=> string(8) "a string" ["aNumber"]=> float(-12.456) ["aDateTime"]=> int(897625932) ["aDateTime2"]=> int(329632332) ["aDateTime3"]=> string(22) "2040-06-12T04:32:12+00" ["aBoolean"]=> bool(true) ["anArray"]=> array(2) { [0]=> int(10) [1]=> string(14) "second element" } ["aBinary"]=> string(11) "binary data" ["anObject"]=> array(2) { ["s"]=> string(8) "a string" ["n"]=> float(-12.456) } ["aRecordset"]=> array(2) { ["NAME"]=> array(2) { [0]=> string(8) "John Doe" [1]=> string(8) "Jane Doe" } ["AGE"]=> array(2) { [0]=> int(34) [1]=> int(31) } } } ---- ACTUAL OUTPUT array(11) { ["aNull"]=> NULL ["aString"]=> string(8) "a string" ["aNumber"]=> float(-12.456) ["aDateTime"]=> int(897625932) ["aDateTime2"]=> int(329632332) ["aDateTime3"]=> string(19) "2040-06-12T04:32:12" ["aBoolean"]=> bool(true) ["anArray"]=> array(2) { [0]=> int(10) [1]=> string(14) "second element" } ["aBinary"]=> string(11) "binary data" ["anObject"]=> array(2) { ["s"]=> string(8) "a string" ["n"]=> float(-12.456) } ["aRecordset"]=> array(2) { ["NAME"]=> array(2) { [0]=> string(8) "John Doe" [1]=> string(8) "Jane Doe" } ["AGE"]=> array(2) { [0]=> int(34) [1]=> int(31) } } } ---- FAILED ================================================================================ 013+ string(19) "2040-06-12T04:32:12" 013- string(22) "2040-06-12T04:32:12+00" ================================================================================ ================================================================================ /root/php-5.0.3/ext/xml/tests/bug26614.phpt ================================================================================ ---- EXPECTED OUTPUT CDATA <DATA> at line 2, col 0 (byte 45) </DATA> at line 9, col 0 (byte 90) Comment <DATA> at line 2, col 0 (byte 45) </DATA> at line 9, col 0 (byte 90) Text <DATA> at line 2, col 0 (byte 45) </DATA> at line 9, col 0 (byte 90) ---- ACTUAL OUTPUT CDATA <DATA> at line 2, col 6 (byte 9) </DATA> at line 9, col 7 (byte 56) Comment <DATA> at line 2, col 6 (byte 9) </DATA> at line 9, col 7 (byte 56) Text <DATA> at line 2, col 6 (byte 9) </DATA> at line 9, col 10 (byte 56) ---- FAILED ================================================================================ 002+ <DATA> at line 2, col 6 (byte 9) 003+ </DATA> at line 9, col 7 (byte 56) 002- <DATA> at line 2, col 0 (byte 45) 003- </DATA> at line 9, col 0 (byte 90) 005+ <DATA> at line 2, col 6 (byte 9) 006+ </DATA> at line 9, col 7 (byte 56) 005- <DATA> at line 2, col 0 (byte 45) 006- </DATA> at line 9, col 0 (byte 90) 008+ <DATA> at line 2, col 6 (byte 9) 009+ </DATA> at line 9, col 10 (byte 56) 008- <DATA> at line 2, col 0 (byte 45) 009- </DATA> at line 9, col 0 (byte 90) ================================================================================ ================================================================================ BUILD ENVIRONMENT ================================================================================ OS: Linux - Linux rouge.2037.org 2.6.9-1.724_FC3 #1 Sun Jan 2 15:43:49 EST 2005 i686 Automake: automake (GNU automake) 1.9.2 Written by Tom Tromey <tromey@redhat.com>. Copyright 2004 Free Software Foundation, Inc. This is free software; see the source for copying conditions. There is NO warranty; not even for MERCHANTABILITY or FITNESS FOR A PARTICULAR PURPOSE. Autoconf: autoconf (GNU Autoconf) 2.59 Written by David J. MacKenzie and Akim Demaille. Copyright (C) 2003 Free Software Foundation, Inc. This is free software; see the source for copying conditions. There is NO warranty; not even for MERCHANTABILITY or FITNESS FOR A PARTICULAR PURPOSE. Bundled Libtool: ltmain.sh (GNU libtool) 1.4.3 (1.922.2.110 2002/10/23 01:39:54) System Libtool: ltmain.sh (GNU libtool) 1.5.6 (1.1220.2.95 2004/04/11 05:50:42) Copyright (C) 2003 Free Software Foundation, Inc. This is free software; see the source for copying conditions. There is NO warranty; not even for MERCHANTABILITY or FITNESS FOR A PARTICULAR PURPOSE. Compiler: Lecture des spécification à partir de /usr/lib/gcc/i386-redhat-linux/3.4.2/specs Configuré avec: ../configure --prefix=/usr --mandir=/usr/share/man --infodir=/usr/share/info --enable-shared --enable-threads=posix --disable-checking --with-system-zlib --enable-__cxa_atexit --disable-libunwind-exceptions --enable-java-awt=gtk --host=i386-redhat-linux Modèle de thread: posix version gcc 3.4.2 20041017 (Red Hat 3.4.2-6.fc3) Bison: bison (GNU Bison) 1.875c Écrit par Robert Corbett et Richard Stallman. Copyright © 2003 Free Software Foundation, Inc. Ce logiciel est libre; voir les sources pour les conditions de reproduction. AUCUNE garantie n'est donnée; tant pour des raisons COMMERCIALES que pour RÉPONDRE À UN BESOIN PARTICULIER. Libraries: libcrypt.so.1 => /lib/libcrypt.so.1 (0x00212000) libmysqlclient.so.14 => /usr/lib/libmysqlclient.so.14 (0x00ee8000) libfreetype.so.6 => /usr/lib/libfreetype.so.6 (0x005aa000) libz.so.1 => /usr/lib/libz.so.1 (0x00b7e000) libpng12.so.0 => /usr/lib/libpng12.so.0 (0x00be4000) libjpeg.so.62 => /usr/lib/libjpeg.so.62 (0x00111000) libresolv.so.2 => /lib/libresolv.so.2 (0x0012f000) libm.so.6 => /lib/tls/libm.so.6 (0x00b59000) libdl.so.2 => /lib/libdl.so.2 (0x00b53000) libnsl.so.1 => /lib/libnsl.so.1 (0x00143000) libxml2.so.2 => /usr/lib/libxml2.so.2 (0x00240000) libpthread.so.0 => /lib/tls/libpthread.so.0 (0x00bd0000) libc.so.6 => /lib/tls/libc.so.6 (0x00a27000) libnss_files.so.2 => /lib/libnss_files.so.2 (0x00b90000) libnss_dns.so.2 => /lib/libnss_dns.so.2 (0x00bb6000) /lib/ld-linux.so.2 (0x00a0e000) User's E-mail: tech at 2037 dot org ================================================================================ PHPINFO ================================================================================ phpinfo() PHP Version => 5.0.3 System => Linux rouge.2037.org 2.6.9-1.724_FC3 #1 Sun Jan 2 15:43:49 EST 2005 i686 Build Date => Jan 9 2005 18:03:53 Configure Command => './configure' '--with-apxs2=/usr/local/apache/bin/apxs' '--with-gd' '--with-mysql=/usr' '--enable-track-vars' '--enable-bcmath' '--enable-calendar' '--enable-ftp' '--with-zlib' '--with-ttf' '--enable-magic-quotes' '--enable-sockets' '--with-pear' '--enable-trans-sid' '--enable-gd-native-ttf' '--with-regex=php' '--enable-dom' '--enable-dbx' '--enable-bcmatch' '--with-cdb' '--enable-ctype' '--enable-dba' '--enable-dbase' '--enable-exif' '--enable-filepro' '--with-gettext' '--with-iconv' '--enable-mbstring' '--enable-pcntl' '--with-pcre-regex' '--enable-posix' '--enable-session' '--enable-shmop' '--enable-wddx' '--enable-xml' '--enable-libxml' '--enable-sigchild' '--with-jpeg-dir' '--with-png-dir' '--with-freetype-dir' '--enable-simplexml' '--enable-imap' '--enable-imap-ssl' '--enable-openssl' '--enable-sysvsem' '--enable-sysvshm' '--enable-pcntl' Server API => Command Line Interface Virtual Directory Support => disabled Configuration File (php.ini) Path => /usr/local/lib PHP API => 20031224 PHP Extension => 20041030 Zend Extension => 220040412 Debug Build => no Thread Safety => disabled IPv6 Support => enabled Registered PHP Streams => php, file, http, ftp, compress.zlib Registered Stream Socket Transports => tcp, udp, unix, udg This program makes use of the Zend Scripting Language Engine: Zend Engine v2.0.3, Copyright (c) 1998-2004 Zend Technologies _______________________________________________________________________ Configuration PHP Core Directive => Local Value => Master Value allow_call_time_pass_reference => On => On allow_url_fopen => On => On always_populate_raw_post_data => Off => Off arg_separator.input => & => & arg_separator.output => & => & asp_tags => Off => Off auto_append_file => no value => no value auto_globals_jit => On => On auto_prepend_file => no value => no value browscap => no value => no value default_charset => no value => no value default_mimetype => text/html => text/html define_syslog_variables => Off => Off disable_classes => no value => no value disable_functions => no value => no value display_errors => On => On display_startup_errors => Off => Off doc_root => no value => no value docref_ext => no value => no value docref_root => no value => no value enable_dl => On => On error_append_string => no value => no value error_log => no value => no value error_prepend_string => no value => no value error_reporting => no value => no value expose_php => On => On extension_dir => /usr/local/lib/php/extensions/no-debug-non-zts-20041030 => /usr/local/lib/php/extensions/no-debug-non-zts-20041030 file_uploads => On => On highlight.bg => #FFFFFF => #FFFFFF highlight.comment => #FF8000 => #FF8000 highlight.default => #0000BB => #0000BB highlight.html => #000000 => #000000 highlight.keyword => #007700 => #007700 highlight.string => #DD0000 => #DD0000 html_errors => Off => On ignore_repeated_errors => Off => Off ignore_repeated_source => Off => Off ignore_user_abort => Off => Off implicit_flush => On => Off include_path => .:/usr/local/lib/php => .:/usr/local/lib/php log_errors => Off => Off log_errors_max_len => 1024 => 1024 magic_quotes_gpc => On => On magic_quotes_runtime => Off => Off magic_quotes_sybase => Off => Off mail.force_extra_parameters => no value => no value max_execution_time => 0 => 30 max_input_time => -1 => -1 open_basedir => no value => no value output_buffering => 0 => 0 output_handler => no value => no value post_max_size => 8M => 8M precision => 14 => 14 register_argc_argv => On => On register_globals => Off => Off register_long_arrays => On => On report_memleaks => On => On report_zend_debug => Off => Off safe_mode => Off => Off safe_mode_exec_dir => /usr/local/php/bin => /usr/local/php/bin safe_mode_gid => Off => Off safe_mode_include_dir => no value => no value sendmail_from => no value => no value sendmail_path => /usr/sbin/sendmail -t -i => /usr/sbin/sendmail -t -i serialize_precision => 100 => 100 short_open_tag => On => On SMTP => localhost => localhost smtp_port => 25 => 25 sql.safe_mode => Off => Off track_errors => Off => Off unserialize_callback_func => no value => no value upload_max_filesize => 2M => 2M upload_tmp_dir => no value => no value user_dir => no value => no value variables_order => EGPCS => EGPCS xmlrpc_error_number => 0 => 0 xmlrpc_errors => Off => Off y2k_compliance => On => On zend.ze1_compatibility_mode => Off => Off bcmath BCMath support => enabled calendar Calendar support => enabled ctype ctype functions => enabled dba DBA support => enabled Supported handlers => cdb cdb_make inifile flatfile dbx dbx support => enabled dbx version => 1.1.0 supported databases => MySQL ODBC PostgreSQL Microsoft SQL Server FrontBase Oracle 8 (oci8) Sybase-CT SQLite Directive => Local Value => Master Value dbx.colnames_case => unchanged => unchanged dom DOM/XML => enabled DOM/XML API Version => 20031129 libxml Version => 2.6.16 HTML Support => enabled XPath Support => enabled XPointer Support => enabled Schema Support => enabled RelaxNG Support => enabled exif EXIF Support => enabled EXIF Version => 1.4 $Id: exif.c,v 1.162.2.2 2004/11/10 01:44:28 iliaa Exp $ Supported EXIF Version => 0220 Supported filetypes => JPEG,TIFF ftp FTP support => enabled gd GD Support => enabled GD Version => bundled (2.0.28 compatible) FreeType Support => enabled FreeType Linkage => with freetype FreeType Version => 2.1.9 GIF Read Support => enabled GIF Create Support => enabled JPG Support => enabled PNG Support => enabled WBMP Support => enabled XBM Support => enabled gettext GetText Support => enabled iconv iconv support => enabled iconv implementation => glibc iconv library version => 2.3.4 Directive => Local Value => Master Value iconv.input_encoding => ISO-8859-1 => ISO-8859-1 iconv.internal_encoding => ISO-8859-1 => ISO-8859-1 iconv.output_encoding => ISO-8859-1 => ISO-8859-1 libxml libXML support => active libXML Version => 2.6.16 libXML streams => enabled mbstring Multibyte Support => enabled Multibyte string engine => libmbfl Multibyte (japanese) regex support => enabled Multibyte regex (oniguruma) version => 2.2.4 mbstring extension makes use of "streamable kanji code filter and converter", which is distributed under the GNU Lesser General Public License version 2.1. Directive => Local Value => Master Value mbstring.detect_order => no value => no value mbstring.encoding_translation => Off => Off mbstring.func_overload => 0 => 0 mbstring.http_input => pass => pass mbstring.http_output => pass => pass mbstring.internal_encoding => ISO-8859-1 => no value mbstring.language => neutral => neutral mbstring.substitute_character => no value => no value mysql MySQL Support => enabled Active Persistent Links => 0 Active Links => 0 Client API version => 4.1.8 MYSQL_MODULE_TYPE => external MYSQL_SOCKET => /var/lib/mysql/mysql.sock MYSQL_INCLUDE => -I/usr/include/mysql MYSQL_LIBS => -L/usr/lib -lmysqlclient Directive => Local Value => Master Value mysql.allow_persistent => On => On mysql.connect_timeout => 60 => 60 mysql.default_host => no value => no value mysql.default_password => no value => no value mysql.default_port => no value => no value mysql.default_socket => no value => no value mysql.default_user => no value => no value mysql.max_links => Unlimited => Unlimited mysql.max_persistent => Unlimited => Unlimited mysql.trace_mode => Off => Off pcntl pcntl support => enabled pcre PCRE (Perl Compatible Regular Expressions) Support => enabled PCRE Library Version => 4.5 01-December-2003 posix Revision => $Revision: 1.60 $ session Session Support => enabled Registered save handlers => files user sqlite Registered serializer handlers => php php_binary wddx Directive => Local Value => Master Value session.auto_start => Off => Off session.bug_compat_42 => On => On session.bug_compat_warn => On => On session.cache_expire => 180 => 180 session.cache_limiter => nocache => nocache session.cookie_domain => no value => no value session.cookie_lifetime => 0 => 0 session.cookie_path => / => / session.cookie_secure => Off => Off session.entropy_file => no value => no value session.entropy_length => 0 => 0 session.gc_divisor => 100 => 100 session.gc_maxlifetime => 1440 => 1440 session.gc_probability => 1 => 1 session.hash_bits_per_character => 4 => 4 session.hash_function => 0 => 0 session.name => PHPSESSID => PHPSESSID session.referer_check => no value => no value session.save_handler => files => files session.save_path => no value => no value session.serialize_handler => php => php session.use_cookies => On => On session.use_only_cookies => Off => Off session.use_trans_sid => 0 => 0 shmop shmop support => enabled SimpleXML Simplexml support => enabled Revision => $Revision: 1.139.2.4 $ Schema support => enabled sockets Sockets Support => enabled SPL SPL support => enabled Interfaces => RecursiveIterator, SeekableIterator Classes => ArrayObject, ArrayIterator, CachingIterator, CachingRecursiveIterator, DirectoryIterator, FilterIterator, LimitIterator, ParentIterator, RecursiveDirectoryIterator, RecursiveIteratorIterator, SimpleXMLIterator SQLite SQLite support => enabled PECL Module version => 2.0-dev $Id: sqlite.c,v 1.146.2.3 2004/09/26 01:41:40 wez Exp $ SQLite Library => 2.8.14 SQLite Encoding => iso8859 Directive => Local Value => Master Value sqlite.assoc_case => 0 => 0 standard Regex Library => Bundled library enabled Dynamic Library Support => enabled Path to sendmail => /usr/sbin/sendmail -t -i Directive => Local Value => Master Value assert.active => 1 => 1 assert.bail => 0 => 0 assert.callback => no value => no value assert.quiet_eval => 0 => 0 assert.warning => 1 => 1 auto_detect_line_endings => 0 => 0 date.default_latitude => 31.7667 => 31.7667 date.default_longitude => 35.2333 => 35.2333 date.sunrise_zenith => 90.83 => 90.83 date.sunset_zenith => 90.83 => 90.83 default_socket_timeout => 60 => 60 safe_mode_allowed_env_vars => PHP_ => PHP_ safe_mode_protected_env_vars => LD_LIBRARY_PATH => LD_LIBRARY_PATH url_rewriter.tags => a=href,area=href,frame=src,form=,fieldset= => a=href,area=href,frame=src,form=,fieldset= user_agent => no value => no value tokenizer Tokenizer Support => enabled wddx WDDX Support => enabled WDDX Session Serializer => enabled xml XML Support => active XML Namespace Support => active libxml2 Version => 2.6.16 zlib ZLib Support => enabled Compiled Version => 1.2.1.2 Linked Version => 1.2.1.2 Directive => Local Value => Master Value zlib.output_compression => Off => Off zlib.output_compression_level => -1 => -1 zlib.output_handler => no value => no value Additional Modules Module Name dbase filepro sysvsem sysvshm Environment Variable => Value HOSTNAME => rouge.2037.org TEST_PHP_SRCDIR => /root/php-5.0.3 SHELL => /bin/sh TERM => xterm MAKEFLAGS => HISTSIZE => 1000 SSH_CLIENT => deleted SSH_TTY => deleted USER => root LS_COLORS => no=00:fi=00:di=00;34:ln=00;36:pi=40;33:so=00;35:bd=40;33;01:cd=40;33;01:or=01;05;37;41:mi=01;05;37;41:ex=00;32:*.cmd=00;32:*.exe=00;32:*.com=00;32:*.btm=00;32:*.bat=00;32:*.sh=00;32:*.csh=00;32:*.tar=00;31:*.tgz=00;31:*.arj=00;31:*.taz=00;31:*.lzh=00;31:*.zip=00;31:*.z=00;31:*.Z=00;31:*.gz=00;31:*.bz2=00;31:*.bz=00;31:*.tz=00;31:*.rpm=00;31:*.cpio=00;31:*.jpg=00;35:*.gif=00;35:*.bmp=00;35:*.xbm=00;35:*.xpm=00;35:*.png=00;35:*.tif=00;35: SCRIPT_FILENAME => SSH_AUTH_SOCK => deleted MAKELEVEL => 1 MFLAGS => PATH => /usr/kerberos/sbin:/usr/kerberos/bin:/usr/local/sbin:/usr/local/bin:/sbin:/bin:/usr/sbin:/usr/bin:/usr/X11R6/bin:/root/bin MAIL => /var/spool/mail/root _ => /root/php-5.0.3/sapi/cli/php PWD => /root/php-5.0.3 INPUTRC => /etc/inputrc LANG => fr_FR TEST_PHP_EXECUTABLE => /root/php-5.0.3/sapi/cli/php REDIRECT_STATUS => PATH_TRANSLATED => HOME => /root SHLVL => 3 CONTENT_LENGTH => LOGNAME => root QUERY_STRING => SSH_CONNECTION => ::ffff:192.168.0.254 2117 ::ffff:192.168.0.25 22 LESSOPEN => |/usr/bin/lesspipe.sh %s CONTENT_TYPE => CC => gcc REQUEST_METHOD => G_BROKEN_FILENAMES => 1 PHP Variables Variable => Value _SERVER["HOSTNAME"] => rouge.2037.org _SERVER["TEST_PHP_SRCDIR"] => /root/php-5.0.3 _SERVER["SHELL"] => /bin/sh _SERVER["TERM"] => xterm _SERVER["MAKEFLAGS"] => _SERVER["HISTSIZE"] => 1000 _SERVER["SSH_CLIENT"] => deleted _SERVER["SSH_TTY"] => deleted _SERVER["USER"] => root _SERVER["LS_COLORS"] => no=00:fi=00:di=00;34:ln=00;36:pi=40;33:so=00;35:bd=40;33;01:cd=40;33;01:or=01;05;37;41:mi=01;05;37;41:ex=00;32:*.cmd=00;32:*.exe=00;32:*.com=00;32:*.btm=00;32:*.bat=00;32:*.sh=00;32:*.csh=00;32:*.tar=00;31:*.tgz=00;31:*.arj=00;31:*.taz=00;31:*.lzh=00;31:*.zip=00;31:*.z=00;31:*.Z=00;31:*.gz=00;31:*.bz2=00;31:*.bz=00;31:*.tz=00;31:*.rpm=00;31:*.cpio=00;31:*.jpg=00;35:*.gif=00;35:*.bmp=00;35:*.xbm=00;35:*.xpm=00;35:*.png=00;35:*.tif=00;35: _SERVER["SCRIPT_FILENAME"] => _SERVER["SSH_AUTH_SOCK"] => deleted _SERVER["MAKELEVEL"] => 1 _SERVER["MFLAGS"] => _SERVER["PATH"] => /usr/kerberos/sbin:/usr/kerberos/bin:/usr/local/sbin:/usr/local/bin:/sbin:/bin:/usr/sbin:/usr/bin:/usr/X11R6/bin:/root/bin _SERVER["MAIL"] => /var/spool/mail/root _SERVER["_"] => /root/php-5.0.3/sapi/cli/php _SERVER["PWD"] => /root/php-5.0.3 _SERVER["INPUTRC"] => /etc/inputrc _SERVER["LANG"] => fr_FR _SERVER["TEST_PHP_EXECUTABLE"] => /root/php-5.0.3/sapi/cli/php _SERVER["REDIRECT_STATUS"] => _SERVER["PATH_TRANSLATED"] => _SERVER["HOME"] => /root _SERVER["SHLVL"] => 3 _SERVER["CONTENT_LENGTH"] => _SERVER["LOGNAME"] => root _SERVER["QUERY_STRING"] => _SERVER["SSH_CONNECTION"] => ::ffff:192.168.0.254 2117 ::ffff:192.168.0.25 22 _SERVER["LESSOPEN"] => |/usr/bin/lesspipe.sh %s _SERVER["CONTENT_TYPE"] => _SERVER["CC"] => gcc _SERVER["REQUEST_METHOD"] => _SERVER["G_BROKEN_FILENAMES"] => 1 _SERVER["PHP_SELF"] => _SERVER["SCRIPT_NAME"] => _SERVER["DOCUMENT_ROOT"] => _SERVER["argv"] => Array ( ) _SERVER["argc"] => 0 _ENV["HOSTNAME"] => rouge.2037.org _ENV["TEST_PHP_SRCDIR"] => /root/php-5.0.3 _ENV["SHELL"] => /bin/sh _ENV["TERM"] => xterm _ENV["MAKEFLAGS"] => _ENV["HISTSIZE"] => 1000 _ENV["SSH_CLIENT"] => deleted _ENV["SSH_TTY"] => deleted _ENV["USER"] => root _ENV["LS_COLORS"] => no=00:fi=00:di=00;34:ln=00;36:pi=40;33:so=00;35:bd=40;33;01:cd=40;33;01:or=01;05;37;41:mi=01;05;37;41:ex=00;32:*.cmd=00;32:*.exe=00;32:*.com=00;32:*.btm=00;32:*.bat=00;32:*.sh=00;32:*.csh=00;32:*.tar=00;31:*.tgz=00;31:*.arj=00;31:*.taz=00;31:*.lzh=00;31:*.zip=00;31:*.z=00;31:*.Z=00;31:*.gz=00;31:*.bz2=00;31:*.bz=00;31:*.tz=00;31:*.rpm=00;31:*.cpio=00;31:*.jpg=00;35:*.gif=00;35:*.bmp=00;35:*.xbm=00;35:*.xpm=00;35:*.png=00;35:*.tif=00;35: _ENV["SCRIPT_FILENAME"] => _ENV["SSH_AUTH_SOCK"] => deleted _ENV["MAKELEVEL"] => 1 _ENV["MFLAGS"] => _ENV["PATH"] => /usr/kerberos/sbin:/usr/kerberos/bin:/usr/local/sbin:/usr/local/bin:/sbin:/bin:/usr/sbin:/usr/bin:/usr/X11R6/bin:/root/bin _ENV["MAIL"] => /var/spool/mail/root _ENV["_"] => /root/php-5.0.3/sapi/cli/php _ENV["PWD"] => /root/php-5.0.3 _ENV["INPUTRC"] => /etc/inputrc _ENV["LANG"] => fr_FR _ENV["TEST_PHP_EXECUTABLE"] => /root/php-5.0.3/sapi/cli/php _ENV["REDIRECT_STATUS"] => _ENV["PATH_TRANSLATED"] => _ENV["HOME"] => /root _ENV["SHLVL"] => 3 _ENV["CONTENT_LENGTH"] => _ENV["LOGNAME"] => root _ENV["QUERY_STRING"] => _ENV["SSH_CONNECTION"] => ::ffff:192.168.0.254 2117 ::ffff:192.168.0.25 22 _ENV["LESSOPEN"] => |/usr/bin/lesspipe.sh %s _ENV["CONTENT_TYPE"] => _ENV["CC"] => gcc _ENV["REQUEST_METHOD"] => _ENV["G_BROKEN_FILENAMES"] => 1 PHP License This program is free software; you can redistribute it and/or modify it under the terms of the PHP License as published by the PHP Group and included in the distribution in the file: LICENSE This program is distributed in the hope that it will be useful, but WITHOUT ANY WARRANTY; without even the implied warranty of MERCHANTABILITY or FITNESS FOR A PARTICULAR PURPOSE. If you did not receive a copy of the PHP license, or have any questions about PHP licensing, please contact license@php.net.

« previous php.qa (#22827) next »