Test results for 5.0.3 [failed]
| From: | noreply@php.net | Date: | Sun, 09 Jan 2005 23:51:30 +0000 |
| Subject: | Test results for 5.0.3 [failed] | ||
| Groups: | php.qa | ||
| Request: | Send a blank email to php-qa+get-22832@lists.php.net to get a copy of this message | ||
=====================================================================
FAILED TEST SUMMARY
---------------------------------------------------------------------
Test for buffering in core functions with implicit flush off [tests/func/008.phpt]
Convert warnings to exceptions [tests/lang/038.phpt]
Bug #22836 (returning references to NULL) [Zend/tests/bug22836.phpt]
Bug #28444 (Cannot access undefined property for object with overloaded property access)
[Zend/tests/bug28444.phpt]
DBA dba_popen Test [ext/dba/tests/dba009.phpt] (info: DB4 handler used)
Test 3: Exception Test [ext/dom/tests/dom003.phpt]
Bug #24155 (gdImageRotate270 rotation problem). [ext/gd/tests/bug24155.phpt]
gdimagefill() function (Bug #19366 (fixed in bundled libgd)) [ext/gd/tests/bug27582_1.phpt]
Bug #16069 [ext/iconv/tests/bug16069.phpt]
iconv stream filter [ext/iconv/tests/iconv_stream_filter.phpt]
HTML input/output [ext/mbstring/tests/htmlent.phpt]
mb_output_handler() (Shift_JIS) [ext/mbstring/tests/mb_output_handler_shift_jis.phpt]
Bug #29992 (foreach by reference corrupts the array) [ext/standard/tests/array/bug29992.phpt]
Bug #20382 (strtotime ("Monday", $date) produces wrong result on DST changeover)
[ext/standard/tests/time/bug20382.phpt]
wddx deserialization test [ext/wddx/tests/001.phpt]
Bug #26614 (CDATA sections skipped on line count) [ext/xml/tests/bug26614.phpt]
=====================================================================
=====================================================================
TEST RESULT SUMMARY
---------------------------------------------------------------------
Exts skipped : 45
Exts tested : 37
---------------------------------------------------------------------
Number of tests : 1291 917
Tests skipped : 374 (29.0%) --------
Tests warned : 0 (0.0%) (0.0%)
Tests failed : 16 (1.2%) (1.7%)
Tests passed : 901 (69.8%) (98.3%)
---------------------------------------------------------------------
Time taken : 231 seconds
=====================================================================
=====================================================================
FAILED TEST SUMMARY
---------------------------------------------------------------------
Test for buffering in core functions with implicit flush off [tests/func/008.phpt]
Convert warnings to exceptions [tests/lang/038.phpt]
Bug #22836 (returning references to NULL) [Zend/tests/bug22836.phpt]
Bug #28444 (Cannot access undefined property for object with overloaded property access)
[Zend/tests/bug28444.phpt]
DBA dba_popen Test [ext/dba/tests/dba009.phpt] (info: DB4 handler used)
Test 3: Exception Test [ext/dom/tests/dom003.phpt]
Bug #24155 (gdImageRotate270 rotation problem). [ext/gd/tests/bug24155.phpt]
gdimagefill() function (Bug #19366 (fixed in bundled libgd)) [ext/gd/tests/bug27582_1.phpt]
Bug #16069 [ext/iconv/tests/bug16069.phpt]
iconv stream filter [ext/iconv/tests/iconv_stream_filter.phpt]
HTML input/output [ext/mbstring/tests/htmlent.phpt]
mb_output_handler() (Shift_JIS) [ext/mbstring/tests/mb_output_handler_shift_jis.phpt]
Bug #29992 (foreach by reference corrupts the array) [ext/standard/tests/array/bug29992.phpt]
Bug #20382 (strtotime ("Monday", $date) produces wrong result on DST changeover)
[ext/standard/tests/time/bug20382.phpt]
wddx deserialization test [ext/wddx/tests/001.phpt]
Bug #26614 (CDATA sections skipped on line count) [ext/xml/tests/bug26614.phpt]
=====================================================================
================================================================================
/var/tmp/portage/mod_php-5.0.3/work/php-5.0.3/tests/func/008.phpt
================================================================================
---- EXPECTED OUTPUT
'foo1'
'foo2'
---- ACTUAL OUTPUT
---- FAILED
================================================================================
001- 'foo1'
003- 'foo2'
================================================================================
================================================================================
/var/tmp/portage/mod_php-5.0.3/work/php-5.0.3/tests/lang/038.phpt
================================================================================
---- EXPECTED OUTPUT
string(15) "Error2Exception"
string(5) "fopen"
===DONE===
---- ACTUAL OUTPUT
string(15) "Error2Exception"
string(15) "Error2Exception"
===DONE===
---- FAILED
================================================================================
002+ string(15) "Error2Exception"
002- string(5) "fopen"
================================================================================
================================================================================
/var/tmp/portage/mod_php-5.0.3/work/php-5.0.3/Zend/tests/bug22836.phpt
================================================================================
---- EXPECTED OUTPUT
string(3) "foo"
'foo'
Notice: Undefined variable: a in %s on line %d
Strict Standards: Only variable references should be returned by reference in %s on line %d
string(3) "foo"
'foo'
Notice: Undefined variable: a in %s on line %d
Strict Standards: Only variable references should be returned by reference in %s on line %d
string(3) "foo"
'foo'
Notice: Undefined variable: a in %s on line %d
Strict Standards: Only variable references should be returned by reference in %s on line %d
string(3) "foo"
'foo'
Notice: Undefined variable: a in %s on line %d
Strict Standards: Only variable references should be returned by reference in %s on line %d
string(3) "foo"
'foo'
Notice: Undefined variable: a in %s on line %d
Strict Standards: Only variable references should be returned by reference in %s on line %d
string(3) "foo"
'foo'
Notice: Undefined variable: a in %s on line %d
Strict Standards: Only variable references should be returned by reference in %s on line %d
string(3) "foo"
'foo'
Notice: Undefined variable: a in %s on line %d
Strict Standards: Only variable references should be returned by reference in %s on line %d
string(3) "foo"
'foo'
Notice: Undefined variable: a in %s on line %d
Strict Standards: Only variable references should be returned by reference in %s on line %d
string(3) "foo"
'foo'
Notice: Undefined variable: a in %s on line %d
Strict Standards: Only variable references should be returned by reference in %s on line %d
---- ACTUAL OUTPUT
string(3) "foo"
'foo'
Notice: Undefined variable: a in
/var/tmp/portage/mod_php-5.0.3/work/php-5.0.3/Zend/tests/bug22836.php on line 7
Strict Standards: Only variable references should be returned by reference in
/var/tmp/portage/mod_php-5.0.3/work/php-5.0.3/Zend/tests/bug22836.php on line 7
string(3) "foo"
'foo'
Notice: Undefined variable: a in
/var/tmp/portage/mod_php-5.0.3/work/php-5.0.3/Zend/tests/bug22836.php on line 7
Strict Standards: Only variable references should be returned by reference in
/var/tmp/portage/mod_php-5.0.3/work/php-5.0.3/Zend/tests/bug22836.php on line 7
NULL
'foo'
Notice: Undefined variable: a in
/var/tmp/portage/mod_php-5.0.3/work/php-5.0.3/Zend/tests/bug22836.php on line 7
NULL
'foo'
Notice: Undefined variable: a in
/var/tmp/portage/mod_php-5.0.3/work/php-5.0.3/Zend/tests/bug22836.php on line 7
NULL
'foo'
Notice: Undefined variable: a in
/var/tmp/portage/mod_php-5.0.3/work/php-5.0.3/Zend/tests/bug22836.php on line 7
NULL
'foo'
Notice: Undefined variable: a in
/var/tmp/portage/mod_php-5.0.3/work/php-5.0.3/Zend/tests/bug22836.php on line 7
NULL
'foo'
Notice: Undefined variable: a in
/var/tmp/portage/mod_php-5.0.3/work/php-5.0.3/Zend/tests/bug22836.php on line 7
NULL
'foo'
Notice: Undefined variable: a in
/var/tmp/portage/mod_php-5.0.3/work/php-5.0.3/Zend/tests/bug22836.php on line 7
---- FAILED
================================================================================
013+ NULL
013- string(3) "foo"
017+ NULL
018+ 'foo'
018- Strict Standards: Only variable references should be returned by reference in %s on line %d
019- string(3) "foo"
020+ Notice: Undefined variable: a in
/var/tmp/portage/mod_php-5.0.3/work/php-5.0.3/Zend/tests/bug22836.php on line 7
021+ NULL
022+ 'foo'
023+
024+ Notice: Undefined variable: a in
/var/tmp/portage/mod_php-5.0.3/work/php-5.0.3/Zend/tests/bug22836.php on line 7
025+ NULL
026+ 'foo'
027+
028+ Notice: Undefined variable: a in
/var/tmp/portage/mod_php-5.0.3/work/php-5.0.3/Zend/tests/bug22836.php on line 7
029+ NULL
030+ 'foo'
031+
032+ Notice: Undefined variable: a in
/var/tmp/portage/mod_php-5.0.3/work/php-5.0.3/Zend/tests/bug22836.php on line 7
033+ NULL
023-
024- Strict Standards: Only variable references should be returned by reference in %s on line %d
025- string(3) "foo"
026- 'foo'
027-
028- Notice: Undefined variable: a in %s on line %d
029-
030- Strict Standards: Only variable references should be returned by reference in %s on line %d
031- string(3) "foo"
032- 'foo'
033-
034- Notice: Undefined variable: a in %s on line %d
035-
036- Strict Standards: Only variable references should be returned by reference in %s on line %d
037- string(3) "foo"
038- 'foo'
039-
040- Notice: Undefined variable: a in %s on line %d
041-
042- Strict Standards: Only variable references should be returned by reference in %s on line %d
043- string(3) "foo"
044- 'foo'
045-
046- Notice: Undefined variable: a in %s on line %d
047-
048- Strict Standards: Only variable references should be returned by reference in %s on line %d
049- string(3) "foo"
050- 'foo'
051-
052- Notice: Undefined variable: a in %s on line %d
053-
054- Strict Standards: Only variable references should be returned by reference in %s on line %d
================================================================================
================================================================================
/var/tmp/portage/mod_php-5.0.3/work/php-5.0.3/Zend/tests/bug28444.phpt
================================================================================
---- EXPECTED OUTPUT
object(Object)#%d (1) {
["x"]=>
int(2)
}
int(2)
int(3)
Overloaded::__set(y,3)
int(3)
Overloaded::__get(y)
int(3)
Overloaded::__set(z,Object id #3)
object(Object)#%d (1) {
["x"]=>
int(4)
}
Overloaded::__get(z)
int(4)
Overloaded::__get(z)
int(5)
Overloaded::__get(z)
int(6)
===DONE===
---- ACTUAL OUTPUT
object(Object)#2 (1) {
["x"]=>
int(2)
}
int(2)
int(3)
Overloaded::__set(y,3)
int(3)
Overloaded::__get(y)
int(3)
Overloaded::__set(z,Object id #3)
object(Object)#3 (1) {
["x"]=>
int(4)
}
Overloaded::__get(z)
int(4)
Overloaded::__get(z)
int(5)
Fatal error: Cannot access undefined property for object with overloaded property access in
/var/tmp/portage/mod_php-5.0.3/work/php-5.0.3/Zend/tests/bug28444.php on line 45
---- FAILED
================================================================================
020+
021+ Fatal error: Cannot access undefined property for object with overloaded property access in
/var/tmp/portage/mod_php-5.0.3/work/php-5.0.3/Zend/tests/bug28444.php on line 45
020- Overloaded::__get(z)
021- int(6)
022- ===DONE===
================================================================================
================================================================================
/var/tmp/portage/mod_php-5.0.3/work/php-5.0.3/ext/dba/tests/dba009.phpt (info: DB4 handler used)
================================================================================
---- EXPECTED OUTPUT
database handler: %s
Opened
Inserted
Closed
Opened
Inserted
---- ACTUAL OUTPUT
database handler: db4
Opened
Notice: dba_fetch(): DB_THREAD mandates memory allocation flag on DBT data in
/var/tmp/portage/mod_php-5.0.3/work/php-5.0.3/ext/dba/tests/dba009.php on line 7
Closed
Opened
Notice: dba_fetch(): DB_THREAD mandates memory allocation flag on DBT data in
/var/tmp/portage/mod_php-5.0.3/work/php-5.0.3/ext/dba/tests/dba009.php on line 16
---- FAILED
================================================================================
003+
004+ Notice: dba_fetch(): DB_THREAD mandates memory allocation flag on DBT data in
/var/tmp/portage/mod_php-5.0.3/work/php-5.0.3/ext/dba/tests/dba009.php on line 7
005+
003- Inserted
006- Inserted
008+
009+ Notice: dba_fetch(): DB_THREAD mandates memory allocation flag on DBT data in
/var/tmp/portage/mod_php-5.0.3/work/php-5.0.3/ext/dba/tests/dba009.php on line 16
================================================================================
================================================================================
/var/tmp/portage/mod_php-5.0.3/work/php-5.0.3/ext/dom/tests/dom003.phpt
================================================================================
---- EXPECTED OUTPUT
--- Catch exception with try/catch
object(DOMException)#%d (6) {
["message:protected"]=>
string(23) "Hierarchy Request Error"
["string:private"]=>
string(0) ""
["file:protected"]=>
string(%d) "%s/ext/dom/tests/dom003.php"
["line:protected"]=>
int(8)
["trace:private"]=>
array(0) {
}
["code"]=>
int(3)
}
--- Don't catch exception with try/catch
Fatal error: Uncaught exception 'DOMException' with message 'Hierarchy Request
Error' in %sdom003.php:%d
Stack trace:
#0 {main}
thrown in %sdom003.php on line %d
---- ACTUAL OUTPUT
--- Catch exception with try/catch
object(DOMException)#3 (6) {
["message:protected"]=>
string(23) "Hierarchy Request Error"
["string:private"]=>
string(0) ""
["file:protected"]=>
string(70) "/var/tmp/portage/mod_php-5.0.3/work/php-5.0.3/ext/dom/tests/dom003.php"
["line:protected"]=>
int(8)
["trace:private"]=>
array(1) {
[0]=>
array(6) {
["file"]=>
string(70) "/var/tmp/portage/mod_php-5.0.3/work/php-5.0.3/ext/dom/tests/dom003.php"
["line"]=>
int(8)
["function"]=>
string(11) "appendChild"
["class"]=>
string(10) "DOMElement"
["type"]=>
string(2) "->"
["args"]=>
array(1) {
[0]=>
object(DOMElement)#2 (0) {
}
}
}
}
["code"]=>
int(3)
}
--- Don't catch exception with try/catch
Fatal error: Uncaught exception 'DOMException' with message 'Hierarchy Request
Error' in /var/tmp/portage/mod_php-5.0.3/work/php-5.0.3/ext/dom/tests/dom003.php:13
Stack trace:
#0 /var/tmp/portage/mod_php-5.0.3/work/php-5.0.3/ext/dom/tests/dom003.php(13):
DOMElement->appendChild(Object(DOMElement))
#1 {main}
thrown in /var/tmp/portage/mod_php-5.0.3/work/php-5.0.3/ext/dom/tests/dom003.php on line 13
---- FAILED
================================================================================
012+ array(1) {
013+ [0]=>
014+ array(6) {
015+ ["file"]=>
016+ string(70)
"/var/tmp/portage/mod_php-5.0.3/work/php-5.0.3/ext/dom/tests/dom003.php"
017+ ["line"]=>
018+ int(8)
019+ ["function"]=>
020+ string(11) "appendChild"
021+ ["class"]=>
022+ string(10) "DOMElement"
012- array(0) {
013- }
014- ["code"]=>
015- int(3)
016- }
017- --- Don't catch exception with try/catch
018-
019- Fatal error: Uncaught exception 'DOMException' with message 'Hierarchy Request
Error' in %sdom003.php:%d
020- Stack trace:
021- #0 {main}
022- thrown in %sdom003.php on line %d
023+ ["type"]=>
024+ string(2) "->"
025+ ["args"]=>
026+ array(1) {
027+ [0]=>
028+ object(DOMElement)#2 (0) {
029+ }
030+ }
031+ }
032+ }
033+ ["code"]=>
034+ int(3)
035+ }
036+ --- Don't catch exception with try/catch
037+
038+ Fatal error: Uncaught exception 'DOMException' with message 'Hierarchy Request
Error' in /var/tmp/portage/mod_php-5.0.3/work/php-5.0.3/ext/dom/tests/dom003.php:13
039+ Stack trace:
040+ #0 /var/tmp/portage/mod_php-5.0.3/work/php-5.0.3/ext/dom/tests/dom003.php(13):
DOMElement->appendChild(Object(DOMElement))
041+ #1 {main}
042+ thrown in /var/tmp/portage/mod_php-5.0.3/work/php-5.0.3/ext/dom/tests/dom003.php on line 13
================================================================================
================================================================================
/var/tmp/portage/mod_php-5.0.3/work/php-5.0.3/ext/gd/tests/bug24155.phpt
================================================================================
---- EXPECTED OUTPUT
cc867fd65c30883463ce58d0341f0997
---- ACTUAL OUTPUT
409d70b5d493746acc2255c759d73436
---- FAILED
================================================================================
001+ 409d70b5d493746acc2255c759d73436
001- cc867fd65c30883463ce58d0341f0997
================================================================================
================================================================================
/var/tmp/portage/mod_php-5.0.3/work/php-5.0.3/ext/gd/tests/bug27582_1.phpt
================================================================================
---- EXPECTED OUTPUT
08287f8f5d406946009df5f04ca83dc0
---- ACTUAL OUTPUT
b6d55b399e27b895a1fee8a137bb8470
---- FAILED
================================================================================
001+ b6d55b399e27b895a1fee8a137bb8470
001- 08287f8f5d406946009df5f04ca83dc0
================================================================================
================================================================================
/var/tmp/portage/mod_php-5.0.3/work/php-5.0.3/ext/iconv/tests/bug16069.phpt
================================================================================
---- EXPECTED OUTPUT
¥ß¥ê¥Ð¡¼¥ë¥ß¥ê¥Ð¡¼¥ë¥ß¥ê¥Ð¡¼¥ë¥ß¥ê¥Ð¡¼¥ë¥ß¥ê¥Ð¡¼¥ë¥ß¥ê¥Ð¡¼¥ë¥ß¥ê¥Ð¡¼¥ë¥ß¥ê¥Ð¡¼¥ë¥ß¥ê¥Ð¡¼¥ë¥ß¥ê¥Ð¡¼¥ë¥ß¥ê¥Ð¡¼¥ë¥ß¥ê¥Ð¡¼¥ë¥ß¥ê¥Ð¡¼¥ë¥ß¥ê¥Ð¡¼¥ë¥ß¥ê¥Ð¡¼¥ë¥ß¥ê¥Ð¡¼¥ë¥ß¥ê¥Ð¡¼¥ë¥ß¥ê¥Ð¡¼¥ë¥ß¥ê¥Ð¡¼¥ë¥ß¥ê¥Ð¡¼¥ë¥ß¥ê¥Ð¡¼¥ë¥ß¥ê¥Ð¡¼¥ë¥ß¥ê¥Ð¡¼¥ë¥ß¥ê¥Ð¡¼¥ë¥ß¥ê¥Ð¡¼¥ë¥ß¥ê¥Ð¡¼¥ë¥ß¥ê¥Ð¡¼¥ë¥ß¥ê¥Ð¡¼¥ë¥ß¥ê¥Ð¡¼¥ë¥ß¥ê¥Ð¡¼¥ë¥ß¥ê¥Ð¡¼¥ë¥ß¥ê¥Ð¡¼¥ë¥ß¥ê¥Ð¡¼¥ë¥ß¥ê¥Ð¡¼¥ë¥ß¥ê¥Ð¡¼¥ë¥ß¥ê¥Ð¡¼¥ë¥ß¥ê¥Ð¡¼¥ë¥ß¥ê¥Ð¡¼¥ë¥ß¥ê¥Ð¡¼¥ë¥ß¥ê¥Ð¡¼¥ë(¡ë§¥¡ë)
---- ACTUAL OUTPUT
????????????????????????????????????????(¡ë§¥¡ë)
---- FAILED
================================================================================
001+ ????????????????????????????????????????(¡ë§¥¡ë)
001-
¥ß¥ê¥Ð¡¼¥ë¥ß¥ê¥Ð¡¼¥ë¥ß¥ê¥Ð¡¼¥ë¥ß¥ê¥Ð¡¼¥ë¥ß¥ê¥Ð¡¼¥ë¥ß¥ê¥Ð¡¼¥ë¥ß¥ê¥Ð¡¼¥ë¥ß¥ê¥Ð¡¼¥ë¥ß¥ê¥Ð¡¼¥ë¥ß¥ê¥Ð¡¼¥ë¥ß¥ê¥Ð¡¼¥ë¥ß¥ê¥Ð¡¼¥ë¥ß¥ê¥Ð¡¼¥ë¥ß¥ê¥Ð¡¼¥ë¥ß¥ê¥Ð¡¼¥ë¥ß¥ê¥Ð¡¼¥ë¥ß¥ê¥Ð¡¼¥ë¥ß¥ê¥Ð¡¼¥ë¥ß¥ê¥Ð¡¼¥ë¥ß¥ê¥Ð¡¼¥ë¥ß¥ê¥Ð¡¼¥ë¥ß¥ê¥Ð¡¼¥ë¥ß¥ê¥Ð¡¼¥ë¥ß¥ê¥Ð¡¼¥ë¥ß¥ê¥Ð¡¼¥ë¥ß¥ê¥Ð¡¼¥ë¥ß¥ê¥Ð¡¼¥ë¥ß¥ê¥Ð¡¼¥ë¥ß¥ê¥Ð¡¼¥ë¥ß¥ê¥Ð¡¼¥ë¥ß¥ê¥Ð¡¼¥ë¥ß¥ê¥Ð¡¼¥ë¥ß¥ê¥Ð¡¼¥ë¥ß¥ê¥Ð¡¼¥ë¥ß¥ê¥Ð¡¼¥ë¥ß¥ê¥Ð¡¼¥ë¥ß¥ê¥Ð¡¼¥ë¥ß¥ê¥Ð¡¼¥ë¥ß¥ê¥Ð¡¼¥ë¥ß¥ê¥Ð¡¼¥ë(¡ë§¥¡ë)
================================================================================
================================================================================
/var/tmp/portage/mod_php-5.0.3/work/php-5.0.3/ext/iconv/tests/iconv_stream_filter.phpt
================================================================================
---- EXPECTED OUTPUT
string(20) "1b244224332473244b24"
string(10) "41244f1b28"
string(2) "42"
string(20) "a4b3a4f3a4cba4c1a4cf"
string(10) "69636f6e76"
string(2) "0a"
Warning: fread(): iconv stream filter ("ISO-2022-JP"=>"EUC-JP"): invalid
multibyte sequence in %s on line %d
string(0) ""
string(0) ""
string(0) ""
---- ACTUAL OUTPUT
string(20) "1b244224332473244b24"
string(10) "41244f1b28"
string(2) "42"
string(20) "a4b3a4f3a4cba4c1a4cf"
string(10) "69636f6e76"
string(2) "0a"
string(20) "1b244f24332466245824"
string(10) "4e24421b28"
string(2) "4f"
---- FAILED
================================================================================
007+ string(20) "1b244f24332466245824"
008+ string(10) "4e24421b28"
009+ string(2) "4f"
007-
008- Warning: fread(): iconv stream filter ("ISO-2022-JP"=>"EUC-JP"): invalid
multibyte sequence in %s on line %d
009- string(0) ""
010- string(0) ""
011- string(0) ""
================================================================================
================================================================================
/var/tmp/portage/mod_php-5.0.3/work/php-5.0.3/ext/mbstring/tests/htmlent.phpt
================================================================================
---- EXPECTED OUTPUT
HTML-ENTITIES>UTF-8>HTML-ENTITIES
test='&&;&@AB€‚äöü€⟨⟩'
---- ACTUAL OUTPUT
---- FAILED
================================================================================
001+
001- HTML-ENTITIES>UTF-8>HTML-ENTITIES
002-
test='&&;&@AB€‚äöü€⟨⟩'
================================================================================
================================================================================
/var/tmp/portage/mod_php-5.0.3/work/php-5.0.3/ext/mbstring/tests/mb_output_handler_shift_jis.phpt
================================================================================
---- EXPECTED OUTPUT
string(73)
"¥Æ¥¹¥ÈÍÑÆüËܸìʸ»úÎ󡣤³¤Î¥â¥¸¥å¡¼¥ë¤ÏPHP¤Ë¥Þ¥ë¥Á¥Ð¥¤¥È´Ø¿ô¤òÄ󶡤·¤Þ¤¹¡£"
---- ACTUAL OUTPUT
---- FAILED
================================================================================
001+
001- string(73)
"¥Æ¥¹¥ÈÍÑÆüËܸìʸ»úÎ󡣤³¤Î¥â¥¸¥å¡¼¥ë¤ÏPHP¤Ë¥Þ¥ë¥Á¥Ð¥¤¥È´Ø¿ô¤òÄ󶡤·¤Þ¤¹¡£"
================================================================================
================================================================================
/var/tmp/portage/mod_php-5.0.3/work/php-5.0.3/ext/standard/tests/array/bug29992.phpt
================================================================================
---- EXPECTED OUTPUT
Array
(
[0] => 1
[1] => 2
[2] => 3
)
int(1)
int(2)
int(3)
int(1)
int(2)
int(3)
int(1)
int(2)
int(3)
int(1)
int(2)
int(3)
Array
(
[0] => 1
[1] => 2
[2] => 3
)
===DONE===
---- ACTUAL OUTPUT
Array
(
[0] => 1
[1] => 2
[2] => 3
)
int(1)
int(2)
int(3)
int(1)
int(2)
int(3)
int(1)
int(2)
int(3)
int(1)
int(2)
int(2)
Array
(
[0] => 1
[1] => 2
[2] => 2
)
===DONE===
---- FAILED
================================================================================
018+ int(2)
018- int(3)
023+ [2] => 2
023- [2] => 3
================================================================================
================================================================================
/var/tmp/portage/mod_php-5.0.3/work/php-5.0.3/ext/standard/tests/time/bug20382.phpt
================================================================================
---- EXPECTED OUTPUT
tStamp=Wednesday 2004-10-27 17:17:17 CEST
result=Monday 2004-11-01 00:00:00 CET
wanted=Monday 2004-11-01 00:00:00 CET
---- ACTUAL OUTPUT
tStamp=Wednesday 2004-10-27 17:17:17 CEST
result=Sunday 2004-10-31 23:00:00 CET
wanted=Monday 2004-11-01 00:00:00 CET
---- FAILED
================================================================================
002+ result=Sunday 2004-10-31 23:00:00 CET
002- result=Monday 2004-11-01 00:00:00 CET
================================================================================
================================================================================
/var/tmp/portage/mod_php-5.0.3/work/php-5.0.3/ext/wddx/tests/001.phpt
================================================================================
---- EXPECTED OUTPUT
array(11) {
["aNull"]=>
NULL
["aString"]=>
string(8) "a string"
["aNumber"]=>
float(-12.456)
["aDateTime"]=>
int(897625932)
["aDateTime2"]=>
int(329632332)
["aDateTime3"]=>
string(22) "2040-06-12T04:32:12+00"
["aBoolean"]=>
bool(true)
["anArray"]=>
array(2) {
[0]=>
int(10)
[1]=>
string(14) "second element"
}
["aBinary"]=>
string(11) "binary data"
["anObject"]=>
array(2) {
["s"]=>
string(8) "a string"
["n"]=>
float(-12.456)
}
["aRecordset"]=>
array(2) {
["NAME"]=>
array(2) {
[0]=>
string(8) "John Doe"
[1]=>
string(8) "Jane Doe"
}
["AGE"]=>
array(2) {
[0]=>
int(34)
[1]=>
int(31)
}
}
}
---- ACTUAL OUTPUT
array(11) {
["aNull"]=>
NULL
["aString"]=>
string(8) "a string"
["aNumber"]=>
float(-12.456)
["aDateTime"]=>
int(897625932)
["aDateTime2"]=>
int(329632332)
["aDateTime3"]=>
string(19) "2040-06-12T04:32:12"
["aBoolean"]=>
bool(true)
["anArray"]=>
array(2) {
[0]=>
int(10)
[1]=>
string(14) "second element"
}
["aBinary"]=>
string(11) "binary data"
["anObject"]=>
array(2) {
["s"]=>
string(8) "a string"
["n"]=>
float(-12.456)
}
["aRecordset"]=>
array(2) {
["NAME"]=>
array(2) {
[0]=>
string(8) "John Doe"
[1]=>
string(8) "Jane Doe"
}
["AGE"]=>
array(2) {
[0]=>
int(34)
[1]=>
int(31)
}
}
}
---- FAILED
================================================================================
013+ string(19) "2040-06-12T04:32:12"
013- string(22) "2040-06-12T04:32:12+00"
================================================================================
================================================================================
/var/tmp/portage/mod_php-5.0.3/work/php-5.0.3/ext/xml/tests/bug26614.phpt
================================================================================
---- EXPECTED OUTPUT
CDATA
<DATA> at line 2, col 0 (byte 45)
</DATA> at line 9, col 0 (byte 90)
Comment
<DATA> at line 2, col 0 (byte 45)
</DATA> at line 9, col 0 (byte 90)
Text
<DATA> at line 2, col 0 (byte 45)
</DATA> at line 9, col 0 (byte 90)
---- ACTUAL OUTPUT
CDATA
<DATA> at line 2, col 6 (byte 9)
</DATA> at line 9, col 7 (byte 56)
Comment
<DATA> at line 2, col 6 (byte 9)
</DATA> at line 9, col 7 (byte 56)
Text
<DATA> at line 2, col 6 (byte 9)
</DATA> at line 9, col 10 (byte 56)
---- FAILED
================================================================================
002+ <DATA> at line 2, col 6 (byte 9)
003+ </DATA> at line 9, col 7 (byte 56)
002- <DATA> at line 2, col 0 (byte 45)
003- </DATA> at line 9, col 0 (byte 90)
005+ <DATA> at line 2, col 6 (byte 9)
006+ </DATA> at line 9, col 7 (byte 56)
005- <DATA> at line 2, col 0 (byte 45)
006- </DATA> at line 9, col 0 (byte 90)
008+ <DATA> at line 2, col 6 (byte 9)
009+ </DATA> at line 9, col 10 (byte 56)
008- <DATA> at line 2, col 0 (byte 45)
009- </DATA> at line 9, col 0 (byte 90)
================================================================================
================================================================================
BUILD ENVIRONMENT
================================================================================
OS:
Linux - Linux charger 2.6.7-hardened-r9 #4 SMP Tue Jan 4 22:25:16 CET 2005 i686
Automake:
automake (GNU automake) 1.4-p6
Copyright (C) 1999, 2001 Free Software Foundation, Inc.
This is free software; see the source for copying conditions. There is NO
warranty; not even for MERCHANTABILITY or FITNESS FOR A PARTICULAR PURPOSE.
Written by Tom Tromey <tromey@redhat.com>
Autoconf:
Autoconf version 2.13
Bundled Libtool:
ltmain.sh (GNU libtool) 1.4.3 (1.922.2.110 2002/10/23 01:39:54)
System Libtool:
ltmain.sh (GNU libtool) 1.5.2 (1.1220.2.60 2004/01/25 12:25:08)
Copyright (C) 2003 Free Software Foundation, Inc.
This is free software; see the source for copying conditions. There is NO
warranty; not even for MERCHANTABILITY or FITNESS FOR A PARTICULAR PURPOSE.
Compiler:
Reading specs from /usr/lib/gcc-lib/i686-pc-linux-gnu/3.3.4/specs
Configured with: /var/tmp/portage/gcc-3.3.4-r1/work/gcc-3.3.4/configure --prefix=/usr
--bindir=/usr/i686-pc-linux-gnu/gcc-bin/3.3
--includedir=/usr/lib/gcc-lib/i686-pc-linux-gnu/3.3.4/include
--datadir=/usr/share/gcc-data/i686-pc-linux-gnu/3.3
--mandir=/usr/share/gcc-data/i686-pc-linux-gnu/3.3/man
--infodir=/usr/share/gcc-data/i686-pc-linux-gnu/3.3/info --enable-shared --host=i686-pc-linux-gnu
--target=i686-pc-linux-gnu --with-system-zlib --enable-languages=c,c++ --enable-threads=posix
--enable-long-long --disable-checking --disable-libunwind-exceptions --enable-cstdio=stdio
--enable-version-specific-runtime-libs
--with-gxx-include-dir=/usr/lib/gcc-lib/i686-pc-linux-gnu/3.3.4/include/g++-v3
--with-local-prefix=/usr/local --enable-shared --enable-nls --without-included-gettext
--disable-multilib --enable-__cxa_atexit --enable-clocale=generic
Thread model: posix
gcc version 3.3.4 20040623 (Gentoo Hardened Linux 3.3.4-r1, ssp-3.3.2-2, pie-8.7.6)
Bison:
bison (GNU Bison) 1.875
Written by Robert Corbett and Richard Stallman.
Copyright (C) 2002 Free Software Foundation, Inc.
This is free software; see the source for copying conditions. There is NO
warranty; not even for MERCHANTABILITY or FITNESS FOR A PARTICULAR PURPOSE.
Libraries:
/lib/libsandbox.so => /lib/libsandbox.so (0x23aef000)
libcrypt.so.1 => /lib/libcrypt.so.1 (0x23afd000)
libexslt.so.0 => /usr/lib/libexslt.so.0 (0x23b2c000)
libgcrypt.so.11 => /usr/lib/libgcrypt.so.11 (0x23b41000)
libgpg-error.so.0 => /usr/lib/libgpg-error.so.0 (0x23ba5000)
libz.so.1 => /lib/libz.so.1 (0x23baa000)
libm.so.6 => /lib/libm.so.6 (0x23bc2000)
libexpat.so.0 => /usr/lib/libexpat.so.0 (0x23be5000)
libtidy-0.99.so.0 => /usr/lib/libtidy-0.99.so.0 (0x23c0f000)
libhistory.so.4 => /lib/libhistory.so.4 (0x23c68000)
libreadline.so.4 => /lib/libreadline.so.4 (0x23c72000)
libncursesw.so.5 => /lib/libncursesw.so.5 (0x23cab000)
libpspell.so.15 => /usr/lib/libpspell.so.15 (0x23d07000)
libaspell.so.15 => /usr/lib/libaspell.so.15 (0x23d0a000)
libdl.so.2 => /lib/libdl.so.2 (0x23e12000)
libstdc++.so.5 => /usr/lib/gcc-lib/i686-pc-linux-gnu/3.3.4/libstdc++.so.5 (0x23e16000)
libpq.so.3 => /usr/lib/libpq.so.3 (0x23f63000)
libmysqlclient.12 => /usr/lib/mysql/libmysqlclient.12 (0x23f86000)
libssl.so.0.9.7 => /usr/lib/libssl.so.0.9.7 (0x23fd2000)
libcrypto.so.0.9.7 => /usr/lib/libcrypto.so.0.9.7 (0x2400b000)
libmhash.so.2 => /usr/lib/libmhash.so.2 (0x24145000)
libmcrypt.so.4 => /usr/lib/libmcrypt.so.4 (0x2417e000)
libltdl.so.3 => /usr/lib/libltdl.so.3 (0x241c1000)
libldap.so.2 => /usr/lib/libldap.so.2 (0x241ca000)
liblber.so.2 => /usr/lib/liblber.so.2 (0x24204000)
libt1.so.5 => /usr/lib/libt1.so.5 (0x24214000)
libfreetype.so.6 => /usr/lib/libfreetype.so.6 (0x2427c000)
libpng.so.3 => /usr/lib/libpng.so.3 (0x24319000)
libjpeg.so.62 => /usr/lib/libjpeg.so.62 (0x24353000)
libdb-4.1.so => /usr/lib/libdb-4.1.so (0x24381000)
libbz2.so.1.0 => /usr/lib/libbz2.so.1.0 (0x24467000)
libresolv.so.2 => /lib/libresolv.so.2 (0x2447d000)
libnsl.so.1 => /lib/libnsl.so.1 (0x24491000)
libcurl.so.3 => /usr/lib/libcurl.so.3 (0x244a7000)
libxslt.so.1 => /usr/lib/libxslt.so.1 (0x244db000)
libxml2.so.2 => /usr/lib/libxml2.so.2 (0x24516000)
libpthread.so.0 => /lib/libpthread.so.0 (0x2464f000)
libc.so.6 => /lib/libc.so.6 (0x24661000)
/lib/ld-linux.so.2 => /lib/ld-linux.so.2 (0x23ad8000)
libgcc_s.so.1 => /usr/lib/gcc-lib/i686-pc-linux-gnu/3.3.4/libgcc_s.so.1 (0x24779000)
User's E-mail:
================================================================================
PHPINFO
================================================================================
phpinfo()
PHP Version => 5.0.3
System => Linux charger 2.6.7-hardened-r9 #4 SMP Tue Jan 4 22:25:16 CET 2005 i686
Build Date => Jan 10 2005 00:44:52
Configure Command => './configure' '--prefix=/usr'
'--host=i686-pc-linux-gnu' '--mandir=/usr/share/man'
'--infodir=/usr/share/info' '--datadir=/usr/share' '--sysconfdir=/etc'
'--localstatedir=/var/lib' '--enable-experimental-zts'
'--with-apxs2=/usr/sbin/apxs2' '--with-config-file-path=/etc/php/apache2-php5'
'--without-pear' '--enable-bcmath' '--with-bz2'
'--enable-calendar' '--without-cpdflib' '--disable-ctype'
'--with-curl' '--with-curlwrappers' '--disable-dbase'
'--disable-dio' '--disable-exif' '--without-fam'
'--without-fbsql' '--without-fdftk' '--disable-filepro'
'--disable-ftp' '--with-gettext' '--without-gmp'
'--without-hwapi' '--with-iconv' '--without-informix'
'--without-ingres' '--without-interbase' '--without-kerberos'
'--enable-mbstring' '--with-mcrypt' '--without-mcve'
'--enable-memory-limit' '--with-mhash' '--without-mime-magic'
'--without-ming' '--without-mnogosearch' '--without-msql'
'--without-mssql' '--without-ncurses' '--without-oci8'
'--without-oracle' '-!
-with-openssl' '--with-openssl-dir=/usr' '--without-ovrimos'
'--enable-pcntl' '--without-pfpro' '--with-pgsql'
'--with-pspell' '--without-recode' '--disable-shmop'
'--without-snmp' '--enable-soap' '--enable-sockets'
'--without-sybase' '--without-sybase-ct' '--enable-sysvmsg'
'--enable-sysvsem' '--enable-sysvshm' '--with-tidy'
'--enable-wddx' '--with-xsl' '--with-xmlrpc' '--disable-yp'
'--with-zlib' '--disable-debug' '--without-cdb' '--with-db4'
'--without-dbm' '--without-flatfile' '--without-gdbm'
'--without-inifile' '--without-qdbm' '--with-jpeg-dir=/usr'
'--with-freetype-dir=/usr' '--with-t1lib=/usr' '--with-ttf=/usr'
'--enable-gd-jis-conf' '--enable-gd-native-ttf' '--with-png-dir=/usr'
'--with-tiff-dir=/usr' '--without-xpm-dir' '--with-gd'
'--with-ldap' '--without-ldap-sasl' '--with-mysql'
'--with-mysql-sock=/var/run/mysqld/mysqld.sock' '--disable-session'
'--without-sqlite' '--enable-dba' '--with-readline'
'--without-libedit'
Server API => Command Line Interface
Virtual Directory Support => enabled
Configuration File (php.ini) Path => /etc/php/apache2-php5
PHP API => 20031224
PHP Extension => 20041030
Zend Extension => 220040412
Debug Build => no
Thread Safety => enabled
IPv6 Support => enabled
Registered PHP Streams => php, file, ftp, gopher, telnet, dict, ldap, http, https, ftps,
compress.bzip2, compress.zlib
Registered Stream Socket Transports => tcp, udp, unix, udg, ssl, sslv3, sslv2, tls
This program makes use of the Zend Scripting Language Engine:
Zend Engine v2.0.3, Copyright (c) 1998-2004 Zend Technologies
_______________________________________________________________________
Configuration
PHP Core
Directive => Local Value => Master Value
allow_call_time_pass_reference => On => On
allow_url_fopen => On => On
always_populate_raw_post_data => Off => Off
arg_separator.input => & => &
arg_separator.output => & => &
asp_tags => Off => Off
auto_append_file => no value => no value
auto_globals_jit => On => On
auto_prepend_file => no value => no value
browscap => no value => no value
default_charset => no value => no value
default_mimetype => text/html => text/html
define_syslog_variables => Off => Off
disable_classes => no value => no value
disable_functions => no value => no value
display_errors => On => On
display_startup_errors => Off => Off
doc_root => no value => no value
docref_ext => no value => no value
docref_root => no value => no value
enable_dl => On => On
error_append_string => no value => no value
error_log => no value => no value
error_prepend_string => no value => no value
error_reporting => no value => no value
expose_php => On => On
extension_dir => /usr/lib/php/extensions/no-debug-zts-20041030 =>
/usr/lib/php/extensions/no-debug-zts-20041030
file_uploads => On => On
highlight.bg => #FFFFFF => #FFFFFF
highlight.comment => #FF8000 => #FF8000
highlight.default => #0000BB => #0000BB
highlight.html => #000000 => #000000
highlight.keyword => #007700 => #007700
highlight.string => #DD0000 => #DD0000
html_errors => Off => On
ignore_repeated_errors => Off => Off
ignore_repeated_source => Off => Off
ignore_user_abort => Off => Off
implicit_flush => On => Off
include_path => .: => .:
log_errors => Off => Off
log_errors_max_len => 1024 => 1024
magic_quotes_gpc => On => On
magic_quotes_runtime => Off => Off
magic_quotes_sybase => Off => Off
mail.force_extra_parameters => no value => no value
max_execution_time => 0 => 30
max_input_time => -1 => -1
memory_limit => 8M => 8M
open_basedir => no value => no value
output_buffering => 0 => 0
output_handler => no value => no value
post_max_size => 8M => 8M
precision => 14 => 14
register_argc_argv => On => On
register_globals => Off => Off
register_long_arrays => On => On
report_memleaks => On => On
report_zend_debug => Off => Off
safe_mode => Off => Off
safe_mode_exec_dir => /usr/local/php/bin => /usr/local/php/bin
safe_mode_gid => Off => Off
safe_mode_include_dir => no value => no value
sendmail_from => no value => no value
sendmail_path => /usr/sbin/sendmail -t -i => /usr/sbin/sendmail -t -i
serialize_precision => 100 => 100
short_open_tag => On => On
SMTP => localhost => localhost
smtp_port => 25 => 25
sql.safe_mode => Off => Off
track_errors => Off => Off
unserialize_callback_func => no value => no value
upload_max_filesize => 2M => 2M
upload_tmp_dir => no value => no value
user_dir => no value => no value
variables_order => EGPCS => EGPCS
xmlrpc_error_number => 0 => 0
xmlrpc_errors => Off => Off
y2k_compliance => On => On
zend.ze1_compatibility_mode => Off => Off
bcmath
BCMath support => enabled
bz2
BZip2 Support => Enabled
BZip2 Version => 1.0.2, 30-Dec-2001
calendar
Calendar support => enabled
curl
CURL support => enabled
CURL Information => libcurl/7.12.0 OpenSSL/0.9.7d zlib/1.2.1
dba
DBA support => enabled
Supported handlers => cdb cdb_make db4
dom
DOM/XML => enabled
DOM/XML API Version => 20031129
libxml Version => 2.6.16
HTML Support => enabled
XPath Support => enabled
XPointer Support => enabled
Schema Support => enabled
RelaxNG Support => enabled
gd
GD Support => enabled
GD Version => bundled (2.0.28 compatible)
FreeType Support => enabled
FreeType Linkage => with freetype
FreeType Version => 2.1.9
T1Lib Support => enabled
GIF Read Support => enabled
GIF Create Support => enabled
JPG Support => enabled
PNG Support => enabled
WBMP Support => enabled
XBM Support => enabled
gettext
GetText Support => enabled
iconv
iconv support => enabled
iconv implementation => glibc
iconv library version => 2.3.4
Directive => Local Value => Master Value
iconv.input_encoding => ISO-8859-1 => ISO-8859-1
iconv.internal_encoding => ISO-8859-1 => ISO-8859-1
iconv.output_encoding => ISO-8859-1 => ISO-8859-1
ldap
LDAP Support => enabled
RCS Version => $Id: ldap.c,v 1.154 2004/06/28 22:31:28 iliaa Exp $
Total Links => 0/unlimited
API Version => 2004
Vendor Name => OpenLDAP
Vendor Version => 20130
libxml
libXML support => active
libXML Version => 2.6.16
libXML streams => enabled
mbstring
Multibyte Support => enabled
Multibyte string engine => libmbfl
Multibyte (japanese) regex support => enabled
Multibyte regex (oniguruma) version => 2.2.4
mbstring extension makes use of "streamable kanji code filter and converter", which is
distributed under the GNU Lesser General Public License version 2.1.
Directive => Local Value => Master Value
mbstring.detect_order => no value => no value
mbstring.encoding_translation => Off => Off
mbstring.func_overload => 0 => 0
mbstring.http_input => pass => pass
mbstring.http_output => pass => pass
mbstring.internal_encoding => ISO-8859-1 => no value
mbstring.language => neutral => neutral
mbstring.substitute_character => no value => no value
mcrypt
mcrypt support => enabled
Version => 2.5.7
Api No => 20021217
Supported ciphers => cast-128 gost rijndael-128 twofish arcfour cast-256 loki97 rijndael-192
saferplus wake blowfish-compat des rijndael-256 serpent xtea blowfish enigma rc2 tripledes
Supported modes => cbc cfb ctr ecb ncfb nofb ofb stream
Directive => Local Value => Master Value
mcrypt.algorithms_dir => no value => no value
mcrypt.modes_dir => no value => no value
mhash
MHASH support => Enabled
MHASH API Version => 20020524
mysql
MySQL Support => enabled
Active Persistent Links => 0
Active Links => 0
Client API version => 4.0.23
MYSQL_MODULE_TYPE => external
MYSQL_SOCKET => /var/run/mysqld/mysqld.sock
MYSQL_INCLUDE => -I/usr/include/mysql
MYSQL_LIBS => -L/usr/lib/mysql -lmysqlclient
Directive => Local Value => Master Value
mysql.allow_persistent => On => On
mysql.connect_timeout => 60 => 60
mysql.default_host => no value => no value
mysql.default_password => no value => no value
mysql.default_port => no value => no value
mysql.default_socket => no value => no value
mysql.default_user => no value => no value
mysql.max_links => Unlimited => Unlimited
mysql.max_persistent => Unlimited => Unlimited
mysql.trace_mode => Off => Off
openssl
OpenSSL support => enabled
OpenSSL Version => OpenSSL 0.9.7d 17 Mar 2004
pcntl
pcntl support => enabled
pcre
PCRE (Perl Compatible Regular Expressions) Support => enabled
PCRE Library Version => 4.5 01-December-2003
pgsql
PostgreSQL Support => enabled
PostgreSQL(libpq) Version => 7.4.6
Multibyte character support => enabled
SSL support => enabled
Active Persistent Links => 0
Active Links => 0
Directive => Local Value => Master Value
pgsql.allow_persistent => On => On
pgsql.auto_reset_persistent => Off => Off
pgsql.ignore_notice => Off => Off
pgsql.log_notice => Off => Off
pgsql.max_links => Unlimited => Unlimited
pgsql.max_persistent => Unlimited => Unlimited
posix
Revision => $Revision: 1.60 $
pspell
PSpell Support => enabled
SimpleXML
Simplexml support => enabled
Revision => $Revision: 1.139.2.4 $
Schema support => enabled
soap
Soap Client => enabled
Soap Server => enabled
Directive => Local Value => Master Value
soap.wsdl_cache_dir => /tmp => /tmp
soap.wsdl_cache_enabled => 1 => 1
soap.wsdl_cache_ttl => 86400 => 86400
sockets
Sockets Support => enabled
SPL
SPL support => enabled
Interfaces => RecursiveIterator, SeekableIterator
Classes => ArrayObject, ArrayIterator, CachingIterator, CachingRecursiveIterator,
DirectoryIterator, FilterIterator, LimitIterator, ParentIterator, RecursiveDirectoryIterator,
RecursiveIteratorIterator, SimpleXMLIterator
standard
Regex Library => Bundled library enabled
Dynamic Library Support => enabled
Path to sendmail => /usr/sbin/sendmail -t -i
Directive => Local Value => Master Value
assert.active => 1 => 1
assert.bail => 0 => 0
assert.callback => no value => no value
assert.quiet_eval => 0 => 0
assert.warning => 1 => 1
auto_detect_line_endings => 0 => 0
date.default_latitude => 31.7667 => 31.7667
date.default_longitude => 35.2333 => 35.2333
date.sunrise_zenith => 90.83 => 90.83
date.sunset_zenith => 90.83 => 90.83
default_socket_timeout => 60 => 60
safe_mode_allowed_env_vars => PHP_ => PHP_
safe_mode_protected_env_vars => LD_LIBRARY_PATH => LD_LIBRARY_PATH
url_rewriter.tags => a=href,area=href,frame=src,form=,fieldset= =>
a=href,area=href,frame=src,form=,fieldset=
user_agent => no value => no value
sysvmsg
sysvmsg support => enabled
Revision => $Revision: 1.16 $
tidy
Tidy support => enabled
libTidy Release => 1st August 2004
Extension Version => 2.0 ($Id: tidy.c,v 1.56.2.3 2004/11/14 13:35:48 tony2001 Exp $)
Directive => Local Value => Master Value
tidy.clean_output => 0 => 0
tidy.default_config => no value => no value
tokenizer
Tokenizer Support => enabled
wddx
WDDX Support => enabled
xml
XML Support => active
XML Namespace Support => active
libxml2 Version => 2.6.16
xmlrpc
core library version => xmlrpc-epi v. 0.51
php extension version => 0.51
author => Dan Libby
homepage => http://xmlrpc-epi.sourceforge.net
open sourced by => Epinions.com
xsl
XSL => enabled
libxslt Version => 1.1.12
libxslt compiled against libxml Version => 2.6.16
EXSLT => enabled
libexslt Version => 1.1.12
zlib
ZLib Support => enabled
Compiled Version => 1.2.1
Linked Version => 1.2.1
Directive => Local Value => Master Value
zlib.output_compression => Off => Off
zlib.output_compression_level => -1 => -1
zlib.output_handler => no value => no value
Additional Modules
Module Name
readline
sysvsem
sysvshm
Environment
Variable => Value
PVR => 5.0.3
REMOTEHOST => 192.168.0.131
A => php-5.0.3.tar.bz2
MANPATH => /usr/share/man:/usr/local/share/man:/usr/share/gcc-data/i686-pc-linux-gnu/3.3/man
INFODIR => /usr/share/info
STARTDIR => /usr/src
HOSTNAME => charger
TEST_PHP_SRCDIR => /var/tmp/portage/mod_php-5.0.3/work/php-5.0.3
D => /var/tmp/portage/mod_php-5.0.3/image/
SLOT => 2
KVERS => .
SANDBOX_WRITE =>
/dev/zero:/dev/fd/:/dev/null:/dev/pts/:/dev/vc/:/dev/tty:/tmp/:/dev/shm/ngpt:/var/log/scrollkeeper.log:/usr/tmp/conftest:/usr/lib/conftest:/usr/lib32/conftest:/usr/lib64/conftest:/usr/tmp/cf:/usr/lib/cf:/usr/lib32/cf:/usr/lib64/cf:/var/tmp/portage/homedir/.gconfd/lock:/var/tmp/portage/homedir/.bash_history:/var/tmp:/tmp:/var/tmp:/tmp/:/var/tmp/:/dev/shm:/var/tmp:/root/.ccache
SANDBOX_LIB => /lib/libsandbox.so
SHELL => /bin/sh
TERM => xterm
MAKEFLAGS =>
KV => 2.6.7-hardened-r9
TMPDIR => /var/tmp/portage/mod_php-5.0.3/temp
SSH_CLIENT => deleted
CATEGORY => dev-php
CCACHE_SIZE => 2G
GENTOO_MIRRORS => http://gentoo.math.bme.hu
http://gentoo.mirror.icd.hu/ http://gentoo.inode.at/
http://gd.tuwien.ac.at/opsys/linux/gentoo/ http://linux.rz.ruhr-uni-bochum.de/download/gentoo-mirror/
http://ftp.uni-erlangen.de/pub/mirrors/gentoo http://mirrors.sec.informatik.tu-darmstadt.de/gentoo/
http://ftp-stud.fht-esslingen.de/pub/Mirrors/gentoo/
EXEOPTIONS => -m0755
LD_PRELOAD => /lib/libsandbox.so
FILESDIR => /usr/portage/dev-php/mod_php/files
OLDPWD => /var/tmp/portage/mod_php-5.0.3/work/php-5.0.3
ACCEPT_LICENSE =>
DESTTREE => /usr
EXEDESTTREE =>
SSH_TTY => deleted
O => /usr/portage/dev-php/mod_php
SANDBOX_PREDICT =>
/var/tmp/portage/homedir/.:/usr/lib/python2.0/:/usr/lib/python2.1/:/usr/lib/python2.2/:/usr/lib/python2.3/:/usr/lib/python2.4/:/usr/lib/python2.5/:/usr/lib/python3.0/::/proc/self/maps:/dev/console:/usr/lib/portage/pym:/dev/random:/
P => mod_php-5.0.3
ECLASSDIR => /usr/portage//eclass
USE => x86 apache2 bash-completion bcmath berkdb bzip2 bzlib calendar chroot clamav crypt curl
curlwrappers dba erandom gd gif hardened hardenedphp iconv jpeg ldap maildir mcal memlimit mhash mmx
mmx2 mysql nls nptl nptlonly pam pcntl pcre php pic pie png posix postgres readline sftplogging
simplexml slang soap sockets spell spl sse sse2 ssl sysvipc threads tidy tiff tokenizer truetype
unicode userlocales wddx wildlsearch xml xml2 xmlrpc xsl xslt zlib
USER => root
PORTAGE_ARCHLIST => alpha amd64 arm hppa ia64 m68k mips ppc ppc64 ppc-macos ppc-od s390 sh sparc
x86 x86-fbsd x86-obsd x86-od
AA => php-5.0.3.tar.bz2
PRELINK_PATH_MASK =>
SCRIPT_FILENAME =>
S => /var/tmp/portage/mod_php-5.0.3/work/php-5.0.3
T => /var/tmp/portage/mod_php-5.0.3/temp
AUTOCLEAN => yes
WORKDIR => /var/tmp/portage/mod_php-5.0.3/work
SSH_AUTH_SOCK => deleted
SANDBOX_DENY => /etc/ld.so.preload
PROFILE_PATHS => /usr/portage/profiles/base
/usr/portage/profiles/hardened
/usr/portage/profiles/hardened/x86
/etc/portage/profile
CXXFLAGS => -O2 -march=pentium3 -fomit-frame-pointer -pipe -funroll-loops -fforce-addr
-fprefetch-loop-arrays -pthread -prefer-pic
MAKEOPTS => -j3
RESTRICT =>
MAKELEVEL => 1
CONFIG_PROTECT_MASK => /etc/terminfo
PAGER => /usr/bin/less
MFLAGS =>
PORTAGE_BASHRC => /etc/portage/bashrc
FETCHCOMMAND => /usr/bin/wget -t 5 --passive-ftp -P ${DISTDIR} ${URI}
PORTAGE_CALLER => emerge
PATH =>
/usr/lib/ccache/bin:/sbin:/usr/sbin:/usr/lib/portage/bin:/bin:/usr/bin:/usr/local/bin:/opt/bin:/usr/i686-pc-linux-gnu/gcc-bin/3.3
SANDBOX_DIR => (null)/
MAIL => /var/mail/root
GLIBC_SSP_CHECKED => 1
SANDBOX_ACTIVE => armedandready
RESUMECOMMAND => /usr/bin/wget -c -t 5 --passive-ftp -P ${DISTDIR} ${URI}
PORTAGE_TMPDIR => /var/tmp
CHOST => i686-pc-linux-gnu
ECLASS_DEPTH => 0
PWD => /var/tmp/portage/mod_php-5.0.3/work/php-5.0.3
INPUTRC => /etc/inputrc
PR => r0
SANDBOX_ON => 1
EDITOR => /bin/nano
PKGDIR => /usr/portage//packages/x86/
GRP_STAGE23_USE => x86 berkdb crypt readline nls ssl tcpd zlib pam pic pie hardened dlloader
TEST_PHP_EXECUTABLE => /var/tmp/portage/mod_php-5.0.3/work/php-5.0.3/sapi/cli/php
REDIRECT_STATUS =>
PV => 5.0.3
SANDBOX_LOG => /tmp/sandbox-dev-php_-_mod_php-5.0.3-29229.log
XARGS => xargs -r
EBUILD_PHASE => test
PORTAGE_GID => 250
CLEAN_DELAY => 5
PKGUSE => dba
INSDESTTREE =>
ROOT => /
LIBOPTIONS => -m0644
PATH_TRANSLATED =>
USERLAND => GNU
CXX => g++
BUILD_PREFIX => /var/tmp/portage
SANDBOX_READ => /:/dev/shm:/var/tmp:/root/.ccache
MOPREFIX => mod_php
BUILDDIR => /var/tmp/portage/mod_php-5.0.3
HOME => /var/tmp/portage/homedir
SHLVL => 5
CONTENT_LENGTH =>
DOCDESTTREE =>
SANDBOX_DEBUG_LOG => /tmp/sandbox-debug-.log
INHERITED => confutils libtool php5-sapi eutils libtool php5-sapi eutils libtool php5-sapi eutils
libtool php5-sapi eutils libtool php5-sapi eutils
PRELINK_PATH =>
CFLAGS => -O2 -march=pentium3 -fomit-frame-pointer -pipe -funroll-loops -fforce-addr
-fprefetch-loop-arrays -pthread -DZTS -prefer-pic
RSYNC_RETRIES => 3
DIROPTIONS => -m0755
BASH_ENV => /etc/spork/is/not/valid/profile.env
TMP => /var/tmp/portage/mod_php-5.0.3/temp
LOGNAME => root
RSYNC_TIMEOUT => 180
LESS => -R
QUERY_STRING =>
RPMDIR => /usr/portage/rpm
CVS_RSH => ssh
SSH_CONNECTION => 192.168.0.131 1828 192.168.0.155 22
ROOTPATH => /usr/local/bin:/opt/bin:/usr/i686-pc-linux-gnu/gcc-bin/3.3
PF => mod_php-5.0.3
EBUILD => /usr/portage/dev-php/mod_php/mod_php-5.0.3.ebuild
LESSOPEN => |lesspipe.sh %s
ACCEPT_KEYWORDS => x86 ~x86
ARCH => x86
SYNC => rsync://rsync.gentoo.org/gentoo-portage
INFOPATH => /usr/share/info:/usr/share/gcc-data/i686-pc-linux-gnu/3.3/info
PKG_TMPDIR => /var/tmp/portage-pkg
CONTENT_TYPE =>
NOCOLOR => false
CC => /var/tmp/portage/mod_php-5.0.3/work/php-5.0.3/meta_ccld
PORTAGE_BINHOST_CHUNKSIZE => 3000
ECLASS =>
USE_EXPAND => VIDEO_CARDS INPUT_DEVICES LINGUAS
REQUEST_METHOD =>
PORTAGE_MASTER_PID => 5157
FEATURES => autoaddcvs autoconfig ccache distlocks maketest sandbox
DISTDIR => /usr/portage/distfiles
PN => mod_php
PORTDIR => /usr/portage/
EMERGE_FROM => ebuild
INSOPTIONS => -m0644
CONFIG_PROTECT => /etc /usr/kde/2/share/config /usr/kde/3/share/config /usr/share/config
/var/qmail/control
_ => /var/tmp/portage/mod_php-5.0.3/work/php-5.0.3/sapi/cli/php
PHP Variables
Variable => Value
_SERVER["PVR"] => 5.0.3
_SERVER["REMOTEHOST"] => 192.168.0.131
_SERVER["A"] => php-5.0.3.tar.bz2
_SERVER["MANPATH"] =>
/usr/share/man:/usr/local/share/man:/usr/share/gcc-data/i686-pc-linux-gnu/3.3/man
_SERVER["INFODIR"] => /usr/share/info
_SERVER["STARTDIR"] => /usr/src
_SERVER["HOSTNAME"] => charger
_SERVER["TEST_PHP_SRCDIR"] => /var/tmp/portage/mod_php-5.0.3/work/php-5.0.3
_SERVER["D"] => /var/tmp/portage/mod_php-5.0.3/image/
_SERVER["SLOT"] => 2
_SERVER["KVERS"] => .
_SERVER["SANDBOX_WRITE"] =>
/dev/zero:/dev/fd/:/dev/null:/dev/pts/:/dev/vc/:/dev/tty:/tmp/:/dev/shm/ngpt:/var/log/scrollkeeper.log:/usr/tmp/conftest:/usr/lib/conftest:/usr/lib32/conftest:/usr/lib64/conftest:/usr/tmp/cf:/usr/lib/cf:/usr/lib32/cf:/usr/lib64/cf:/var/tmp/portage/homedir/.gconfd/lock:/var/tmp/portage/homedir/.bash_history:/var/tmp:/tmp:/var/tmp:/tmp/:/var/tmp/:/dev/shm:/var/tmp:/root/.ccache
_SERVER["SANDBOX_LIB"] => /lib/libsandbox.so
_SERVER["SHELL"] => /bin/sh
_SERVER["TERM"] => xterm
_SERVER["MAKEFLAGS"] =>
_SERVER["KV"] => 2.6.7-hardened-r9
_SERVER["TMPDIR"] => /var/tmp/portage/mod_php-5.0.3/temp
_SERVER["SSH_CLIENT"] => deleted
_SERVER["CATEGORY"] => dev-php
_SERVER["CCACHE_SIZE"] => 2G
_SERVER["GENTOO_MIRRORS"] => http://gentoo.math.bme.hu http://gentoo.mirror.icd.hu/ http://gentoo.inode.at/
http://gd.tuwien.ac.at/opsys/linux/gentoo/ http://linux.rz.ruhr-uni-bochum.de/download/gentoo-mirror/
http://ftp.uni-erlangen.de/pub/mirrors/gentoo http://mirrors.sec.informatik.tu-darmstadt.de/gentoo/
http://ftp-stud.fht-esslingen.de/pub/Mirrors/gentoo/
_SERVER["EXEOPTIONS"] => -m0755
_SERVER["LD_PRELOAD"] => /lib/libsandbox.so
_SERVER["FILESDIR"] => /usr/portage/dev-php/mod_php/files
_SERVER["OLDPWD"] => /var/tmp/portage/mod_php-5.0.3/work/php-5.0.3
_SERVER["ACCEPT_LICENSE"] =>
_SERVER["DESTTREE"] => /usr
_SERVER["EXEDESTTREE"] =>
_SERVER["SSH_TTY"] => deleted
_SERVER["O"] => /usr/portage/dev-php/mod_php
_SERVER["SANDBOX_PREDICT"] =>
/var/tmp/portage/homedir/.:/usr/lib/python2.0/:/usr/lib/python2.1/:/usr/lib/python2.2/:/usr/lib/python2.3/:/usr/lib/python2.4/:/usr/lib/python2.5/:/usr/lib/python3.0/::/proc/self/maps:/dev/console:/usr/lib/portage/pym:/dev/random:/
_SERVER["P"] => mod_php-5.0.3
_SERVER["ECLASSDIR"] => /usr/portage//eclass
_SERVER["USE"] => x86 apache2 bash-completion bcmath berkdb bzip2 bzlib calendar chroot
clamav crypt curl curlwrappers dba erandom gd gif hardened hardenedphp iconv jpeg ldap maildir mcal
memlimit mhash mmx mmx2 mysql nls nptl nptlonly pam pcntl pcre php pic pie png posix postgres
readline sftplogging simplexml slang soap sockets spell spl sse sse2 ssl sysvipc threads tidy tiff
tokenizer truetype unicode userlocales wddx wildlsearch xml xml2 xmlrpc xsl xslt zlib
_SERVER["USER"] => root
_SERVER["PORTAGE_ARCHLIST"] => alpha amd64 arm hppa ia64 m68k mips ppc ppc64 ppc-macos
ppc-od s390 sh sparc x86 x86-fbsd x86-obsd x86-od
_SERVER["AA"] => php-5.0.3.tar.bz2
_SERVER["PRELINK_PATH_MASK"] =>
_SERVER["SCRIPT_FILENAME"] =>
_SERVER["S"] => /var/tmp/portage/mod_php-5.0.3/work/php-5.0.3
_SERVER["T"] => /var/tmp/portage/mod_php-5.0.3/temp
_SERVER["AUTOCLEAN"] => yes
_SERVER["WORKDIR"] => /var/tmp/portage/mod_php-5.0.3/work
_SERVER["SSH_AUTH_SOCK"] => deleted
_SERVER["SANDBOX_DENY"] => /etc/ld.so.preload
_SERVER["PROFILE_PATHS"] => /usr/portage/profiles/base
/usr/portage/profiles/hardened
/usr/portage/profiles/hardened/x86
/etc/portage/profile
_SERVER["CXXFLAGS"] => -O2 -march=pentium3 -fomit-frame-pointer -pipe -funroll-loops
-fforce-addr -fprefetch-loop-arrays -pthread -prefer-pic
_SERVER["MAKEOPTS"] => -j3
_SERVER["RESTRICT"] =>
_SERVER["MAKELEVEL"] => 1
_SERVER["CONFIG_PROTECT_MASK"] => /etc/terminfo
_SERVER["PAGER"] => /usr/bin/less
_SERVER["MFLAGS"] =>
_SERVER["PORTAGE_BASHRC"] => /etc/portage/bashrc
_SERVER["FETCHCOMMAND"] => /usr/bin/wget -t 5 --passive-ftp -P ${DISTDIR} ${URI}
_SERVER["PORTAGE_CALLER"] => emerge
_SERVER["PATH"] =>
/usr/lib/ccache/bin:/sbin:/usr/sbin:/usr/lib/portage/bin:/bin:/usr/bin:/usr/local/bin:/opt/bin:/usr/i686-pc-linux-gnu/gcc-bin/3.3
_SERVER["SANDBOX_DIR"] => (null)/
_SERVER["MAIL"] => /var/mail/root
_SERVER["GLIBC_SSP_CHECKED"] => 1
_SERVER["SANDBOX_ACTIVE"] => armedandready
_SERVER["RESUMECOMMAND"] => /usr/bin/wget -c -t 5 --passive-ftp -P ${DISTDIR} ${URI}
_SERVER["PORTAGE_TMPDIR"] => /var/tmp
_SERVER["CHOST"] => i686-pc-linux-gnu
_SERVER["ECLASS_DEPTH"] => 0
_SERVER["PWD"] => /var/tmp/portage/mod_php-5.0.3/work/php-5.0.3
_SERVER["INPUTRC"] => /etc/inputrc
_SERVER["PR"] => r0
_SERVER["SANDBOX_ON"] => 1
_SERVER["EDITOR"] => /bin/nano
_SERVER["PKGDIR"] => /usr/portage//packages/x86/
_SERVER["GRP_STAGE23_USE"] => x86 berkdb crypt readline nls ssl tcpd zlib pam pic pie
hardened dlloader
_SERVER["TEST_PHP_EXECUTABLE"] =>
/var/tmp/portage/mod_php-5.0.3/work/php-5.0.3/sapi/cli/php
_SERVER["REDIRECT_STATUS"] =>
_SERVER["PV"] => 5.0.3
_SERVER["SANDBOX_LOG"] => /tmp/sandbox-dev-php_-_mod_php-5.0.3-29229.log
_SERVER["XARGS"] => xargs -r
_SERVER["EBUILD_PHASE"] => test
_SERVER["PORTAGE_GID"] => 250
_SERVER["CLEAN_DELAY"] => 5
_SERVER["PKGUSE"] => dba
_SERVER["INSDESTTREE"] =>
_SERVER["ROOT"] => /
_SERVER["LIBOPTIONS"] => -m0644
_SERVER["PATH_TRANSLATED"] =>
_SERVER["USERLAND"] => GNU
_SERVER["CXX"] => g++
_SERVER["BUILD_PREFIX"] => /var/tmp/portage
_SERVER["SANDBOX_READ"] => /:/dev/shm:/var/tmp:/root/.ccache
_SERVER["MOPREFIX"] => mod_php
_SERVER["BUILDDIR"] => /var/tmp/portage/mod_php-5.0.3
_SERVER["HOME"] => /var/tmp/portage/homedir
_SERVER["SHLVL"] => 5
_SERVER["CONTENT_LENGTH"] =>
_SERVER["DOCDESTTREE"] =>
_SERVER["SANDBOX_DEBUG_LOG"] => /tmp/sandbox-debug-.log
_SERVER["INHERITED"] => confutils libtool php5-sapi eutils libtool php5-sapi eutils
libtool php5-sapi eutils libtool php5-sapi eutils libtool php5-sapi eutils
_SERVER["PRELINK_PATH"] =>
_SERVER["CFLAGS"] => -O2 -march=pentium3 -fomit-frame-pointer -pipe -funroll-loops
-fforce-addr -fprefetch-loop-arrays -pthread -DZTS -prefer-pic
_SERVER["RSYNC_RETRIES"] => 3
_SERVER["DIROPTIONS"] => -m0755
_SERVER["BASH_ENV"] => /etc/spork/is/not/valid/profile.env
_SERVER["TMP"] => /var/tmp/portage/mod_php-5.0.3/temp
_SERVER["LOGNAME"] => root
_SERVER["RSYNC_TIMEOUT"] => 180
_SERVER["LESS"] => -R
_SERVER["QUERY_STRING"] =>
_SERVER["RPMDIR"] => /usr/portage/rpm
_SERVER["CVS_RSH"] => ssh
_SERVER["SSH_CONNECTION"] => 192.168.0.131 1828 192.168.0.155 22
_SERVER["ROOTPATH"] => /usr/local/bin:/opt/bin:/usr/i686-pc-linux-gnu/gcc-bin/3.3
_SERVER["PF"] => mod_php-5.0.3
_SERVER["EBUILD"] => /usr/portage/dev-php/mod_php/mod_php-5.0.3.ebuild
_SERVER["LESSOPEN"] => |lesspipe.sh %s
_SERVER["ACCEPT_KEYWORDS"] => x86 ~x86
_SERVER["ARCH"] => x86
_SERVER["SYNC"] => rsync://rsync.gentoo.org/gentoo-portage
_SERVER["INFOPATH"] => /usr/share/info:/usr/share/gcc-data/i686-pc-linux-gnu/3.3/info
_SERVER["PKG_TMPDIR"] => /var/tmp/portage-pkg
_SERVER["CONTENT_TYPE"] =>
_SERVER["NOCOLOR"] => false
_SERVER["CC"] => /var/tmp/portage/mod_php-5.0.3/work/php-5.0.3/meta_ccld
_SERVER["PORTAGE_BINHOST_CHUNKSIZE"] => 3000
_SERVER["ECLASS"] =>
_SERVER["USE_EXPAND"] => VIDEO_CARDS INPUT_DEVICES LINGUAS
_SERVER["REQUEST_METHOD"] =>
_SERVER["PORTAGE_MASTER_PID"] => 5157
_SERVER["FEATURES"] => autoaddcvs autoconfig ccache distlocks maketest sandbox
_SERVER["DISTDIR"] => /usr/portage/distfiles
_SERVER["PN"] => mod_php
_SERVER["PORTDIR"] => /usr/portage/
_SERVER["EMERGE_FROM"] => ebuild
_SERVER["INSOPTIONS"] => -m0644
_SERVER["CONFIG_PROTECT"] => /etc /usr/kde/2/share/config /usr/kde/3/share/config
/usr/share/config /var/qmail/control
_SERVER["_"] => /var/tmp/portage/mod_php-5.0.3/work/php-5.0.3/sapi/cli/php
_SERVER["PHP_SELF"] =>
_SERVER["SCRIPT_NAME"] =>
_SERVER["DOCUMENT_ROOT"] =>
_SERVER["argv"] => Array
(
)
_SERVER["argc"] => 0
_ENV["PVR"] => 5.0.3
_ENV["REMOTEHOST"] => 192.168.0.131
_ENV["A"] => php-5.0.3.tar.bz2
_ENV["MANPATH"] =>
/usr/share/man:/usr/local/share/man:/usr/share/gcc-data/i686-pc-linux-gnu/3.3/man
_ENV["INFODIR"] => /usr/share/info
_ENV["STARTDIR"] => /usr/src
_ENV["HOSTNAME"] => charger
_ENV["TEST_PHP_SRCDIR"] => /var/tmp/portage/mod_php-5.0.3/work/php-5.0.3
_ENV["D"] => /var/tmp/portage/mod_php-5.0.3/image/
_ENV["SLOT"] => 2
_ENV["KVERS"] => .
_ENV["SANDBOX_WRITE"] =>
/dev/zero:/dev/fd/:/dev/null:/dev/pts/:/dev/vc/:/dev/tty:/tmp/:/dev/shm/ngpt:/var/log/scrollkeeper.log:/usr/tmp/conftest:/usr/lib/conftest:/usr/lib32/conftest:/usr/lib64/conftest:/usr/tmp/cf:/usr/lib/cf:/usr/lib32/cf:/usr/lib64/cf:/var/tmp/portage/homedir/.gconfd/lock:/var/tmp/portage/homedir/.bash_history:/var/tmp:/tmp:/var/tmp:/tmp/:/var/tmp/:/dev/shm:/var/tmp:/root/.ccache
_ENV["SANDBOX_LIB"] => /lib/libsandbox.so
_ENV["SHELL"] => /bin/sh
_ENV["TERM"] => xterm
_ENV["MAKEFLAGS"] =>
_ENV["KV"] => 2.6.7-hardened-r9
_ENV["TMPDIR"] => /var/tmp/portage/mod_php-5.0.3/temp
_ENV["SSH_CLIENT"] => deleted
_ENV["CATEGORY"] => dev-php
_ENV["CCACHE_SIZE"] => 2G
_ENV["GENTOO_MIRRORS"] => http://gentoo.math.bme.hu http://gentoo.mirror.icd.hu/ http://gentoo.inode.at/
http://gd.tuwien.ac.at/opsys/linux/gentoo/ http://linux.rz.ruhr-uni-bochum.de/download/gentoo-mirror/
http://ftp.uni-erlangen.de/pub/mirrors/gentoo http://mirrors.sec.informatik.tu-darmstadt.de/gentoo/
http://ftp-stud.fht-esslingen.de/pub/Mirrors/gentoo/
_ENV["EXEOPTIONS"] => -m0755
_ENV["LD_PRELOAD"] => /lib/libsandbox.so
_ENV["FILESDIR"] => /usr/portage/dev-php/mod_php/files
_ENV["OLDPWD"] => /var/tmp/portage/mod_php-5.0.3/work/php-5.0.3
_ENV["ACCEPT_LICENSE"] =>
_ENV["DESTTREE"] => /usr
_ENV["EXEDESTTREE"] =>
_ENV["SSH_TTY"] => deleted
_ENV["O"] => /usr/portage/dev-php/mod_php
_ENV["SANDBOX_PREDICT"] =>
/var/tmp/portage/homedir/.:/usr/lib/python2.0/:/usr/lib/python2.1/:/usr/lib/python2.2/:/usr/lib/python2.3/:/usr/lib/python2.4/:/usr/lib/python2.5/:/usr/lib/python3.0/::/proc/self/maps:/dev/console:/usr/lib/portage/pym:/dev/random:/
_ENV["P"] => mod_php-5.0.3
_ENV["ECLASSDIR"] => /usr/portage//eclass
_ENV["USE"] => x86 apache2 bash-completion bcmath berkdb bzip2 bzlib calendar chroot
clamav crypt curl curlwrappers dba erandom gd gif hardened hardenedphp iconv jpeg ldap maildir mcal
memlimit mhash mmx mmx2 mysql nls nptl nptlonly pam pcntl pcre php pic pie png posix postgres
readline sftplogging simplexml slang soap sockets spell spl sse sse2 ssl sysvipc threads tidy tiff
tokenizer truetype unicode userlocales wddx wildlsearch xml xml2 xmlrpc xsl xslt zlib
_ENV["USER"] => root
_ENV["PORTAGE_ARCHLIST"] => alpha amd64 arm hppa ia64 m68k mips ppc ppc64 ppc-macos
ppc-od s390 sh sparc x86 x86-fbsd x86-obsd x86-od
_ENV["AA"] => php-5.0.3.tar.bz2
_ENV["PRELINK_PATH_MASK"] =>
_ENV["SCRIPT_FILENAME"] =>
_ENV["S"] => /var/tmp/portage/mod_php-5.0.3/work/php-5.0.3
_ENV["T"] => /var/tmp/portage/mod_php-5.0.3/temp
_ENV["AUTOCLEAN"] => yes
_ENV["WORKDIR"] => /var/tmp/portage/mod_php-5.0.3/work
_ENV["SSH_AUTH_SOCK"] => deleted
_ENV["SANDBOX_DENY"] => /etc/ld.so.preload
_ENV["PROFILE_PATHS"] => /usr/portage/profiles/base
/usr/portage/profiles/hardened
/usr/portage/profiles/hardened/x86
/etc/portage/profile
_ENV["CXXFLAGS"] => -O2 -march=pentium3 -fomit-frame-pointer -pipe -funroll-loops
-fforce-addr -fprefetch-loop-arrays -pthread -prefer-pic
_ENV["MAKEOPTS"] => -j3
_ENV["RESTRICT"] =>
_ENV["MAKELEVEL"] => 1
_ENV["CONFIG_PROTECT_MASK"] => /etc/terminfo
_ENV["PAGER"] => /usr/bin/less
_ENV["MFLAGS"] =>
_ENV["PORTAGE_BASHRC"] => /etc/portage/bashrc
_ENV["FETCHCOMMAND"] => /usr/bin/wget -t 5 --passive-ftp -P ${DISTDIR} ${URI}
_ENV["PORTAGE_CALLER"] => emerge
_ENV["PATH"] =>
/usr/lib/ccache/bin:/sbin:/usr/sbin:/usr/lib/portage/bin:/bin:/usr/bin:/usr/local/bin:/opt/bin:/usr/i686-pc-linux-gnu/gcc-bin/3.3
_ENV["SANDBOX_DIR"] => (null)/
_ENV["MAIL"] => /var/mail/root
_ENV["GLIBC_SSP_CHECKED"] => 1
_ENV["SANDBOX_ACTIVE"] => armedandready
_ENV["RESUMECOMMAND"] => /usr/bin/wget -c -t 5 --passive-ftp -P ${DISTDIR} ${URI}
_ENV["PORTAGE_TMPDIR"] => /var/tmp
_ENV["CHOST"] => i686-pc-linux-gnu
_ENV["ECLASS_DEPTH"] => 0
_ENV["PWD"] => /var/tmp/portage/mod_php-5.0.3/work/php-5.0.3
_ENV["INPUTRC"] => /etc/inputrc
_ENV["PR"] => r0
_ENV["SANDBOX_ON"] => 1
_ENV["EDITOR"] => /bin/nano
_ENV["PKGDIR"] => /usr/portage//packages/x86/
_ENV["GRP_STAGE23_USE"] => x86 berkdb crypt readline nls ssl tcpd zlib pam pic pie
hardened dlloader
_ENV["TEST_PHP_EXECUTABLE"] =>
/var/tmp/portage/mod_php-5.0.3/work/php-5.0.3/sapi/cli/php
_ENV["REDIRECT_STATUS"] =>
_ENV["PV"] => 5.0.3
_ENV["SANDBOX_LOG"] => /tmp/sandbox-dev-php_-_mod_php-5.0.3-29229.log
_ENV["XARGS"] => xargs -r
_ENV["EBUILD_PHASE"] => test
_ENV["PORTAGE_GID"] => 250
_ENV["CLEAN_DELAY"] => 5
_ENV["PKGUSE"] => dba
_ENV["INSDESTTREE"] =>
_ENV["ROOT"] => /
_ENV["LIBOPTIONS"] => -m0644
_ENV["PATH_TRANSLATED"] =>
_ENV["USERLAND"] => GNU
_ENV["CXX"] => g++
_ENV["BUILD_PREFIX"] => /var/tmp/portage
_ENV["SANDBOX_READ"] => /:/dev/shm:/var/tmp:/root/.ccache
_ENV["MOPREFIX"] => mod_php
_ENV["BUILDDIR"] => /var/tmp/portage/mod_php-5.0.3
_ENV["HOME"] => /var/tmp/portage/homedir
_ENV["SHLVL"] => 5
_ENV["CONTENT_LENGTH"] =>
_ENV["DOCDESTTREE"] =>
_ENV["SANDBOX_DEBUG_LOG"] => /tmp/sandbox-debug-.log
_ENV["INHERITED"] => confutils libtool php5-sapi eutils libtool php5-sapi eutils
libtool php5-sapi eutils libtool php5-sapi eutils libtool php5-sapi eutils
_ENV["PRELINK_PATH"] =>
_ENV["CFLAGS"] => -O2 -march=pentium3 -fomit-frame-pointer -pipe -funroll-loops
-fforce-addr -fprefetch-loop-arrays -pthread -DZTS -prefer-pic
_ENV["RSYNC_RETRIES"] => 3
_ENV["DIROPTIONS"] => -m0755
_ENV["BASH_ENV"] => /etc/spork/is/not/valid/profile.env
_ENV["TMP"] => /var/tmp/portage/mod_php-5.0.3/temp
_ENV["LOGNAME"] => root
_ENV["RSYNC_TIMEOUT"] => 180
_ENV["LESS"] => -R
_ENV["QUERY_STRING"] =>
_ENV["RPMDIR"] => /usr/portage/rpm
_ENV["CVS_RSH"] => ssh
_ENV["SSH_CONNECTION"] => 192.168.0.131 1828 192.168.0.155 22
_ENV["ROOTPATH"] => /usr/local/bin:/opt/bin:/usr/i686-pc-linux-gnu/gcc-bin/3.3
_ENV["PF"] => mod_php-5.0.3
_ENV["EBUILD"] => /usr/portage/dev-php/mod_php/mod_php-5.0.3.ebuild
_ENV["LESSOPEN"] => |lesspipe.sh %s
_ENV["ACCEPT_KEYWORDS"] => x86 ~x86
_ENV["ARCH"] => x86
_ENV["SYNC"] => rsync://rsync.gentoo.org/gentoo-portage
_ENV["INFOPATH"] => /usr/share/info:/usr/share/gcc-data/i686-pc-linux-gnu/3.3/info
_ENV["PKG_TMPDIR"] => /var/tmp/portage-pkg
_ENV["CONTENT_TYPE"] =>
_ENV["NOCOLOR"] => false
_ENV["CC"] => /var/tmp/portage/mod_php-5.0.3/work/php-5.0.3/meta_ccld
_ENV["PORTAGE_BINHOST_CHUNKSIZE"] => 3000
_ENV["ECLASS"] =>
_ENV["USE_EXPAND"] => VIDEO_CARDS INPUT_DEVICES LINGUAS
_ENV["REQUEST_METHOD"] =>
_ENV["PORTAGE_MASTER_PID"] => 5157
_ENV["FEATURES"] => autoaddcvs autoconfig ccache distlocks maketest sandbox
_ENV["DISTDIR"] => /usr/portage/distfiles
_ENV["PN"] => mod_php
_ENV["PORTDIR"] => /usr/portage/
_ENV["EMERGE_FROM"] => ebuild
_ENV["INSOPTIONS"] => -m0644
_ENV["CONFIG_PROTECT"] => /etc /usr/kde/2/share/config /usr/kde/3/share/config
/usr/share/config /var/qmail/control
_ENV["_"] => /var/tmp/portage/mod_php-5.0.3/work/php-5.0.3/sapi/cli/php
PHP License
This program is free software; you can redistribute it and/or modify
it under the terms of the PHP License as published by the PHP Group
and included in the distribution in the file: LICENSE
This program is distributed in the hope that it will be useful,
but WITHOUT ANY WARRANTY; without even the implied warranty of
MERCHANTABILITY or FITNESS FOR A PARTICULAR PURPOSE.
If you did not receive a copy of the PHP license, or have any
questions about PHP licensing, please contact license@php.net.