Test results for 5.0.3 [failed]

From: Date: Sun, 16 Jan 2005 16:40:39 +0000
Subject: Test results for 5.0.3 [failed]
Groups: php.qa 
Request: Send a blank email to php-qa+get-22981@lists.php.net to get a copy of this message
===================================================================== FAILED TEST SUMMARY --------------------------------------------------------------------- Test for buffering in core functions with implicit flush off [tests/func/008.phpt] Convert warnings to exceptions [tests/lang/038.phpt] Bug #21800 (Segfault under interactive mode) [tests/lang/bug21800.phpt] Bug #29944 (function defined in switch crashes PHP) [tests/lang/bug29944.phpt] Bug #22836 (returning references to NULL) [Zend/tests/bug22836.phpt] Bug #28444 (Cannot access undefined property for object with overloaded property access) [Zend/tests/bug28444.phpt] Test 3: Exception Test [ext/dom/tests/dom003.phpt] HTML input/output [ext/mbstring/tests/htmlent.phpt] mb_output_handler() (Shift_JIS) [ext/mbstring/tests/mb_output_handler_shift_jis.phpt] mysql connect [ext/mysql/tests/001.phpt] Bug #29109 (Uncaught SoapFault exception: [WSDL] Out of memory) [ext/soap/tests/bugs/bug29109.phpt] Bug #29992 (foreach by reference corrupts the array) [ext/standard/tests/array/bug29992.phpt] Bug #20382 (strtotime ("Monday", $date) produces wrong result on DST changeover) [ext/standard/tests/time/bug20382.phpt] Bug #27780 (strtotime(+1 xxx) returns a wrong date/time) [ext/standard/tests/time/bug27780.phpt] Bug #26614 (CDATA sections skipped on line count) [ext/xml/tests/bug26614.phpt] ===================================================================== ===================================================================== TEST RESULT SUMMARY --------------------------------------------------------------------- Exts skipped : 62 Exts tested : 21 --------------------------------------------------------------------- Number of tests : 1291 862 Tests skipped : 429 (33.2%) -------- Tests warned : 0 (0.0%) (0.0%) Tests failed : 15 (1.2%) (1.7%) Tests passed : 847 (65.6%) (98.3%) --------------------------------------------------------------------- Time taken : 96 seconds ===================================================================== ===================================================================== FAILED TEST SUMMARY --------------------------------------------------------------------- Test for buffering in core functions with implicit flush off [tests/func/008.phpt] Convert warnings to exceptions [tests/lang/038.phpt] Bug #21800 (Segfault under interactive mode) [tests/lang/bug21800.phpt] Bug #29944 (function defined in switch crashes PHP) [tests/lang/bug29944.phpt] Bug #22836 (returning references to NULL) [Zend/tests/bug22836.phpt] Bug #28444 (Cannot access undefined property for object with overloaded property access) [Zend/tests/bug28444.phpt] Test 3: Exception Test [ext/dom/tests/dom003.phpt] HTML input/output [ext/mbstring/tests/htmlent.phpt] mb_output_handler() (Shift_JIS) [ext/mbstring/tests/mb_output_handler_shift_jis.phpt] mysql connect [ext/mysql/tests/001.phpt] Bug #29109 (Uncaught SoapFault exception: [WSDL] Out of memory) [ext/soap/tests/bugs/bug29109.phpt] Bug #29992 (foreach by reference corrupts the array) [ext/standard/tests/array/bug29992.phpt] Bug #20382 (strtotime ("Monday", $date) produces wrong result on DST changeover) [ext/standard/tests/time/bug20382.phpt] Bug #27780 (strtotime(+1 xxx) returns a wrong date/time) [ext/standard/tests/time/bug27780.phpt] Bug #26614 (CDATA sections skipped on line count) [ext/xml/tests/bug26614.phpt] ===================================================================== ================================================================================ /usr/local/src/php-5.0.3/tests/func/008.phpt ================================================================================ ---- EXPECTED OUTPUT 'foo1' 'foo2' ---- ACTUAL OUTPUT ---- FAILED ================================================================================ 001- 'foo1' 003- 'foo2' ================================================================================ ================================================================================ /usr/local/src/php-5.0.3/tests/lang/038.phpt ================================================================================ ---- EXPECTED OUTPUT string(15) "Error2Exception" string(5) "fopen" ===DONE=== ---- ACTUAL OUTPUT string(15) "Error2Exception" string(15) "Error2Exception" ===DONE=== ---- FAILED ================================================================================ 002+ string(15) "Error2Exception" 002- string(5) "fopen" ================================================================================ ================================================================================ /usr/local/src/php-5.0.3/tests/lang/bug21800.phpt ================================================================================ ---- EXPECTED OUTPUT Interactive mode enabled :test: ---- ACTUAL OUTPUT Interactive mode enabled :test: Segmentation fault (core dumped) ---- FAILED ================================================================================ 004+ Segmentation fault (core dumped) ================================================================================ ================================================================================ /usr/local/src/php-5.0.3/tests/lang/bug29944.phpt ================================================================================ ---- EXPECTED OUTPUT 1 ===DONE=== ---- ACTUAL OUTPUT Segmentation fault (core dumped) ---- FAILED ================================================================================ 001+ Segmentation fault (core dumped) 001- 1 002- ===DONE=== ================================================================================ ================================================================================ /usr/local/src/php-5.0.3/Zend/tests/bug22836.phpt ================================================================================ ---- EXPECTED OUTPUT string(3) "foo" 'foo' Notice: Undefined variable: a in %s on line %d Strict Standards: Only variable references should be returned by reference in %s on line %d string(3) "foo" 'foo' Notice: Undefined variable: a in %s on line %d Strict Standards: Only variable references should be returned by reference in %s on line %d string(3) "foo" 'foo' Notice: Undefined variable: a in %s on line %d Strict Standards: Only variable references should be returned by reference in %s on line %d string(3) "foo" 'foo' Notice: Undefined variable: a in %s on line %d Strict Standards: Only variable references should be returned by reference in %s on line %d string(3) "foo" 'foo' Notice: Undefined variable: a in %s on line %d Strict Standards: Only variable references should be returned by reference in %s on line %d string(3) "foo" 'foo' Notice: Undefined variable: a in %s on line %d Strict Standards: Only variable references should be returned by reference in %s on line %d string(3) "foo" 'foo' Notice: Undefined variable: a in %s on line %d Strict Standards: Only variable references should be returned by reference in %s on line %d string(3) "foo" 'foo' Notice: Undefined variable: a in %s on line %d Strict Standards: Only variable references should be returned by reference in %s on line %d string(3) "foo" 'foo' Notice: Undefined variable: a in %s on line %d Strict Standards: Only variable references should be returned by reference in %s on line %d ---- ACTUAL OUTPUT string(3) "foo" 'foo' Notice: Undefined variable: a in /usr/local/src/php-5.0.3/Zend/tests/bug22836.php on line 7 Strict Standards: Only variable references should be returned by reference in /usr/local/src/php-5.0.3/Zend/tests/bug22836.php on line 7 string(3) "foo" 'foo' Notice: Undefined variable: a in /usr/local/src/php-5.0.3/Zend/tests/bug22836.php on line 7 Strict Standards: Only variable references should be returned by reference in /usr/local/src/php-5.0.3/Zend/tests/bug22836.php on line 7 NULL 'foo' Notice: Undefined variable: a in /usr/local/src/php-5.0.3/Zend/tests/bug22836.php on line 7 NULL 'foo' Notice: Undefined variable: a in /usr/local/src/php-5.0.3/Zend/tests/bug22836.php on line 7 NULL 'foo' Notice: Undefined variable: a in /usr/local/src/php-5.0.3/Zend/tests/bug22836.php on line 7 NULL 'foo' Notice: Undefined variable: a in /usr/local/src/php-5.0.3/Zend/tests/bug22836.php on line 7 NULL 'foo' Notice: Undefined variable: a in /usr/local/src/php-5.0.3/Zend/tests/bug22836.php on line 7 NULL 'foo' Notice: Undefined variable: a in /usr/local/src/php-5.0.3/Zend/tests/bug22836.php on line 7 ---- FAILED ================================================================================ 013+ NULL 013- string(3) "foo" 017+ NULL 018+ 'foo' 018- Strict Standards: Only variable references should be returned by reference in %s on line %d 019- string(3) "foo" 020+ Notice: Undefined variable: a in /usr/local/src/php-5.0.3/Zend/tests/bug22836.php on line 7 021+ NULL 022+ 'foo' 023+ 024+ Notice: Undefined variable: a in /usr/local/src/php-5.0.3/Zend/tests/bug22836.php on line 7 025+ NULL 026+ 'foo' 027+ 028+ Notice: Undefined variable: a in /usr/local/src/php-5.0.3/Zend/tests/bug22836.php on line 7 029+ NULL 030+ 'foo' 031+ 032+ Notice: Undefined variable: a in /usr/local/src/php-5.0.3/Zend/tests/bug22836.php on line 7 033+ NULL 023- 024- Strict Standards: Only variable references should be returned by reference in %s on line %d 025- string(3) "foo" 026- 'foo' 027- 028- Notice: Undefined variable: a in %s on line %d 029- 030- Strict Standards: Only variable references should be returned by reference in %s on line %d 031- string(3) "foo" 032- 'foo' 033- 034- Notice: Undefined variable: a in %s on line %d 035- 036- Strict Standards: Only variable references should be returned by reference in %s on line %d 037- string(3) "foo" 038- 'foo' 039- 040- Notice: Undefined variable: a in %s on line %d 041- 042- Strict Standards: Only variable references should be returned by reference in %s on line %d 043- string(3) "foo" 044- 'foo' 045- 046- Notice: Undefined variable: a in %s on line %d 047- 048- Strict Standards: Only variable references should be returned by reference in %s on line %d 049- string(3) "foo" 050- 'foo' 051- 052- Notice: Undefined variable: a in %s on line %d 053- 054- Strict Standards: Only variable references should be returned by reference in %s on line %d ================================================================================ ================================================================================ /usr/local/src/php-5.0.3/Zend/tests/bug28444.phpt ================================================================================ ---- EXPECTED OUTPUT object(Object)#%d (1) { ["x"]=> int(2) } int(2) int(3) Overloaded::__set(y,3) int(3) Overloaded::__get(y) int(3) Overloaded::__set(z,Object id #3) object(Object)#%d (1) { ["x"]=> int(4) } Overloaded::__get(z) int(4) Overloaded::__get(z) int(5) Overloaded::__get(z) int(6) ===DONE=== ---- ACTUAL OUTPUT object(Object)#2 (1) { ["x"]=> int(2) } int(2) int(3) Overloaded::__set(y,3) int(3) Overloaded::__get(y) int(3) Overloaded::__set(z,Object id #3) object(Object)#3 (1) { ["x"]=> int(4) } Overloaded::__get(z) int(4) Overloaded::__get(z) int(5) Fatal error: Cannot access undefined property for object with overloaded property access in /usr/local/src/php-5.0.3/Zend/tests/bug28444.php on line 45 ---- FAILED ================================================================================ 020+ 021+ Fatal error: Cannot access undefined property for object with overloaded property access in /usr/local/src/php-5.0.3/Zend/tests/bug28444.php on line 45 020- Overloaded::__get(z) 021- int(6) 022- ===DONE=== ================================================================================ ================================================================================ /usr/local/src/php-5.0.3/ext/dom/tests/dom003.phpt ================================================================================ ---- EXPECTED OUTPUT --- Catch exception with try/catch object(DOMException)#%d (6) { ["message:protected"]=> string(23) "Hierarchy Request Error" ["string:private"]=> string(0) "" ["file:protected"]=> string(%d) "%s/ext/dom/tests/dom003.php" ["line:protected"]=> int(8) ["trace:private"]=> array(0) { } ["code"]=> int(3) } --- Don't catch exception with try/catch Fatal error: Uncaught exception 'DOMException' with message 'Hierarchy Request Error' in %sdom003.php:%d Stack trace: #0 {main} thrown in %sdom003.php on line %d ---- ACTUAL OUTPUT --- Catch exception with try/catch object(DOMException)#3 (6) { ["message:protected"]=> string(23) "Hierarchy Request Error" ["string:private"]=> string(0) "" ["file:protected"]=> string(49) "/usr/local/src/php-5.0.3/ext/dom/tests/dom003.php" ["line:protected"]=> int(8) ["trace:private"]=> array(1) { [0]=> array(6) { ["file"]=> string(49) "/usr/local/src/php-5.0.3/ext/dom/tests/dom003.php" ["line"]=> int(8) ["function"]=> string(11) "appendChild" ["class"]=> string(10) "DOMElement" ["type"]=> string(2) "->" ["args"]=> array(1) { [0]=> object(DOMElement)#2 (0) { } } } } ["code"]=> int(3) } --- Don't catch exception with try/catch Fatal error: Uncaught exception 'DOMException' with message 'Hierarchy Request Error' in /usr/local/src/php-5.0.3/ext/dom/tests/dom003.php:13 Stack trace: #0 /usr/local/src/php-5.0.3/ext/dom/tests/dom003.php(13): DOMElement->appendChild(Object(DOMElement)) #1 {main} thrown in /usr/local/src/php-5.0.3/ext/dom/tests/dom003.php on line 13 ---- FAILED ================================================================================ 012+ array(1) { 013+ [0]=> 014+ array(6) { 015+ ["file"]=> 016+ string(49) "/usr/local/src/php-5.0.3/ext/dom/tests/dom003.php" 017+ ["line"]=> 018+ int(8) 019+ ["function"]=> 020+ string(11) "appendChild" 021+ ["class"]=> 022+ string(10) "DOMElement" 012- array(0) { 013- } 014- ["code"]=> 015- int(3) 016- } 017- --- Don't catch exception with try/catch 018- 019- Fatal error: Uncaught exception 'DOMException' with message 'Hierarchy Request Error' in %sdom003.php:%d 020- Stack trace: 021- #0 {main} 022- thrown in %sdom003.php on line %d 023+ ["type"]=> 024+ string(2) "->" 025+ ["args"]=> 026+ array(1) { 027+ [0]=> 028+ object(DOMElement)#2 (0) { 029+ } 030+ } 031+ } 032+ } 033+ ["code"]=> 034+ int(3) 035+ } 036+ --- Don't catch exception with try/catch 037+ 038+ Fatal error: Uncaught exception 'DOMException' with message 'Hierarchy Request Error' in /usr/local/src/php-5.0.3/ext/dom/tests/dom003.php:13 039+ Stack trace: 040+ #0 /usr/local/src/php-5.0.3/ext/dom/tests/dom003.php(13): DOMElement->appendChild(Object(DOMElement)) 041+ #1 {main} 042+ thrown in /usr/local/src/php-5.0.3/ext/dom/tests/dom003.php on line 13 ================================================================================ ================================================================================ /usr/local/src/php-5.0.3/ext/mbstring/tests/htmlent.phpt ================================================================================ ---- EXPECTED OUTPUT HTML-ENTITIES>UTF-8>HTML-ENTITIES test='&&;&@AB&#128;&#129;&#130;&auml;&ouml;&uuml;&euro;&lang;&rang;' ---- ACTUAL OUTPUT ---- FAILED ================================================================================ 001+ 001- HTML-ENTITIES>UTF-8>HTML-ENTITIES 002- test='&&;&@AB&#128;&#129;&#130;&auml;&ouml;&uuml;&euro;&lang;&rang;' ================================================================================ ================================================================================ /usr/local/src/php-5.0.3/ext/mbstring/tests/mb_output_handler_shift_jis.phpt ================================================================================ ---- EXPECTED OUTPUT string(73) "¥Æ¥¹¥ÈÍÑÆüËܸìʸ»úÎ󡣤³¤Î¥â¥¸¥å¡¼¥ë¤ÏPHP¤Ë¥Þ¥ë¥Á¥Ð¥¤¥È´Ø¿ô¤òÄ󶡤·¤Þ¤¹¡£" ---- ACTUAL OUTPUT ---- FAILED ================================================================================ 001+ 001- string(73) "¥Æ¥¹¥ÈÍÑÆüËܸìʸ»úÎ󡣤³¤Î¥â¥¸¥å¡¼¥ë¤ÏPHP¤Ë¥Þ¥ë¥Á¥Ð¥¤¥È´Ø¿ô¤òÄ󶡤·¤Þ¤¹¡£" ================================================================================ ================================================================================ /usr/local/src/php-5.0.3/ext/mysql/tests/001.phpt ================================================================================ ---- EXPECTED OUTPUT string(3) "111" ---- ACTUAL OUTPUT Warning: mysql_connect(): #HY000Host '202.6.247.91' is not allowed to connect to this MySQL server in /usr/local/src/php-5.0.3/ext/mysql/tests/001.php on line 7 Warning: mysql_close(): supplied argument is not a valid MySQL-Link resource in /usr/local/src/php-5.0.3/ext/mysql/tests/001.php on line 9 string(3) "011" ---- FAILED ================================================================================ 001+ Warning: mysql_connect(): #HY000Host '202.6.247.91' is not allowed to connect to this MySQL server in /usr/local/src/php-5.0.3/ext/mysql/tests/001.php on line 7 001- string(3) "111" 002+ 003+ Warning: mysql_close(): supplied argument is not a valid MySQL-Link resource in /usr/local/src/php-5.0.3/ext/mysql/tests/001.php on line 9 004+ string(3) "011" ================================================================================ ================================================================================ /usr/local/src/php-5.0.3/ext/soap/tests/bugs/bug29109.phpt ================================================================================ ---- EXPECTED OUTPUT array(3) { [0]=> string(53) "HelloWorldResponse HelloWorld(HelloWorld $parameters)" [1]=> string(19) "string HelloWorld()" [2]=> string(19) "string HelloWorld()" } ---- ACTUAL OUTPUT Fatal error: Uncaught SoapFault exception: [WSDL] SOAP-ERROR: Parsing WSDL: Couldn't load from '/usr/local/src/php-5.0.3/ext/soap/tests/bugs/bug29109.wsdl' in /usr/local/src/php-5.0.3/ext/soap/tests/bugs/bug29109.php:2 Stack trace: #0 /usr/local/src/php-5.0.3/ext/soap/tests/bugs/bug29109.php(2): SoapClient->__construct('/usr/local/src/...') #1 {main} thrown in /usr/local/src/php-5.0.3/ext/soap/tests/bugs/bug29109.php on line 2 ---- FAILED ================================================================================ 001+ Fatal error: Uncaught SoapFault exception: [WSDL] SOAP-ERROR: Parsing WSDL: Couldn't load from '/usr/local/src/php-5.0.3/ext/soap/tests/bugs/bug29109.wsdl' in /usr/local/src/php-5.0.3/ext/soap/tests/bugs/bug29109.php:2 002+ Stack trace: 003+ #0 /usr/local/src/php-5.0.3/ext/soap/tests/bugs/bug29109.php(2): SoapClient->__construct('/usr/local/src/...') 004+ #1 {main} 005+ thrown in /usr/local/src/php-5.0.3/ext/soap/tests/bugs/bug29109.php on line 2 001- array(3) { 002- [0]=> 003- string(53) "HelloWorldResponse HelloWorld(HelloWorld $parameters)" 004- [1]=> 005- string(19) "string HelloWorld()" 006- [2]=> 007- string(19) "string HelloWorld()" 008- } ================================================================================ ================================================================================ /usr/local/src/php-5.0.3/ext/standard/tests/array/bug29992.phpt ================================================================================ ---- EXPECTED OUTPUT Array ( [0] => 1 [1] => 2 [2] => 3 ) int(1) int(2) int(3) int(1) int(2) int(3) int(1) int(2) int(3) int(1) int(2) int(3) Array ( [0] => 1 [1] => 2 [2] => 3 ) ===DONE=== ---- ACTUAL OUTPUT Array ( [0] => 1 [1] => 2 [2] => 3 ) int(1) int(2) int(3) int(1) int(2) int(3) int(1) int(2) int(3) int(1) int(2) int(2) Array ( [0] => 1 [1] => 2 [2] => 2 ) ===DONE=== ---- FAILED ================================================================================ 018+ int(2) 018- int(3) 023+ [2] => 2 023- [2] => 3 ================================================================================ ================================================================================ /usr/local/src/php-5.0.3/ext/standard/tests/time/bug20382.phpt ================================================================================ ---- EXPECTED OUTPUT tStamp=Wednesday 2004-10-27 17:17:17 CEST result=Monday 2004-11-01 00:00:00 CET wanted=Monday 2004-11-01 00:00:00 CET ---- ACTUAL OUTPUT tStamp=Wednesday 2004-10-27 17:17:17 CEST result=Sunday 2004-10-31 23:00:00 CET wanted=Monday 2004-11-01 00:00:00 CET ---- FAILED ================================================================================ 002+ result=Sunday 2004-10-31 23:00:00 CET 002- result=Monday 2004-11-01 00:00:00 CET ================================================================================ ================================================================================ /usr/local/src/php-5.0.3/ext/standard/tests/time/bug27780.phpt ================================================================================ ---- EXPECTED OUTPUT America/Chicago 1076824799 [2004-02-14 23:59:59 CST] [2004-04-07 00:00:00 -2 months +7 days +23 hours +59 minutes +59 seconds] 1076824800 [2004-02-15 00:00:00 CST] [2004-04-07 00:00:00 -2 months +7 days +23 hours +59 minutes +60 seconds] 1076824801 [2004-02-15 00:00:01 CST] [2004-04-07 00:00:00 -2 months +7 days +23 hours +59 minutes +61 seconds] 1079503200 [2004-03-17 00:00:00 CST] [2004-04-07 00:00:00 -21 days] 1080367200 [2004-03-27 00:00:00 CST] [2004-04-07 00:00:00 11 days ago] 1080460800 [2004-03-28 02:00:00 CST] [2004-04-07 00:00:00 -10 day +2 hours] 1081227600 [2004-04-06 00:00:00 CDT] [2004-04-07 00:00:00 -1 day] 1081314000 [2004-04-07 00:00:00 CDT] [2004-04-07 00:00:00] 1081317600 [2004-04-07 01:00:00 CDT] [2004-04-07 00:00:00 +1 hour] 1081321200 [2004-04-07 02:00:00 CDT] [2004-04-07 00:00:00 +2 hour] 1081400400 [2004-04-08 00:00:00 CDT] [2004-04-07 00:00:00 +1 day] 1081400400 [2004-04-08 00:00:00 CDT] [2004-04-07 00:00:00 1 day] 1083128400 [2004-04-28 00:00:00 CDT] [2004-04-07 00:00:00 +21 days] Europe/Amsterdam 1076799599 [2004-02-14 23:59:59 CET] [2004-04-07 00:00:00 -2 months +7 days +23 hours +59 minutes +59 seconds] 1076799600 [2004-02-15 00:00:00 CET] [2004-04-07 00:00:00 -2 months +7 days +23 hours +59 minutes +60 seconds] 1076799601 [2004-02-15 00:00:01 CET] [2004-04-07 00:00:00 -2 months +7 days +23 hours +59 minutes +61 seconds] 1079478000 [2004-03-17 00:00:00 CET] [2004-04-07 00:00:00 -21 days] 1080342000 [2004-03-27 00:00:00 CET] [2004-04-07 00:00:00 11 days ago] 1080435600 [2004-03-28 03:00:00 CEST] [2004-04-07 00:00:00 -10 day +2 hours] 1081202400 [2004-04-06 00:00:00 CEST] [2004-04-07 00:00:00 -1 day] 1081288800 [2004-04-07 00:00:00 CEST] [2004-04-07 00:00:00] 1081292400 [2004-04-07 01:00:00 CEST] [2004-04-07 00:00:00 +1 hour] 1081296000 [2004-04-07 02:00:00 CEST] [2004-04-07 00:00:00 +2 hour] 1081375200 [2004-04-08 00:00:00 CEST] [2004-04-07 00:00:00 +1 day] 1081375200 [2004-04-08 00:00:00 CEST] [2004-04-07 00:00:00 1 day] 1083103200 [2004-04-28 00:00:00 CEST] [2004-04-07 00:00:00 +21 days] Asia/Jerusalem 1076795999 [2004-02-14 23:59:59 IST] [2004-04-07 00:00:00 -2 months +7 days +23 hours +59 minutes +59 seconds] 1076796000 [2004-02-15 00:00:00 IST] [2004-04-07 00:00:00 -2 months +7 days +23 hours +59 minutes +60 seconds] 1076796001 [2004-02-15 00:00:01 IST] [2004-04-07 00:00:00 -2 months +7 days +23 hours +59 minutes +61 seconds] 1079474400 [2004-03-17 00:00:00 IST] [2004-04-07 00:00:00 -21 days] 1080338400 [2004-03-27 00:00:00 IST] [2004-04-07 00:00:00 11 days ago] 1080432000 [2004-03-28 02:00:00 IST] [2004-04-07 00:00:00 -10 day +2 hours] 1081202400 [2004-04-06 00:00:00 IST] [2004-04-07 00:00:00 -1 day] 1081288800 [2004-04-07 00:00:00 IST] [2004-04-07 00:00:00] 1081292400 [2004-04-07 02:00:00 IDT] [2004-04-07 00:00:00 +1 hour] 1081292400 [2004-04-07 02:00:00 IDT] [2004-04-07 00:00:00 +2 hour] 1081371600 [2004-04-08 00:00:00 IDT] [2004-04-07 00:00:00 +1 day] 1081371600 [2004-04-08 00:00:00 IDT] [2004-04-07 00:00:00 1 day] 1083099600 [2004-04-28 00:00:00 IDT] [2004-04-07 00:00:00 +21 days] Asia/Singapore 1076774399 [2004-02-14 23:59:59 SGT] [2004-04-07 00:00:00 -2 months +7 days +23 hours +59 minutes +59 seconds] 1076774400 [2004-02-15 00:00:00 SGT] [2004-04-07 00:00:00 -2 months +7 days +23 hours +59 minutes +60 seconds] 1076774401 [2004-02-15 00:00:01 SGT] [2004-04-07 00:00:00 -2 months +7 days +23 hours +59 minutes +61 seconds] 1079452800 [2004-03-17 00:00:00 SGT] [2004-04-07 00:00:00 -21 days] 1080316800 [2004-03-27 00:00:00 SGT] [2004-04-07 00:00:00 11 days ago] 1080410400 [2004-03-28 02:00:00 SGT] [2004-04-07 00:00:00 -10 day +2 hours] 1081180800 [2004-04-06 00:00:00 SGT] [2004-04-07 00:00:00 -1 day] 1081267200 [2004-04-07 00:00:00 SGT] [2004-04-07 00:00:00] 1081270800 [2004-04-07 01:00:00 SGT] [2004-04-07 00:00:00 +1 hour] 1081274400 [2004-04-07 02:00:00 SGT] [2004-04-07 00:00:00 +2 hour] 1081353600 [2004-04-08 00:00:00 SGT] [2004-04-07 00:00:00 +1 day] 1081353600 [2004-04-08 00:00:00 SGT] [2004-04-07 00:00:00 1 day] 1083081600 [2004-04-28 00:00:00 SGT] [2004-04-07 00:00:00 +21 days] America/Sao_Paulo 1076810399 [2004-02-14 23:59:59 BRST] [2004-04-07 00:00:00 -2 months +7 days +23 hours +59 minutes +59 seconds] 1076810400 [2004-02-14 23:00:00 BRT] [2004-04-07 00:00:00 -2 months +7 days +23 hours +59 minutes +60 seconds] 1076810401 [2004-02-14 23:00:01 BRT] [2004-04-07 00:00:00 -2 months +7 days +23 hours +59 minutes +61 seconds] 1079492400 [2004-03-17 00:00:00 BRT] [2004-04-07 00:00:00 -21 days] 1080356400 [2004-03-27 00:00:00 BRT] [2004-04-07 00:00:00 11 days ago] 1080450000 [2004-03-28 02:00:00 BRT] [2004-04-07 00:00:00 -10 day +2 hours] 1081220400 [2004-04-06 00:00:00 BRT] [2004-04-07 00:00:00 -1 day] 1081306800 [2004-04-07 00:00:00 BRT] [2004-04-07 00:00:00] 1081310400 [2004-04-07 01:00:00 BRT] [2004-04-07 00:00:00 +1 hour] 1081314000 [2004-04-07 02:00:00 BRT] [2004-04-07 00:00:00 +2 hour] 1081393200 [2004-04-08 00:00:00 BRT] [2004-04-07 00:00:00 +1 day] 1081393200 [2004-04-08 00:00:00 BRT] [2004-04-07 00:00:00 1 day] 1083121200 [2004-04-28 00:00:00 BRT] [2004-04-07 00:00:00 +21 days] ---- ACTUAL OUTPUT America/Chicago 1076824799 [2004-02-14 23:59:59 CST] [2004-04-07 00:00:00 -2 months +7 days +23 hours +59 minutes +59 seconds] 1076824800 [2004-02-15 00:00:00 CST] [2004-04-07 00:00:00 -2 months +7 days +23 hours +59 minutes +60 seconds] 1076824801 [2004-02-15 00:00:01 CST] [2004-04-07 00:00:00 -2 months +7 days +23 hours +59 minutes +61 seconds] 1079503200 [2004-03-17 00:00:00 CST] [2004-04-07 00:00:00 -21 days] 1080367200 [2004-03-27 00:00:00 CST] [2004-04-07 00:00:00 11 days ago] 1080460800 [2004-03-28 02:00:00 CST] [2004-04-07 00:00:00 -10 day +2 hours] 1081227600 [2004-04-06 00:00:00 CDT] [2004-04-07 00:00:00 -1 day] 1081314000 [2004-04-07 00:00:00 CDT] [2004-04-07 00:00:00] 1081317600 [2004-04-07 01:00:00 CDT] [2004-04-07 00:00:00 +1 hour] 1081321200 [2004-04-07 02:00:00 CDT] [2004-04-07 00:00:00 +2 hour] 1081400400 [2004-04-08 00:00:00 CDT] [2004-04-07 00:00:00 +1 day] 1081400400 [2004-04-08 00:00:00 CDT] [2004-04-07 00:00:00 1 day] 1083128400 [2004-04-28 00:00:00 CDT] [2004-04-07 00:00:00 +21 days] Europe/Amsterdam 1076799599 [2004-02-14 23:59:59 CET] [2004-04-07 00:00:00 -2 months +7 days +23 hours +59 minutes +59 seconds] 1076799600 [2004-02-15 00:00:00 CET] [2004-04-07 00:00:00 -2 months +7 days +23 hours +59 minutes +60 seconds] 1076799601 [2004-02-15 00:00:01 CET] [2004-04-07 00:00:00 -2 months +7 days +23 hours +59 minutes +61 seconds] 1079478000 [2004-03-17 00:00:00 CET] [2004-04-07 00:00:00 -21 days] 1080342000 [2004-03-27 00:00:00 CET] [2004-04-07 00:00:00 11 days ago] -1 [1970-01-01 00:59:59 CET] [2004-04-07 00:00:00 -10 day +2 hours] 1081202400 [2004-04-06 00:00:00 CEST] [2004-04-07 00:00:00 -1 day] 1081288800 [2004-04-07 00:00:00 CEST] [2004-04-07 00:00:00] 1081292400 [2004-04-07 01:00:00 CEST] [2004-04-07 00:00:00 +1 hour] 1081296000 [2004-04-07 02:00:00 CEST] [2004-04-07 00:00:00 +2 hour] 1081375200 [2004-04-08 00:00:00 CEST] [2004-04-07 00:00:00 +1 day] 1081375200 [2004-04-08 00:00:00 CEST] [2004-04-07 00:00:00 1 day] 1083103200 [2004-04-28 00:00:00 CEST] [2004-04-07 00:00:00 +21 days] Asia/Jerusalem 1076795999 [2004-02-14 23:59:59 IST] [2004-04-07 00:00:00 -2 months +7 days +23 hours +59 minutes +59 seconds] 1076796000 [2004-02-15 00:00:00 IST] [2004-04-07 00:00:00 -2 months +7 days +23 hours +59 minutes +60 seconds] 1076796001 [2004-02-15 00:00:01 IST] [2004-04-07 00:00:00 -2 months +7 days +23 hours +59 minutes +61 seconds] 1079474400 [2004-03-17 00:00:00 IST] [2004-04-07 00:00:00 -21 days] 1080338400 [2004-03-27 00:00:00 IST] [2004-04-07 00:00:00 11 days ago] 1080432000 [2004-03-28 02:00:00 IST] [2004-04-07 00:00:00 -10 day +2 hours] 1081202400 [2004-04-06 00:00:00 IST] [2004-04-07 00:00:00 -1 day] 1081288800 [2004-04-07 00:00:00 IST] [2004-04-07 00:00:00] -1 [1970-01-01 01:59:59 IST] [2004-04-07 00:00:00 +1 hour] 1081292400 [2004-04-07 02:00:00 IDT] [2004-04-07 00:00:00 +2 hour] 1081371600 [2004-04-08 00:00:00 IDT] [2004-04-07 00:00:00 +1 day] 1081371600 [2004-04-08 00:00:00 IDT] [2004-04-07 00:00:00 1 day] 1083099600 [2004-04-28 00:00:00 IDT] [2004-04-07 00:00:00 +21 days] Asia/Singapore 1076774399 [2004-02-14 23:59:59 SGT] [2004-04-07 00:00:00 -2 months +7 days +23 hours +59 minutes +59 seconds] 1076774400 [2004-02-15 00:00:00 SGT] [2004-04-07 00:00:00 -2 months +7 days +23 hours +59 minutes +60 seconds] 1076774401 [2004-02-15 00:00:01 SGT] [2004-04-07 00:00:00 -2 months +7 days +23 hours +59 minutes +61 seconds] 1079452800 [2004-03-17 00:00:00 SGT] [2004-04-07 00:00:00 -21 days] 1080316800 [2004-03-27 00:00:00 SGT] [2004-04-07 00:00:00 11 days ago] 1080410400 [2004-03-28 02:00:00 SGT] [2004-04-07 00:00:00 -10 day +2 hours] 1081180800 [2004-04-06 00:00:00 SGT] [2004-04-07 00:00:00 -1 day] 1081267200 [2004-04-07 00:00:00 SGT] [2004-04-07 00:00:00] 1081270800 [2004-04-07 01:00:00 SGT] [2004-04-07 00:00:00 +1 hour] 1081274400 [2004-04-07 02:00:00 SGT] [2004-04-07 00:00:00 +2 hour] 1081353600 [2004-04-08 00:00:00 SGT] [2004-04-07 00:00:00 +1 day] 1081353600 [2004-04-08 00:00:00 SGT] [2004-04-07 00:00:00 1 day] 1083081600 [2004-04-28 00:00:00 SGT] [2004-04-07 00:00:00 +21 days] America/Sao_Paulo 1076813999 [2004-02-14 23:59:59 BRT] [2004-04-07 00:00:00 -2 months +7 days +23 hours +59 minutes +59 seconds] 1076814000 [2004-02-15 00:00:00 BRT] [2004-04-07 00:00:00 -2 months +7 days +23 hours +59 minutes +60 seconds] 1076814001 [2004-02-15 00:00:01 BRT] [2004-04-07 00:00:00 -2 months +7 days +23 hours +59 minutes +61 seconds] 1079492400 [2004-03-17 00:00:00 BRT] [2004-04-07 00:00:00 -21 days] 1080356400 [2004-03-27 00:00:00 BRT] [2004-04-07 00:00:00 11 days ago] 1080450000 [2004-03-28 02:00:00 BRT] [2004-04-07 00:00:00 -10 day +2 hours] 1081220400 [2004-04-06 00:00:00 BRT] [2004-04-07 00:00:00 -1 day] 1081306800 [2004-04-07 00:00:00 BRT] [2004-04-07 00:00:00] 1081310400 [2004-04-07 01:00:00 BRT] [2004-04-07 00:00:00 +1 hour] 1081314000 [2004-04-07 02:00:00 BRT] [2004-04-07 00:00:00 +2 hour] 1081393200 [2004-04-08 00:00:00 BRT] [2004-04-07 00:00:00 +1 day] 1081393200 [2004-04-08 00:00:00 BRT] [2004-04-07 00:00:00 1 day] 1083121200 [2004-04-28 00:00:00 BRT] [2004-04-07 00:00:00 +21 days] ---- FAILED ================================================================================ 022+ -1 [1970-01-01 00:59:59 CET] [2004-04-07 00:00:00 -10 day +2 hours] 022- 1080435600 [2004-03-28 03:00:00 CEST] [2004-04-07 00:00:00 -10 day +2 hours] 040+ -1 [1970-01-01 01:59:59 IST] [2004-04-07 00:00:00 +1 hour] 040- 1081292400 [2004-04-07 02:00:00 IDT] [2004-04-07 00:00:00 +1 hour] 062+ 1076813999 [2004-02-14 23:59:59 BRT] [2004-04-07 00:00:00 -2 months +7 days +23 hours +59 minutes +59 seconds] 063+ 1076814000 [2004-02-15 00:00:00 BRT] [2004-04-07 00:00:00 -2 months +7 days +23 hours +59 minutes +60 seconds] 064+ 1076814001 [2004-02-15 00:00:01 BRT] [2004-04-07 00:00:00 -2 months +7 days +23 hours +59 minutes +61 seconds] 062- 1076810399 [2004-02-14 23:59:59 BRST] [2004-04-07 00:00:00 -2 months +7 days +23 hours +59 minutes +59 seconds] 063- 1076810400 [2004-02-14 23:00:00 BRT] [2004-04-07 00:00:00 -2 months +7 days +23 hours +59 minutes +60 seconds] 064- 1076810401 [2004-02-14 23:00:01 BRT] [2004-04-07 00:00:00 -2 months +7 days +23 hours +59 minutes +61 seconds] ================================================================================ ================================================================================ /usr/local/src/php-5.0.3/ext/xml/tests/bug26614.phpt ================================================================================ ---- EXPECTED OUTPUT CDATA <DATA> at line 2, col 0 (byte 45) </DATA> at line 9, col 0 (byte 90) Comment <DATA> at line 2, col 0 (byte 45) </DATA> at line 9, col 0 (byte 90) Text <DATA> at line 2, col 0 (byte 45) </DATA> at line 9, col 0 (byte 90) ---- ACTUAL OUTPUT CDATA <DATA> at line 2, col 6 (byte 9) </DATA> at line 9, col 7 (byte 56) Comment <DATA> at line 2, col 6 (byte 9) </DATA> at line 9, col 7 (byte 56) Text <DATA> at line 2, col 6 (byte 9) </DATA> at line 9, col 10 (byte 56) ---- FAILED ================================================================================ 002+ <DATA> at line 2, col 6 (byte 9) 003+ </DATA> at line 9, col 7 (byte 56) 002- <DATA> at line 2, col 0 (byte 45) 003- </DATA> at line 9, col 0 (byte 90) 005+ <DATA> at line 2, col 6 (byte 9) 006+ </DATA> at line 9, col 7 (byte 56) 005- <DATA> at line 2, col 0 (byte 45) 006- </DATA> at line 9, col 0 (byte 90) 008+ <DATA> at line 2, col 6 (byte 9) 009+ </DATA> at line 9, col 10 (byte 56) 008- <DATA> at line 2, col 0 (byte 45) 009- </DATA> at line 9, col 0 (byte 90) ================================================================================ ================================================================================ BUILD ENVIRONMENT ================================================================================ OS: FreeBSD - FreeBSD jail091 4.10-RELEASE FreeBSD 4.10-RELEASE #0: Wed Oc i386 Automake: Autoconf: Bundled Libtool: ltmain.sh (GNU libtool) 1.4.3 (1.922.2.110 2002/10/23 01:39:54) System Libtool: Compiler: Using builtin specs. gcc version 2.95.4 20020320 [FreeBSD] Bison: Libraries: /usr/local/src/php-5.0.3/sapi/cli/php: libcrypt.so.2 => /usr/lib/libcrypt.so.2 (0x283c6000) libmysqlclient.so.14 => /usr/local/mysql/lib/mysql/libmysqlclient.so.14 (0x283df000) libm.so.2 => /usr/lib/libm.so.2 (0x28452000) libz.so.2 => /usr/lib/libz.so.2 (0x2846d000) libssl.so.3 => /usr/lib/libssl.so.3 (0x2847a000) libcrypto.so.3 => /usr/lib/libcrypto.so.3 (0x284a9000) libmcrypt.so.8 => /usr/local/lib/libmcrypt.so.8 (0x285a0000) libiconv.so.3 => /usr/local/lib/libiconv.so.3 (0x285d2000) libcurl.so.3 => /usr/local/lib/libcurl.so.3 (0x286bf000) libxml2.so.8 => /usr/local/lib/libxml2.so.8 (0x286ec000) libc.so.4 => /usr/lib/libc.so.4 (0x287e2000) User's E-mail: ================================================================================ PHPINFO ================================================================================ phpinfo() PHP Version => 5.0.3 System => FreeBSD jail091 4.10-RELEASE FreeBSD 4.10-RELEASE #0: Wed Oc i386 Build Date => Jan 17 2005 01:37:06 Configure Command => './configure' '--with-apache=../apache_1.3.33' '--enable-force-cgi-redirect' '--with-openssl=/usr' '--with-libxml-dir=/usr/local' '--with-curl' '--enable-ftp' '--enable-mbstring' '--with-mcrypt' '--with-mysql=/usr/local/mysql' '--enable-soap' '--enable-sockets' '--enable-sqlite-utf8' '--enable-memory-limit' '--enable-zend-multibyte' Server API => Command Line Interface Virtual Directory Support => disabled Configuration File (php.ini) Path => /usr/local/lib PHP API => 20031224 PHP Extension => 20041030 Zend Extension => 220040412 Debug Build => no Thread Safety => disabled IPv6 Support => enabled Registered PHP Streams => php, file, http, ftp, https, ftps Registered Stream Socket Transports => tcp, udp, unix, udg, ssl, sslv3, sslv2, tls This program makes use of the Zend Scripting Language Engine: Zend Engine v2.0.3, Copyright (c) 1998-2004 Zend Technologies _______________________________________________________________________ Configuration PHP Core Directive => Local Value => Master Value allow_call_time_pass_reference => On => On allow_url_fopen => On => On always_populate_raw_post_data => Off => Off arg_separator.input => & => & arg_separator.output => & => & asp_tags => Off => Off auto_append_file => no value => no value auto_globals_jit => On => On auto_prepend_file => no value => no value browscap => no value => no value default_charset => no value => no value default_mimetype => text/html => text/html define_syslog_variables => Off => Off disable_classes => no value => no value disable_functions => no value => no value display_errors => On => On display_startup_errors => Off => Off doc_root => no value => no value docref_ext => no value => no value docref_root => no value => no value enable_dl => On => On error_append_string => no value => no value error_log => no value => no value error_prepend_string => no value => no value error_reporting => no value => no value expose_php => On => On extension_dir => /usr/local/lib/php/extensions/no-debug-non-zts-20041030 => /usr/local/lib/php/extensions/no-debug-non-zts-20041030 file_uploads => On => On highlight.bg => #FFFFFF => #FFFFFF highlight.comment => #FF8000 => #FF8000 highlight.default => #0000BB => #0000BB highlight.html => #000000 => #000000 highlight.keyword => #007700 => #007700 highlight.string => #DD0000 => #DD0000 html_errors => Off => On ignore_repeated_errors => Off => Off ignore_repeated_source => Off => Off ignore_user_abort => Off => Off implicit_flush => On => Off include_path => .:/usr/local/lib/php => .:/usr/local/lib/php log_errors => Off => Off log_errors_max_len => 1024 => 1024 magic_quotes_gpc => On => On magic_quotes_runtime => Off => Off magic_quotes_sybase => Off => Off mail.force_extra_parameters => no value => no value max_execution_time => 0 => 30 max_input_time => -1 => -1 memory_limit => 8M => 8M open_basedir => no value => no value output_buffering => 0 => 0 output_handler => no value => no value post_max_size => 8M => 8M precision => 14 => 14 register_argc_argv => On => On register_globals => Off => Off register_long_arrays => On => On report_memleaks => On => On report_zend_debug => Off => Off safe_mode => Off => Off safe_mode_exec_dir => /usr/local/php/bin => /usr/local/php/bin safe_mode_gid => Off => Off safe_mode_include_dir => no value => no value sendmail_from => no value => no value sendmail_path => /usr/sbin/sendmail -t -i => /usr/sbin/sendmail -t -i serialize_precision => 100 => 100 short_open_tag => On => On SMTP => localhost => localhost smtp_port => 25 => 25 sql.safe_mode => Off => Off track_errors => Off => Off unserialize_callback_func => no value => no value upload_max_filesize => 2M => 2M upload_tmp_dir => no value => no value user_dir => no value => no value variables_order => EGPCS => EGPCS xmlrpc_error_number => 0 => 0 xmlrpc_errors => Off => Off y2k_compliance => On => On zend.ze1_compatibility_mode => Off => Off ctype ctype functions => enabled curl CURL support => enabled CURL Information => libcurl/7.12.1 OpenSSL/0.9.7d zlib/1.1.4 dom DOM/XML => enabled DOM/XML API Version => 20031129 libxml Version => 2.6.15 HTML Support => enabled XPath Support => enabled XPointer Support => enabled Schema Support => enabled RelaxNG Support => enabled ftp FTP support => enabled iconv iconv support => enabled iconv implementation => libiconv iconv library version => 1.9 Directive => Local Value => Master Value iconv.input_encoding => ISO-8859-1 => ISO-8859-1 iconv.internal_encoding => ISO-8859-1 => ISO-8859-1 iconv.output_encoding => ISO-8859-1 => ISO-8859-1 libxml libXML support => active libXML Version => 2.6.15 libXML streams => enabled mbstring Multibyte Support => enabled Multibyte string engine => libmbfl Multibyte (japanese) regex support => enabled Multibyte regex (oniguruma) version => 2.2.4 mbstring extension makes use of "streamable kanji code filter and converter", which is distributed under the GNU Lesser General Public License version 2.1. Directive => Local Value => Master Value mbstring.detect_order => no value => no value mbstring.encoding_translation => Off => Off mbstring.func_overload => 0 => 0 mbstring.http_input => pass => pass mbstring.http_output => pass => pass mbstring.internal_encoding => ISO-8859-1 => no value mbstring.language => neutral => neutral mbstring.script_encoding => no value => no value mbstring.substitute_character => no value => no value mcrypt mcrypt support => enabled Version => 2.5.7 Api No => 20021217 Supported ciphers => cast-128 gost rijndael-128 twofish arcfour cast-256 loki97 rijndael-192 saferplus wake blowfish-compat des rijndael-256 serpent xtea blowfish enigma rc2 tripledes Supported modes => cbc cfb ctr ecb ncfb nofb ofb stream Directive => Local Value => Master Value mcrypt.algorithms_dir => no value => no value mcrypt.modes_dir => no value => no value mysql MySQL Support => enabled Active Persistent Links => 0 Active Links => 0 Client API version => 4.1.9 MYSQL_MODULE_TYPE => external MYSQL_SOCKET => /tmp/mysql.sock MYSQL_INCLUDE => -I/usr/local/mysql/include/mysql MYSQL_LIBS => -L/usr/local/mysql/lib/mysql -lmysqlclient Directive => Local Value => Master Value mysql.allow_persistent => On => On mysql.connect_timeout => 60 => 60 mysql.default_host => no value => no value mysql.default_password => no value => no value mysql.default_port => no value => no value mysql.default_socket => no value => no value mysql.default_user => no value => no value mysql.max_links => Unlimited => Unlimited mysql.max_persistent => Unlimited => Unlimited mysql.trace_mode => Off => Off openssl OpenSSL support => enabled OpenSSL Version => OpenSSL 0.9.7d 17 Mar 2004 pcre PCRE (Perl Compatible Regular Expressions) Support => enabled PCRE Library Version => 4.5 01-December-2003 posix Revision => $Revision: 1.60 $ session Session Support => enabled Registered save handlers => files user sqlite Registered serializer handlers => php php_binary Directive => Local Value => Master Value session.auto_start => Off => Off session.bug_compat_42 => On => On session.bug_compat_warn => On => On session.cache_expire => 180 => 180 session.cache_limiter => nocache => nocache session.cookie_domain => no value => no value session.cookie_lifetime => 0 => 0 session.cookie_path => / => / session.cookie_secure => Off => Off session.entropy_file => no value => no value session.entropy_length => 0 => 0 session.gc_divisor => 100 => 100 session.gc_maxlifetime => 1440 => 1440 session.gc_probability => 1 => 1 session.hash_bits_per_character => 4 => 4 session.hash_function => 0 => 0 session.name => PHPSESSID => PHPSESSID session.referer_check => no value => no value session.save_handler => files => files session.save_path => no value => no value session.serialize_handler => php => php session.use_cookies => On => On session.use_only_cookies => Off => Off session.use_trans_sid => 0 => 0 SimpleXML Simplexml support => enabled Revision => $Revision: 1.139.2.4 $ Schema support => enabled soap Soap Client => enabled Soap Server => enabled Directive => Local Value => Master Value soap.wsdl_cache_dir => /tmp => /tmp soap.wsdl_cache_enabled => 1 => 1 soap.wsdl_cache_ttl => 86400 => 86400 sockets Sockets Support => enabled SPL SPL support => enabled Interfaces => RecursiveIterator, SeekableIterator Classes => ArrayObject, ArrayIterator, CachingIterator, CachingRecursiveIterator, DirectoryIterator, FilterIterator, LimitIterator, ParentIterator, RecursiveDirectoryIterator, RecursiveIteratorIterator, SimpleXMLIterator SQLite SQLite support => enabled PECL Module version => 2.0-dev $Id: sqlite.c,v 1.146.2.3 2004/09/26 01:41:40 wez Exp $ SQLite Library => 2.8.14 SQLite Encoding => UTF-8 Directive => Local Value => Master Value sqlite.assoc_case => 0 => 0 standard Regex Library => Bundled library enabled Dynamic Library Support => enabled Path to sendmail => /usr/sbin/sendmail -t -i Directive => Local Value => Master Value assert.active => 1 => 1 assert.bail => 0 => 0 assert.callback => no value => no value assert.quiet_eval => 0 => 0 assert.warning => 1 => 1 auto_detect_line_endings => 0 => 0 date.default_latitude => 31.7667 => 31.7667 date.default_longitude => 35.2333 => 35.2333 date.sunrise_zenith => 90.83 => 90.83 date.sunset_zenith => 90.83 => 90.83 default_socket_timeout => 60 => 60 safe_mode_allowed_env_vars => PHP_ => PHP_ safe_mode_protected_env_vars => LD_LIBRARY_PATH => LD_LIBRARY_PATH url_rewriter.tags => a=href,area=href,frame=src,form=,fieldset= => a=href,area=href,frame=src,form=,fieldset= user_agent => no value => no value tokenizer Tokenizer Support => enabled xml XML Support => active XML Namespace Support => active libxml2 Version => 2.6.15 Additional Modules Module Name Environment Variable => Value CONTENT_TYPE => SSH_CLIENT => deleted USER => root MACHTYPE => i386 MAIL => /var/mail/root VENDOR => intel SHLVL => 1 QUERY_STRING => HOME => /root TEST_PHP_SRCDIR => /usr/local/src/php-5.0.3 SSH_TTY => deleted PAGER => more CONTENT_LENGTH => SCRIPT_FILENAME => PATH_TRANSLATED => GROUP => wheel LOGNAME => root TEST_PHP_EXECUTABLE => /usr/local/src/php-5.0.3/sapi/cli/php BLOCKSIZE => K TERM => xterm PATH => /sbin:/bin:/usr/sbin:/usr/bin:/usr/games:/usr/local/sbin:/usr/local/bin:/usr/X11R6/bin:/root/bin REMOTEHOST => 202.6.247.200 SSH_AUTH_SOCK => deleted SHELL => /bin/csh HOST => jail091 REDIRECT_STATUS => REQUEST_METHOD => OSTYPE => FreeBSD PWD => /usr/local/src/php-5.0.3 FTP_PASSIVE_MODE => YES CC => gcc HOSTTYPE => FreeBSD EDITOR => vi PHP Variables Variable => Value _SERVER["CONTENT_TYPE"] => _SERVER["SSH_CLIENT"] => deleted _SERVER["USER"] => root _SERVER["MACHTYPE"] => i386 _SERVER["MAIL"] => /var/mail/root _SERVER["VENDOR"] => intel _SERVER["SHLVL"] => 1 _SERVER["QUERY_STRING"] => _SERVER["HOME"] => /root _SERVER["TEST_PHP_SRCDIR"] => /usr/local/src/php-5.0.3 _SERVER["SSH_TTY"] => deleted _SERVER["PAGER"] => more _SERVER["CONTENT_LENGTH"] => _SERVER["SCRIPT_FILENAME"] => _SERVER["PATH_TRANSLATED"] => _SERVER["GROUP"] => wheel _SERVER["LOGNAME"] => root _SERVER["TEST_PHP_EXECUTABLE"] => /usr/local/src/php-5.0.3/sapi/cli/php _SERVER["BLOCKSIZE"] => K _SERVER["TERM"] => xterm _SERVER["PATH"] => /sbin:/bin:/usr/sbin:/usr/bin:/usr/games:/usr/local/sbin:/usr/local/bin:/usr/X11R6/bin:/root/bin _SERVER["REMOTEHOST"] => 202.6.247.200 _SERVER["SSH_AUTH_SOCK"] => deleted _SERVER["SHELL"] => /bin/csh _SERVER["HOST"] => jail091 _SERVER["REDIRECT_STATUS"] => _SERVER["REQUEST_METHOD"] => _SERVER["OSTYPE"] => FreeBSD _SERVER["PWD"] => /usr/local/src/php-5.0.3 _SERVER["FTP_PASSIVE_MODE"] => YES _SERVER["CC"] => gcc _SERVER["HOSTTYPE"] => FreeBSD _SERVER["EDITOR"] => vi _SERVER["PHP_SELF"] => _SERVER["SCRIPT_NAME"] => _SERVER["DOCUMENT_ROOT"] => _SERVER["argv"] => Array ( ) _SERVER["argc"] => 0 _ENV["CONTENT_TYPE"] => _ENV["SSH_CLIENT"] => deleted _ENV["USER"] => root _ENV["MACHTYPE"] => i386 _ENV["MAIL"] => /var/mail/root _ENV["VENDOR"] => intel _ENV["SHLVL"] => 1 _ENV["QUERY_STRING"] => _ENV["HOME"] => /root _ENV["TEST_PHP_SRCDIR"] => /usr/local/src/php-5.0.3 _ENV["SSH_TTY"] => deleted _ENV["PAGER"] => more _ENV["CONTENT_LENGTH"] => _ENV["SCRIPT_FILENAME"] => _ENV["PATH_TRANSLATED"] => _ENV["GROUP"] => wheel _ENV["LOGNAME"] => root _ENV["TEST_PHP_EXECUTABLE"] => /usr/local/src/php-5.0.3/sapi/cli/php _ENV["BLOCKSIZE"] => K _ENV["TERM"] => xterm _ENV["PATH"] => /sbin:/bin:/usr/sbin:/usr/bin:/usr/games:/usr/local/sbin:/usr/local/bin:/usr/X11R6/bin:/root/bin _ENV["REMOTEHOST"] => 202.6.247.200 _ENV["SSH_AUTH_SOCK"] => deleted _ENV["SHELL"] => /bin/csh _ENV["HOST"] => jail091 _ENV["REDIRECT_STATUS"] => _ENV["REQUEST_METHOD"] => _ENV["OSTYPE"] => FreeBSD _ENV["PWD"] => /usr/local/src/php-5.0.3 _ENV["FTP_PASSIVE_MODE"] => YES _ENV["CC"] => gcc _ENV["HOSTTYPE"] => FreeBSD _ENV["EDITOR"] => vi PHP License This program is free software; you can redistribute it and/or modify it under the terms of the PHP License as published by the PHP Group and included in the distribution in the file: LICENSE This program is distributed in the hope that it will be useful, but WITHOUT ANY WARRANTY; without even the implied warranty of MERCHANTABILITY or FITNESS FOR A PARTICULAR PURPOSE. If you did not receive a copy of the PHP license, or have any questions about PHP licensing, please contact license@php.net.

« previous php.qa (#22981) next »