Test results for 5.0.3 [failed]
| From: | noreply@php.net | Date: | Tue, 18 Jan 2005 19:18:14 +0000 |
| Subject: | Test results for 5.0.3 [failed] | ||
| Groups: | php.qa | ||
| Request: | Send a blank email to php-qa+get-23029@lists.php.net to get a copy of this message | ||
=====================================================================
FAILED TEST SUMMARY
---------------------------------------------------------------------
Test for buffering in core functions with implicit flush off [tests/func/008.phpt]
Convert warnings to exceptions [tests/lang/038.phpt]
Bug #22836 (returning references to NULL) [Zend/tests/bug22836.phpt]
Bug #28444 (Cannot access undefined property for object with overloaded property access)
[Zend/tests/bug28444.phpt]
Test 3: Exception Test [ext/dom/tests/dom003.phpt]
Bug #24155 (gdImageRotate270 rotation problem). [ext/gd/tests/bug24155.phpt]
gdimagefill() function (Bug #19366 (fixed in bundled libgd)) [ext/gd/tests/bug27582_1.phpt]
iconv stream filter [ext/iconv/tests/iconv_stream_filter.phpt]
Bug #29992 (foreach by reference corrupts the array) [ext/standard/tests/array/bug29992.phpt]
Bug #22414 (passthru() does not read data correctly) [ext/standard/tests/file/bug22414.phpt]
Bug #24142 (round() problems) [ext/standard/tests/math/bug24142.phpt]
Bug #25694 (round() and number_format() inconsistency) [ext/standard/tests/math/bug25694.phpt]
Bug #20382 (strtotime ("Monday", $date) produces wrong result on DST changeover)
[ext/standard/tests/time/bug20382.phpt]
Bug #26614 (CDATA sections skipped on line count) [ext/xml/tests/bug26614.phpt]
=====================================================================
=====================================================================
TEST RESULT SUMMARY
---------------------------------------------------------------------
Exts skipped : 61
Exts tested : 23
---------------------------------------------------------------------
Number of tests : 1291 623
Tests skipped : 668 (51.7%) --------
Tests warned : 0 (0.0%) (0.0%)
Tests failed : 14 (1.1%) (2.2%)
Tests passed : 609 (47.2%) (97.8%)
---------------------------------------------------------------------
Time taken : 73 seconds
=====================================================================
=====================================================================
FAILED TEST SUMMARY
---------------------------------------------------------------------
Test for buffering in core functions with implicit flush off [tests/func/008.phpt]
Convert warnings to exceptions [tests/lang/038.phpt]
Bug #22836 (returning references to NULL) [Zend/tests/bug22836.phpt]
Bug #28444 (Cannot access undefined property for object with overloaded property access)
[Zend/tests/bug28444.phpt]
Test 3: Exception Test [ext/dom/tests/dom003.phpt]
Bug #24155 (gdImageRotate270 rotation problem). [ext/gd/tests/bug24155.phpt]
gdimagefill() function (Bug #19366 (fixed in bundled libgd)) [ext/gd/tests/bug27582_1.phpt]
iconv stream filter [ext/iconv/tests/iconv_stream_filter.phpt]
Bug #29992 (foreach by reference corrupts the array) [ext/standard/tests/array/bug29992.phpt]
Bug #22414 (passthru() does not read data correctly) [ext/standard/tests/file/bug22414.phpt]
Bug #24142 (round() problems) [ext/standard/tests/math/bug24142.phpt]
Bug #25694 (round() and number_format() inconsistency) [ext/standard/tests/math/bug25694.phpt]
Bug #20382 (strtotime ("Monday", $date) produces wrong result on DST changeover)
[ext/standard/tests/time/bug20382.phpt]
Bug #26614 (CDATA sections skipped on line count) [ext/xml/tests/bug26614.phpt]
=====================================================================
================================================================================
/home/sebbu/apache/php-5.0.3/tests/func/008.phpt
================================================================================
---- EXPECTED OUTPUT
'foo1'
'foo2'
---- ACTUAL OUTPUT
---- FAILED
================================================================================
001- 'foo1'
003- 'foo2'
================================================================================
================================================================================
/home/sebbu/apache/php-5.0.3/tests/lang/038.phpt
================================================================================
---- EXPECTED OUTPUT
string(15) "Error2Exception"
string(5) "fopen"
===DONE===
---- ACTUAL OUTPUT
string(15) "Error2Exception"
string(15) "Error2Exception"
===DONE===
---- FAILED
================================================================================
002+ string(15) "Error2Exception"
002- string(5) "fopen"
================================================================================
================================================================================
/home/sebbu/apache/php-5.0.3/Zend/tests/bug22836.phpt
================================================================================
---- EXPECTED OUTPUT
string(3) "foo"
'foo'
Notice: Undefined variable: a in %s on line %d
Strict Standards: Only variable references should be returned by reference in %s on line %d
string(3) "foo"
'foo'
Notice: Undefined variable: a in %s on line %d
Strict Standards: Only variable references should be returned by reference in %s on line %d
string(3) "foo"
'foo'
Notice: Undefined variable: a in %s on line %d
Strict Standards: Only variable references should be returned by reference in %s on line %d
string(3) "foo"
'foo'
Notice: Undefined variable: a in %s on line %d
Strict Standards: Only variable references should be returned by reference in %s on line %d
string(3) "foo"
'foo'
Notice: Undefined variable: a in %s on line %d
Strict Standards: Only variable references should be returned by reference in %s on line %d
string(3) "foo"
'foo'
Notice: Undefined variable: a in %s on line %d
Strict Standards: Only variable references should be returned by reference in %s on line %d
string(3) "foo"
'foo'
Notice: Undefined variable: a in %s on line %d
Strict Standards: Only variable references should be returned by reference in %s on line %d
string(3) "foo"
'foo'
Notice: Undefined variable: a in %s on line %d
Strict Standards: Only variable references should be returned by reference in %s on line %d
string(3) "foo"
'foo'
Notice: Undefined variable: a in %s on line %d
Strict Standards: Only variable references should be returned by reference in %s on line %d
---- ACTUAL OUTPUT
string(3) "foo"
'foo'
Notice: Undefined variable: a in /home/sebbu/apache/php-5.0.3/Zend/tests/bug22836.php on line 7
Strict Standards: Only variable references should be returned by reference in
/home/sebbu/apache/php-5.0.3/Zend/tests/bug22836.php on line 7
string(3) "foo"
'foo'
Notice: Undefined variable: a in /home/sebbu/apache/php-5.0.3/Zend/tests/bug22836.php on line 7
Strict Standards: Only variable references should be returned by reference in
/home/sebbu/apache/php-5.0.3/Zend/tests/bug22836.php on line 7
NULL
'foo'
Notice: Undefined variable: a in /home/sebbu/apache/php-5.0.3/Zend/tests/bug22836.php on line 7
NULL
'foo'
Notice: Undefined variable: a in /home/sebbu/apache/php-5.0.3/Zend/tests/bug22836.php on line 7
NULL
'foo'
Notice: Undefined variable: a in /home/sebbu/apache/php-5.0.3/Zend/tests/bug22836.php on line 7
NULL
'foo'
Notice: Undefined variable: a in /home/sebbu/apache/php-5.0.3/Zend/tests/bug22836.php on line 7
NULL
'foo'
Notice: Undefined variable: a in /home/sebbu/apache/php-5.0.3/Zend/tests/bug22836.php on line 7
NULL
'foo'
Notice: Undefined variable: a in /home/sebbu/apache/php-5.0.3/Zend/tests/bug22836.php on line 7
---- FAILED
================================================================================
013+ NULL
013- string(3) "foo"
017+ NULL
018+ 'foo'
018- Strict Standards: Only variable references should be returned by reference in %s on line %d
019- string(3) "foo"
020+ Notice: Undefined variable: a in /home/sebbu/apache/php-5.0.3/Zend/tests/bug22836.php on line
7
021+ NULL
022+ 'foo'
023+
024+ Notice: Undefined variable: a in /home/sebbu/apache/php-5.0.3/Zend/tests/bug22836.php on line
7
025+ NULL
026+ 'foo'
027+
028+ Notice: Undefined variable: a in /home/sebbu/apache/php-5.0.3/Zend/tests/bug22836.php on line
7
029+ NULL
030+ 'foo'
031+
032+ Notice: Undefined variable: a in /home/sebbu/apache/php-5.0.3/Zend/tests/bug22836.php on line
7
033+ NULL
023-
024- Strict Standards: Only variable references should be returned by reference in %s on line %d
025- string(3) "foo"
026- 'foo'
027-
028- Notice: Undefined variable: a in %s on line %d
029-
030- Strict Standards: Only variable references should be returned by reference in %s on line %d
031- string(3) "foo"
032- 'foo'
033-
034- Notice: Undefined variable: a in %s on line %d
035-
036- Strict Standards: Only variable references should be returned by reference in %s on line %d
037- string(3) "foo"
038- 'foo'
039-
040- Notice: Undefined variable: a in %s on line %d
041-
042- Strict Standards: Only variable references should be returned by reference in %s on line %d
043- string(3) "foo"
044- 'foo'
045-
046- Notice: Undefined variable: a in %s on line %d
047-
048- Strict Standards: Only variable references should be returned by reference in %s on line %d
049- string(3) "foo"
050- 'foo'
051-
052- Notice: Undefined variable: a in %s on line %d
053-
054- Strict Standards: Only variable references should be returned by reference in %s on line %d
================================================================================
================================================================================
/home/sebbu/apache/php-5.0.3/Zend/tests/bug28444.phpt
================================================================================
---- EXPECTED OUTPUT
object(Object)#%d (1) {
["x"]=>
int(2)
}
int(2)
int(3)
Overloaded::__set(y,3)
int(3)
Overloaded::__get(y)
int(3)
Overloaded::__set(z,Object id #3)
object(Object)#%d (1) {
["x"]=>
int(4)
}
Overloaded::__get(z)
int(4)
Overloaded::__get(z)
int(5)
Overloaded::__get(z)
int(6)
===DONE===
---- ACTUAL OUTPUT
object(Object)#2 (1) {
["x"]=>
int(2)
}
int(2)
int(3)
Overloaded::__set(y,3)
int(3)
Overloaded::__get(y)
int(3)
Overloaded::__set(z,Object id #3)
object(Object)#3 (1) {
["x"]=>
int(4)
}
Overloaded::__get(z)
int(4)
Overloaded::__get(z)
int(5)
Fatal error: Cannot access undefined property for object with overloaded property access in
/home/sebbu/apache/php-5.0.3/Zend/tests/bug28444.php on line 45
---- FAILED
================================================================================
020+
021+ Fatal error: Cannot access undefined property for object with overloaded property access in
/home/sebbu/apache/php-5.0.3/Zend/tests/bug28444.php on line 45
020- Overloaded::__get(z)
021- int(6)
022- ===DONE===
================================================================================
================================================================================
/home/sebbu/apache/php-5.0.3/ext/dom/tests/dom003.phpt
================================================================================
---- EXPECTED OUTPUT
--- Catch exception with try/catch
object(DOMException)#%d (6) {
["message:protected"]=>
string(23) "Hierarchy Request Error"
["string:private"]=>
string(0) ""
["file:protected"]=>
string(%d) "%s/ext/dom/tests/dom003.php"
["line:protected"]=>
int(8)
["trace:private"]=>
array(0) {
}
["code"]=>
int(3)
}
--- Don't catch exception with try/catch
Fatal error: Uncaught exception 'DOMException' with message 'Hierarchy Request
Error' in %sdom003.php:%d
Stack trace:
#0 {main}
thrown in %sdom003.php on line %d
---- ACTUAL OUTPUT
--- Catch exception with try/catch
object(DOMException)#3 (6) {
["message:protected"]=>
string(23) "Hierarchy Request Error"
["string:private"]=>
string(0) ""
["file:protected"]=>
string(53) "/home/sebbu/apache/php-5.0.3/ext/dom/tests/dom003.php"
["line:protected"]=>
int(8)
["trace:private"]=>
array(1) {
[0]=>
array(6) {
["file"]=>
string(53) "/home/sebbu/apache/php-5.0.3/ext/dom/tests/dom003.php"
["line"]=>
int(8)
["function"]=>
string(11) "appendChild"
["class"]=>
string(10) "DOMElement"
["type"]=>
string(2) "->"
["args"]=>
array(1) {
[0]=>
object(DOMElement)#2 (0) {
}
}
}
}
["code"]=>
int(3)
}
--- Don't catch exception with try/catch
Fatal error: Uncaught exception 'DOMException' with message 'Hierarchy Request
Error' in /home/sebbu/apache/php-5.0.3/ext/dom/tests/dom003.php:13
Stack trace:
#0 /home/sebbu/apache/php-5.0.3/ext/dom/tests/dom003.php(13):
DOMElement->appendChild(Object(DOMElement))
#1 {main}
thrown in /home/sebbu/apache/php-5.0.3/ext/dom/tests/dom003.php on line 13
---- FAILED
================================================================================
012+ array(1) {
013+ [0]=>
014+ array(6) {
015+ ["file"]=>
016+ string(53) "/home/sebbu/apache/php-5.0.3/ext/dom/tests/dom003.php"
017+ ["line"]=>
018+ int(8)
019+ ["function"]=>
020+ string(11) "appendChild"
021+ ["class"]=>
022+ string(10) "DOMElement"
012- array(0) {
013- }
014- ["code"]=>
015- int(3)
016- }
017- --- Don't catch exception with try/catch
018-
019- Fatal error: Uncaught exception 'DOMException' with message 'Hierarchy Request
Error' in %sdom003.php:%d
020- Stack trace:
021- #0 {main}
022- thrown in %sdom003.php on line %d
023+ ["type"]=>
024+ string(2) "->"
025+ ["args"]=>
026+ array(1) {
027+ [0]=>
028+ object(DOMElement)#2 (0) {
029+ }
030+ }
031+ }
032+ }
033+ ["code"]=>
034+ int(3)
035+ }
036+ --- Don't catch exception with try/catch
037+
038+ Fatal error: Uncaught exception 'DOMException' with message 'Hierarchy Request
Error' in /home/sebbu/apache/php-5.0.3/ext/dom/tests/dom003.php:13
039+ Stack trace:
040+ #0 /home/sebbu/apache/php-5.0.3/ext/dom/tests/dom003.php(13):
DOMElement->appendChild(Object(DOMElement))
041+ #1 {main}
042+ thrown in /home/sebbu/apache/php-5.0.3/ext/dom/tests/dom003.php on line 13
================================================================================
================================================================================
/home/sebbu/apache/php-5.0.3/ext/gd/tests/bug24155.phpt
================================================================================
---- EXPECTED OUTPUT
cc867fd65c30883463ce58d0341f0997
---- ACTUAL OUTPUT
409d70b5d493746acc2255c759d73436
---- FAILED
================================================================================
001+ 409d70b5d493746acc2255c759d73436
001- cc867fd65c30883463ce58d0341f0997
================================================================================
================================================================================
/home/sebbu/apache/php-5.0.3/ext/gd/tests/bug27582_1.phpt
================================================================================
---- EXPECTED OUTPUT
08287f8f5d406946009df5f04ca83dc0
---- ACTUAL OUTPUT
b6d55b399e27b895a1fee8a137bb8470
---- FAILED
================================================================================
001+ b6d55b399e27b895a1fee8a137bb8470
001- 08287f8f5d406946009df5f04ca83dc0
================================================================================
================================================================================
/home/sebbu/apache/php-5.0.3/ext/iconv/tests/iconv_stream_filter.phpt
================================================================================
---- EXPECTED OUTPUT
string(20) "1b244224332473244b24"
string(10) "41244f1b28"
string(2) "42"
string(20) "a4b3a4f3a4cba4c1a4cf"
string(10) "69636f6e76"
string(2) "0a"
Warning: fread(): iconv stream filter ("ISO-2022-JP"=>"EUC-JP"): invalid
multibyte sequence in %s on line %d
string(0) ""
string(0) ""
string(0) ""
---- ACTUAL OUTPUT
string(20) "1b244224332473244b24"
string(10) "41244f1b28"
string(2) "42"
string(20) "a4b3a4f3a4cba4c1a4cf"
string(10) "69636f6e76"
string(2) "0a"
string(20) "1b244f24332466245824"
string(10) "4e24421b28"
string(2) "4f"
---- FAILED
================================================================================
007+ string(20) "1b244f24332466245824"
008+ string(10) "4e24421b28"
009+ string(2) "4f"
007-
008- Warning: fread(): iconv stream filter ("ISO-2022-JP"=>"EUC-JP"): invalid
multibyte sequence in %s on line %d
009- string(0) ""
010- string(0) ""
011- string(0) ""
================================================================================
================================================================================
/home/sebbu/apache/php-5.0.3/ext/standard/tests/array/bug29992.phpt
================================================================================
---- EXPECTED OUTPUT
Array
(
[0] => 1
[1] => 2
[2] => 3
)
int(1)
int(2)
int(3)
int(1)
int(2)
int(3)
int(1)
int(2)
int(3)
int(1)
int(2)
int(3)
Array
(
[0] => 1
[1] => 2
[2] => 3
)
===DONE===
---- ACTUAL OUTPUT
Array
(
[0] => 1
[1] => 2
[2] => 3
)
int(1)
int(2)
int(3)
int(1)
int(2)
int(3)
int(1)
int(2)
int(3)
int(1)
int(2)
int(2)
Array
(
[0] => 1
[1] => 2
[2] => 2
)
===DONE===
---- FAILED
================================================================================
018+ int(2)
018- int(3)
023+ [2] => 2
023- [2] => 3
================================================================================
================================================================================
/home/sebbu/apache/php-5.0.3/ext/standard/tests/file/bug22414.phpt
================================================================================
---- EXPECTED OUTPUT
HELLO
Works
---- ACTUAL OUTPUT
HELLO
Does not work
---- FAILED
================================================================================
002+ Does not work
002- Works
================================================================================
================================================================================
/home/sebbu/apache/php-5.0.3/ext/standard/tests/math/bug24142.phpt
================================================================================
---- EXPECTED OUTPUT
round(0.005, 2) -> 0.01
round(0.015, 2) -> 0.02
round(0.025, 2) -> 0.03
round(0.035, 2) -> 0.04
round(0.045, 2) -> 0.05
round(0.055, 2) -> 0.06
round(0.065, 2) -> 0.07
round(0.075, 2) -> 0.08
round(0.085, 2) -> 0.09
---- ACTUAL OUTPUT
round(0.005, 2) -> 0.01
round(0.015, 2) -> 0.01
round(0.025, 2) -> 0.03
round(0.035, 2) -> 0.04
round(0.045, 2) -> 0.05
round(0.055, 2) -> 0.06
round(0.065, 2) -> 0.07
round(0.075, 2) -> 0.07
round(0.085, 2) -> 0.08
---- FAILED
================================================================================
002+ round(0.015, 2) -> 0.01
002- round(0.015, 2) -> 0.02
008+ round(0.075, 2) -> 0.07
009+ round(0.085, 2) -> 0.08
008- round(0.075, 2) -> 0.08
009- round(0.085, 2) -> 0.09
================================================================================
================================================================================
/home/sebbu/apache/php-5.0.3/ext/standard/tests/math/bug25694.phpt
================================================================================
---- EXPECTED OUTPUT
round 0.045 = 0.05
number format 0.045 = 0.05
round 0.055 = 0.06
number format 0.055 = 0.06
round 5.045 = 5.05
number format 5.045 = 5.05
round 5.055 = 5.06
number format 5.055 = 5.06
round 3.025 = 3.03
number format 3.025 = 3.03
round 4.025 = 4.03
number format 4.025 = 4.03
---- ACTUAL OUTPUT
round 0.045 = 0.04
number format 0.045 = 0.04
round 0.055 = 0.06
number format 0.055 = 0.06
round 5.045 = 5.04
number format 5.045 = 5.04
round 5.055 = 5.05
number format 5.055 = 5.05
round 3.025 = 3.02
number format 3.025 = 3.02
round 4.025 = 4.03
number format 4.025 = 4.03
---- FAILED
================================================================================
001+ round 0.045 = 0.04
002+ number format 0.045 = 0.04
001- round 0.045 = 0.05
002- number format 0.045 = 0.05
007+ round 5.045 = 5.04
008+ number format 5.045 = 5.04
009+
010+ round 5.055 = 5.05
011+ number format 5.055 = 5.05
012+
013+ round 3.025 = 3.02
014+ number format 3.025 = 3.02
007- round 5.045 = 5.05
008- number format 5.045 = 5.05
010- round 5.055 = 5.06
011- number format 5.055 = 5.06
012-
013- round 3.025 = 3.03
014- number format 3.025 = 3.03
015-
================================================================================
================================================================================
/home/sebbu/apache/php-5.0.3/ext/standard/tests/time/bug20382.phpt
================================================================================
---- EXPECTED OUTPUT
tStamp=Wednesday 2004-10-27 17:17:17 CEST
result=Monday 2004-11-01 00:00:00 CET
wanted=Monday 2004-11-01 00:00:00 CET
---- ACTUAL OUTPUT
tStamp=Wednesday 2004-10-27 17:17:17 CEST
result=Sunday 2004-10-31 23:00:00 CET
wanted=Monday 2004-11-01 00:00:00 CET
---- FAILED
================================================================================
002+ result=Sunday 2004-10-31 23:00:00 CET
002- result=Monday 2004-11-01 00:00:00 CET
================================================================================
================================================================================
/home/sebbu/apache/php-5.0.3/ext/xml/tests/bug26614.phpt
================================================================================
---- EXPECTED OUTPUT
CDATA
<DATA> at line 2, col 0 (byte 45)
</DATA> at line 9, col 0 (byte 90)
Comment
<DATA> at line 2, col 0 (byte 45)
</DATA> at line 9, col 0 (byte 90)
Text
<DATA> at line 2, col 0 (byte 45)
</DATA> at line 9, col 0 (byte 90)
---- ACTUAL OUTPUT
CDATA
<DATA> at line 2, col 6 (byte 9)
</DATA> at line 9, col 7 (byte 56)
Comment
<DATA> at line 2, col 6 (byte 9)
</DATA> at line 9, col 7 (byte 56)
Text
<DATA> at line 2, col 6 (byte 9)
</DATA> at line 9, col 10 (byte 56)
---- FAILED
================================================================================
002+ <DATA> at line 2, col 6 (byte 9)
003+ </DATA> at line 9, col 7 (byte 56)
002- <DATA> at line 2, col 0 (byte 45)
003- </DATA> at line 9, col 0 (byte 90)
005+ <DATA> at line 2, col 6 (byte 9)
006+ </DATA> at line 9, col 7 (byte 56)
005- <DATA> at line 2, col 0 (byte 45)
006- </DATA> at line 9, col 0 (byte 90)
008+ <DATA> at line 2, col 6 (byte 9)
009+ </DATA> at line 9, col 10 (byte 56)
008- <DATA> at line 2, col 0 (byte 45)
009- </DATA> at line 9, col 0 (byte 90)
================================================================================
================================================================================
BUILD ENVIRONMENT
================================================================================
OS:
Linux - Linux the_duc 2.6.8.1-12mdk #1 Fri Oct 1 12:53:41 CEST 2004 i686
Automake:
automake (GNU automake) 1.9
Written by Tom Tromey <tromey@redhat.com>.
Copyright 2004 Free Software Foundation, Inc.
This is free software; see the source for copying conditions. There is NO
warranty; not even for MERCHANTABILITY or FITNESS FOR A PARTICULAR PURPOSE.
Autoconf:
autoconf (GNU Autoconf) 2.59
Written by David J. MacKenzie and Akim Demaille.
Copyright (C) 2003 Free Software Foundation, Inc.
This is free software; see the source for copying conditions. There is NO
warranty; not even for MERCHANTABILITY or FITNESS FOR A PARTICULAR PURPOSE.
Bundled Libtool:
ltmain.sh (GNU libtool) 1.4.3 (1.922.2.110 2002/10/23 01:39:54)
System Libtool:
ltmain.sh (GNU libtool) 1.5.6 (1.1220.2.95 2004/04/11 05:50:42)
Copyright (C) 2003 Free Software Foundation, Inc.
This is free software; see the source for copying conditions. There is NO
warranty; not even for MERCHANTABILITY or FITNESS FOR A PARTICULAR PURPOSE.
Compiler:
Reading specs from /usr/lib/gcc/i586-mandrake-linux-gnu/3.4.1/specs
Configured with: ../configure --prefix=/usr --libdir=/usr/lib --with-slibdir=/lib
--mandir=/usr/share/man --infodir=/usr/share/info --enable-shared --enable-threads=posix
--disable-checking --enable-long-long --enable-__cxa_atexit --enable-clocale=gnu
--disable-libunwind-exceptions --enable-languages=c,c++,ada,f77,objc,java
--host=i586-mandrake-linux-gnu --with-system-zlib
Thread model: posix
gcc version 3.4.1 (Mandrakelinux 10.1 3.4.1-4mdk)
Bison:
bison (GNU Bison) 1.875d
Écrit par Robert Corbett et Richard Stallman.
Copyright © 2004 Free Software Foundation, Inc.
Ce logiciel est libre; voir les sources pour les conditions de
reproduction. AUCUNE garantie n'est donnée; tant pour des raisons
COMMERCIALES que pour RÉPONDRE À UN BESOIN PARTICULIER.
Libraries:
linux-gate.so.1 => (0xffffe000)
libcrypt.so.1 => /lib/libcrypt.so.1 (0x40026000)
libnsl.so.1 => /lib/libnsl.so.1 (0x40053000)
libWand.so.6 => /usr/local/lib/libWand.so.6 (0x40066000)
libm.so.6 => /lib/tls/libm.so.6 (0x40096000)
libpng.so.2 => /usr/local/lib/libpng.so.2 (0x400ba000)
libssl.so.0.9.7 => /usr/lib/libssl.so.0.9.7 (0x400f1000)
libcrypto.so.0.9.7 => /usr/lib/libcrypto.so.0.9.7 (0x40122000)
libresolv.so.2 => /lib/libresolv.so.2 (0x40221000)
libMagick.so.6 => /usr/local/lib/libMagick.so.6 (0x40232000)
libltdl.so.3 => /usr/local/lib/libltdl.so.3 (0x40430000)
libdl.so.2 => /lib/libdl.so.2 (0x40438000)
liblcms.so.1 => /usr/lib/liblcms.so.1 (0x4043b000)
libtiff.so.3 => /usr/local/lib/libtiff.so.3 (0x4046a000)
libjpeg.so.62 => /usr/local/lib/libjpeg.so.62 (0x404ba000)
libXext.so.6 => /usr/X11R6/lib/libXext.so.6 (0x404d9000)
libSM.so.6 => /usr/X11R6/lib/libSM.so.6 (0x404e7000)
libICE.so.6 => /usr/X11R6/lib/libICE.so.6 (0x404f1000)
libX11.so.6 => /usr/X11R6/lib/libX11.so.6 (0x40509000)
libXt.so.6 => /usr/X11R6/lib/libXt.so.6 (0x405d4000)
libfreetype.so.6 => /usr/lib/libfreetype.so.6 (0x40626000)
libxml2.so.2 => /usr/lib/libxml2.so.2 (0x4069a000)
libpthread.so.0 => /lib/tls/libpthread.so.0 (0x40785000)
libc.so.6 => /lib/tls/libc.so.6 (0x40797000)
libz.so.1 => /lib/libz.so.1 (0x408b6000)
/lib/ld-linux.so.2 => /lib/ld-linux.so.2 (0x40000000)
libstdc++.so.6 => /usr/lib/libstdc++.so.6 (0x408c7000)
libgcc_s.so.1 => /lib/libgcc_s.so.1 (0x40999000)
User's E-mail: zsbe17fr at yahoo dot fr
================================================================================
PHPINFO
================================================================================
phpinfo()
PHP Version => 5.0.3
System => Linux the_duc 2.6.8.1-12mdk #1 Fri Oct 1 12:53:41 CEST 2004 i686
Build Date => Jan 18 2005 20:12:03
Configure Command => './configure' '--build=i586-mandrake-linux-gnu'
'--prefix=/usr' '--exec-prefix=/usr' '--bindir=/usr/bin'
'--sbindir=/usr/sbin' '--sysconfdir=/etc' '--datadir=/usr/share'
'--includedir=/usr/include' '--libdir=/usr/lib'
'--libexecdir=/usr/lib' '--localstatedir=/var/lib'
'--sharedstatedir=/usr/com' '--mandir=/usr/share/man'
'--infodir=/usr/share/info' '--enable-discard-path'
'--disable-force-cgi-redirect' '--enable-shared' '--disable-static'
'--disable-debug' '--disable-rpath' '--enable-pic'
'--enable-inline-optimization' '--enable-memory-limit'
'--with-config-file-path=/etc' '--with-config-file-scan-dir=/etc/php.d'
'--with-pear=/usr/share/pear' '--enable-magic-quotes'
'--enable-debugger' '--enable-track-vars' '--with-exec-dir=/usr/bin'
'--with-versioning' '--with-mod_charset' '--with-regex=php'
'--enable-track-vars' '--enable-trans-sid' '--enable-safe-mode'
'--enable-ctype' '--enable-ftp' '--with-gettext=/usr'
'--enable-posix' '--enable-session' '--enable!
-sysvsem' '--enable-sysvshm' '--enable-yp' '--with-openssl=/usr'
'--without-kerberos' '--with-ttf' '--with-freetype-dir=/usr'
'--with-zlib=/usr' '--with-zlib=/usr' '--with-zlib-dir=/usr'
'--without-pear' '--with-apxs2=/www/bin/apxs'
'--with-mysql=/home/sebbu/mysql/mysql-standard-4.0.23-pc-linux-i686' '--with-gd'
'--with-imagick'
Server API => Command Line Interface
Virtual Directory Support => disabled
Configuration File (php.ini) Path => /etc/php.ini
Scan this dir for additional .ini files => /etc/php.d
PHP API => 20031224
PHP Extension => 20041030
Zend Extension => 220040412
Debug Build => no
Thread Safety => disabled
IPv6 Support => enabled
Registered PHP Streams => php, file, http, ftp, compress.zlib, https, ftps
Registered Stream Socket Transports => tcp, udp, unix, udg, ssl, sslv3, sslv2, tls
This program makes use of the Zend Scripting Language Engine:
Zend Engine v2.0.3, Copyright (c) 1998-2004 Zend Technologies
_______________________________________________________________________
Configuration
PHP Core
Directive => Local Value => Master Value
allow_call_time_pass_reference => On => On
allow_url_fopen => On => On
always_populate_raw_post_data => Off => Off
arg_separator.input => & => &
arg_separator.output => & => &
asp_tags => Off => Off
auto_append_file => no value => no value
auto_globals_jit => On => On
auto_prepend_file => no value => no value
browscap => no value => no value
default_charset => no value => no value
default_mimetype => text/html => text/html
define_syslog_variables => Off => Off
disable_classes => no value => no value
disable_functions => no value => no value
display_errors => On => On
display_startup_errors => Off => Off
doc_root => no value => no value
docref_ext => no value => no value
docref_root => no value => no value
enable_dl => On => On
error_append_string => no value => no value
error_log => no value => no value
error_prepend_string => no value => no value
error_reporting => 2039 => 2039
expose_php => On => On
extension_dir => ./ => ./
file_uploads => On => On
highlight.bg => #FFFFFF => #FFFFFF
highlight.comment => #FF8000 => #FF8000
highlight.default => #0000BB => #0000BB
highlight.html => #000000 => #000000
highlight.keyword => #007700 => #007700
highlight.string => #DD0000 => #DD0000
html_errors => Off => On
ignore_repeated_errors => Off => Off
ignore_repeated_source => Off => Off
ignore_user_abort => Off => Off
implicit_flush => On => Off
include_path => .: => .:
log_errors => Off => Off
log_errors_max_len => 1024 => 1024
magic_quotes_gpc => On => On
magic_quotes_runtime => Off => Off
magic_quotes_sybase => Off => Off
mail.force_extra_parameters => no value => no value
max_execution_time => 0 => 30
max_input_time => 60 => 60
memory_limit => 8M => 8M
open_basedir => no value => no value
output_buffering => 0 => no value
output_handler => no value => no value
post_max_size => 8M => 8M
precision => 12 => 12
register_argc_argv => On => On
register_globals => Off => Off
register_long_arrays => On => On
report_memleaks => On => On
report_zend_debug => Off => Off
safe_mode => Off => Off
safe_mode_exec_dir => no value => no value
safe_mode_gid => Off => Off
safe_mode_include_dir => no value => no value
sendmail_from => no value => no value
sendmail_path => /usr/sbin/sendmail -t -i => /usr/sbin/sendmail -t -i
serialize_precision => 100 => 100
short_open_tag => On => On
SMTP => localhost => localhost
smtp_port => 25 => 25
sql.safe_mode => Off => Off
track_errors => Off => Off
unserialize_callback_func => no value => no value
upload_max_filesize => 2M => 2M
upload_tmp_dir => no value => no value
user_dir => no value => no value
variables_order => EGPCS => EGPCS
xmlrpc_error_number => 0 => 0
xmlrpc_errors => Off => Off
y2k_compliance => On => On
zend.ze1_compatibility_mode => Off => Off
ctype
ctype functions => enabled
dom
DOM/XML => enabled
DOM/XML API Version => 20031129
libxml Version => 2.6.13
HTML Support => enabled
XPath Support => enabled
XPointer Support => enabled
Schema Support => enabled
RelaxNG Support => enabled
ftp
FTP support => enabled
gd
GD Support => enabled
GD Version => bundled (2.0.28 compatible)
FreeType Support => enabled
FreeType Linkage => with freetype
FreeType Version => 2.1.9
GIF Read Support => enabled
GIF Create Support => enabled
PNG Support => enabled
WBMP Support => enabled
XBM Support => enabled
gettext
GetText Support => enabled
iconv
iconv support => enabled
iconv implementation => glibc
iconv library version => 2.3.3
Directive => Local Value => Master Value
iconv.input_encoding => ISO-8859-1 => ISO-8859-1
iconv.internal_encoding => ISO-8859-1 => ISO-8859-1
iconv.output_encoding => ISO-8859-1 => ISO-8859-1
imagick
ImageMagick support => enabled
Magick Backend => ImageMagick
ImageMagick version => 6.1.8
PHP imagick version => 0.9.11
MaxRGB => 65535
Supported image formats => tmp
Font Family - Name => AvantGarde - AvantGarde-Book
libxml
libXML support => active
libXML Version => 2.6.13
libXML streams => enabled
mysql
MySQL Support => enabled
Active Persistent Links => 0
Active Links => 0
Client API version => 4.0.23
MYSQL_MODULE_TYPE => external
MYSQL_SOCKET => /tmp/mysql.sock
MYSQL_INCLUDE => -I/home/sebbu/mysql/mysql-standard-4.0.23-pc-linux-i686/include
MYSQL_LIBS => -L/home/sebbu/mysql/mysql-standard-4.0.23-pc-linux-i686/lib -lmysqlclient
Directive => Local Value => Master Value
mysql.allow_persistent => On => On
mysql.connect_timeout => 60 => 60
mysql.default_host => no value => no value
mysql.default_password => no value => no value
mysql.default_port => no value => no value
mysql.default_socket => /var/lib/mysql/mysql.sock => /var/lib/mysql/mysql.sock
mysql.default_user => no value => no value
mysql.max_links => Unlimited => Unlimited
mysql.max_persistent => Unlimited => Unlimited
mysql.trace_mode => Off => Off
openssl
OpenSSL support => enabled
OpenSSL Version => OpenSSL 0.9.7d 17 Mar 2004
pcre
PCRE (Perl Compatible Regular Expressions) Support => enabled
PCRE Library Version => 4.5 01-December-2003
posix
Revision => $Revision: 1.60 $
session
Session Support => enabled
Registered save handlers => files user sqlite
Registered serializer handlers => php php_binary
Directive => Local Value => Master Value
session.auto_start => Off => Off
session.bug_compat_42 => On => On
session.bug_compat_warn => On => On
session.cache_expire => 180 => 180
session.cache_limiter => nocache => nocache
session.cookie_domain => no value => no value
session.cookie_lifetime => 0 => 0
session.cookie_path => / => /
session.cookie_secure => Off => Off
session.entropy_file => no value => no value
session.entropy_length => 0 => 0
session.gc_divisor => 100 => 100
session.gc_maxlifetime => 1440 => 1440
session.gc_probability => 1 => 1
session.hash_bits_per_character => 4 => 4
session.hash_function => 0 => 0
session.name => PHPSESSID => PHPSESSID
session.referer_check => no value => no value
session.save_handler => files => files
session.save_path => /tmp => /tmp
session.serialize_handler => php => php
session.use_cookies => On => On
session.use_only_cookies => Off => Off
session.use_trans_sid => 0 => 0
SimpleXML
Simplexml support => enabled
Revision => $Revision: 1.139.2.4 $
Schema support => enabled
SPL
SPL support => enabled
Interfaces => RecursiveIterator, SeekableIterator
Classes => ArrayObject, ArrayIterator, CachingIterator, CachingRecursiveIterator,
DirectoryIterator, FilterIterator, LimitIterator, ParentIterator, RecursiveDirectoryIterator,
RecursiveIteratorIterator, SimpleXMLIterator
SQLite
SQLite support => enabled
PECL Module version => 2.0-dev $Id: sqlite.c,v 1.146.2.3 2004/09/26 01:41:40 wez Exp $
SQLite Library => 2.8.14
SQLite Encoding => iso8859
Directive => Local Value => Master Value
sqlite.assoc_case => 0 => 0
standard
Regex Library => Bundled library enabled
Dynamic Library Support => enabled
Path to sendmail => /usr/sbin/sendmail -t -i
Directive => Local Value => Master Value
assert.active => 1 => 1
assert.bail => 0 => 0
assert.callback => no value => no value
assert.quiet_eval => 0 => 0
assert.warning => 1 => 1
auto_detect_line_endings => 0 => 0
date.default_latitude => 31.7667 => 31.7667
date.default_longitude => 35.2333 => 35.2333
date.sunrise_zenith => 90.83 => 90.83
date.sunset_zenith => 90.83 => 90.83
default_socket_timeout => 60 => 60
safe_mode_allowed_env_vars => PHP_ => PHP_
safe_mode_protected_env_vars => LD_LIBRARY_PATH => LD_LIBRARY_PATH
url_rewriter.tags => a=href,area=href,frame=src,input=src,form=,fieldset= =>
a=href,area=href,frame=src,input=src,form=,fieldset=
user_agent => no value => no value
tokenizer
Tokenizer Support => enabled
xml
XML Support => active
XML Namespace Support => active
libxml2 Version => 2.6.13
yp
YP Support => enabled
zlib
ZLib Support => enabled
Compiled Version => 1.2.1
Linked Version => 1.2.1
Directive => Local Value => Master Value
zlib.output_compression => Off => Off
zlib.output_compression_level => -1 => -1
zlib.output_handler => no value => no value
Additional Modules
Module Name
sysvsem
sysvshm
Environment
Variable => Value
LESSKEY => /etc/.less
LC_PAPER => fr_FR
LC_ADDRESS => fr_FR
HOSTNAME => the_duc
LC_MONETARY => fr_FR
TEST_PHP_SRCDIR => /home/sebbu/apache/php-5.0.3
SHELL => /bin/sh
TERM => xterm
LC_SOURCED => 1
MAKEFLAGS =>
HISTSIZE => 1000
TMPDIR => /root/tmp
SSH_CLIENT => deleted
LC_NUMERIC => fr_FR
QTDIR => /usr/lib/qt3/
SSH_TTY => deleted
USER => sebbu
LS_COLORS =>
no=00:fi=00:di=01;34:ln=01;36:pi=40;33:so=01;35:bd=40;33;01:cd=40;33;01:or=01;05;37;41:mi=01;05;37;41:ex=01;32:*.cmd=01;32:*.exe=01;32:*.com=01;32:*.btm=01;32:*.bat=01;32:*.sh=01;32:*.csh=01;32:*.tar=01;31:*.tgz=01;31:*.arj=01;31:*.taz=01;31:*.lzh=01;31:*.zip=01;31:*.z=01;31:*.Z=01;31:*.gz=01;31:*.bz2=01;31:*.bz=01;31:*.tz=01;31:*.rpm=01;31:*.cpio=01;31:*.jpg=01;35:*.gif=01;35:*.bmp=01;35:*.xbm=01;35:*.xpm=01;35:*.png=01;35:*.tif=01;35:
LC_TELEPHONE => fr_FR
SCRIPT_FILENAME =>
ENV => /root/.bashrc
SSH_AUTH_SOCK => deleted
USERNAME => root
MAKELEVEL => 1
MFLAGS =>
PATH => /sbin:/usr/sbin:/bin:/usr/bin:/usr/X11R6/bin:/usr/local/bin:/usr/local/sbin
MAIL => /var/spool/mail/sebbu
LC_MESSAGES => fr_FR
_ => /home/sebbu/apache/php-5.0.3/sapi/cli/php
LC_COLLATE => fr_FR
SECURE_LEVEL => 2
LC_IDENTIFICATION => fr_FR
PWD => /home/sebbu/apache/php-5.0.3
INPUTRC => /etc/inputrc
LANG => fr_FR
TEST_PHP_EXECUTABLE => /home/sebbu/apache/php-5.0.3/sapi/cli/php
REDIRECT_STATUS =>
PYTHONSTARTUP => /etc/pythonrc.py
LC_MEASUREMENT => fr_FR
PATH_TRANSLATED =>
HISTCONTROL => ignoredups
HOME => /root
SHLVL => 4
CONTENT_LENGTH =>
LANGUAGE => fr_FR:fr
GCONF_TMPDIR => /tmp
LOGNAME => sebbu
LESS => -MM
TMP => /root/tmp
QUERY_STRING =>
LC_CTYPE => fr_FR
SSH_CONNECTION => 83.194.45.194 13397 192.168.1.100 22
LESSOPEN => |/usr/bin/lesspipe.sh %s
CONTENT_TYPE =>
CC => gcc
REQUEST_METHOD =>
LC_TIME => fr_FR
G_BROKEN_FILENAMES => 1
LC_NAME => fr_FR
PHP Variables
Variable => Value
_SERVER["LESSKEY"] => /etc/.less
_SERVER["LC_PAPER"] => fr_FR
_SERVER["LC_ADDRESS"] => fr_FR
_SERVER["HOSTNAME"] => the_duc
_SERVER["LC_MONETARY"] => fr_FR
_SERVER["TEST_PHP_SRCDIR"] => /home/sebbu/apache/php-5.0.3
_SERVER["SHELL"] => /bin/sh
_SERVER["TERM"] => xterm
_SERVER["LC_SOURCED"] => 1
_SERVER["MAKEFLAGS"] =>
_SERVER["HISTSIZE"] => 1000
_SERVER["TMPDIR"] => /root/tmp
_SERVER["SSH_CLIENT"] => deleted
_SERVER["LC_NUMERIC"] => fr_FR
_SERVER["QTDIR"] => /usr/lib/qt3/
_SERVER["SSH_TTY"] => deleted
_SERVER["USER"] => sebbu
_SERVER["LS_COLORS"] =>
no=00:fi=00:di=01;34:ln=01;36:pi=40;33:so=01;35:bd=40;33;01:cd=40;33;01:or=01;05;37;41:mi=01;05;37;41:ex=01;32:*.cmd=01;32:*.exe=01;32:*.com=01;32:*.btm=01;32:*.bat=01;32:*.sh=01;32:*.csh=01;32:*.tar=01;31:*.tgz=01;31:*.arj=01;31:*.taz=01;31:*.lzh=01;31:*.zip=01;31:*.z=01;31:*.Z=01;31:*.gz=01;31:*.bz2=01;31:*.bz=01;31:*.tz=01;31:*.rpm=01;31:*.cpio=01;31:*.jpg=01;35:*.gif=01;35:*.bmp=01;35:*.xbm=01;35:*.xpm=01;35:*.png=01;35:*.tif=01;35:
_SERVER["LC_TELEPHONE"] => fr_FR
_SERVER["SCRIPT_FILENAME"] =>
_SERVER["ENV"] => /root/.bashrc
_SERVER["SSH_AUTH_SOCK"] => deleted
_SERVER["USERNAME"] => root
_SERVER["MAKELEVEL"] => 1
_SERVER["MFLAGS"] =>
_SERVER["PATH"] =>
/sbin:/usr/sbin:/bin:/usr/bin:/usr/X11R6/bin:/usr/local/bin:/usr/local/sbin
_SERVER["MAIL"] => /var/spool/mail/sebbu
_SERVER["LC_MESSAGES"] => fr_FR
_SERVER["_"] => /home/sebbu/apache/php-5.0.3/sapi/cli/php
_SERVER["LC_COLLATE"] => fr_FR
_SERVER["SECURE_LEVEL"] => 2
_SERVER["LC_IDENTIFICATION"] => fr_FR
_SERVER["PWD"] => /home/sebbu/apache/php-5.0.3
_SERVER["INPUTRC"] => /etc/inputrc
_SERVER["LANG"] => fr_FR
_SERVER["TEST_PHP_EXECUTABLE"] => /home/sebbu/apache/php-5.0.3/sapi/cli/php
_SERVER["REDIRECT_STATUS"] =>
_SERVER["PYTHONSTARTUP"] => /etc/pythonrc.py
_SERVER["LC_MEASUREMENT"] => fr_FR
_SERVER["PATH_TRANSLATED"] =>
_SERVER["HISTCONTROL"] => ignoredups
_SERVER["HOME"] => /root
_SERVER["SHLVL"] => 4
_SERVER["CONTENT_LENGTH"] =>
_SERVER["LANGUAGE"] => fr_FR:fr
_SERVER["GCONF_TMPDIR"] => /tmp
_SERVER["LOGNAME"] => sebbu
_SERVER["LESS"] => -MM
_SERVER["TMP"] => /root/tmp
_SERVER["QUERY_STRING"] =>
_SERVER["LC_CTYPE"] => fr_FR
_SERVER["SSH_CONNECTION"] => 83.194.45.194 13397 192.168.1.100 22
_SERVER["LESSOPEN"] => |/usr/bin/lesspipe.sh %s
_SERVER["CONTENT_TYPE"] =>
_SERVER["CC"] => gcc
_SERVER["REQUEST_METHOD"] =>
_SERVER["LC_TIME"] => fr_FR
_SERVER["G_BROKEN_FILENAMES"] => 1
_SERVER["LC_NAME"] => fr_FR
_SERVER["PHP_SELF"] =>
_SERVER["SCRIPT_NAME"] =>
_SERVER["DOCUMENT_ROOT"] =>
_SERVER["argv"] => Array
(
)
_SERVER["argc"] => 0
_ENV["LESSKEY"] => /etc/.less
_ENV["LC_PAPER"] => fr_FR
_ENV["LC_ADDRESS"] => fr_FR
_ENV["HOSTNAME"] => the_duc
_ENV["LC_MONETARY"] => fr_FR
_ENV["TEST_PHP_SRCDIR"] => /home/sebbu/apache/php-5.0.3
_ENV["SHELL"] => /bin/sh
_ENV["TERM"] => xterm
_ENV["LC_SOURCED"] => 1
_ENV["MAKEFLAGS"] =>
_ENV["HISTSIZE"] => 1000
_ENV["TMPDIR"] => /root/tmp
_ENV["SSH_CLIENT"] => deleted
_ENV["LC_NUMERIC"] => fr_FR
_ENV["QTDIR"] => /usr/lib/qt3/
_ENV["SSH_TTY"] => deleted
_ENV["USER"] => sebbu
_ENV["LS_COLORS"] =>
no=00:fi=00:di=01;34:ln=01;36:pi=40;33:so=01;35:bd=40;33;01:cd=40;33;01:or=01;05;37;41:mi=01;05;37;41:ex=01;32:*.cmd=01;32:*.exe=01;32:*.com=01;32:*.btm=01;32:*.bat=01;32:*.sh=01;32:*.csh=01;32:*.tar=01;31:*.tgz=01;31:*.arj=01;31:*.taz=01;31:*.lzh=01;31:*.zip=01;31:*.z=01;31:*.Z=01;31:*.gz=01;31:*.bz2=01;31:*.bz=01;31:*.tz=01;31:*.rpm=01;31:*.cpio=01;31:*.jpg=01;35:*.gif=01;35:*.bmp=01;35:*.xbm=01;35:*.xpm=01;35:*.png=01;35:*.tif=01;35:
_ENV["LC_TELEPHONE"] => fr_FR
_ENV["SCRIPT_FILENAME"] =>
_ENV["ENV"] => /root/.bashrc
_ENV["SSH_AUTH_SOCK"] => deleted
_ENV["USERNAME"] => root
_ENV["MAKELEVEL"] => 1
_ENV["MFLAGS"] =>
_ENV["PATH"] =>
/sbin:/usr/sbin:/bin:/usr/bin:/usr/X11R6/bin:/usr/local/bin:/usr/local/sbin
_ENV["MAIL"] => /var/spool/mail/sebbu
_ENV["LC_MESSAGES"] => fr_FR
_ENV["_"] => /home/sebbu/apache/php-5.0.3/sapi/cli/php
_ENV["LC_COLLATE"] => fr_FR
_ENV["SECURE_LEVEL"] => 2
_ENV["LC_IDENTIFICATION"] => fr_FR
_ENV["PWD"] => /home/sebbu/apache/php-5.0.3
_ENV["INPUTRC"] => /etc/inputrc
_ENV["LANG"] => fr_FR
_ENV["TEST_PHP_EXECUTABLE"] => /home/sebbu/apache/php-5.0.3/sapi/cli/php
_ENV["REDIRECT_STATUS"] =>
_ENV["PYTHONSTARTUP"] => /etc/pythonrc.py
_ENV["LC_MEASUREMENT"] => fr_FR
_ENV["PATH_TRANSLATED"] =>
_ENV["HISTCONTROL"] => ignoredups
_ENV["HOME"] => /root
_ENV["SHLVL"] => 4
_ENV["CONTENT_LENGTH"] =>
_ENV["LANGUAGE"] => fr_FR:fr
_ENV["GCONF_TMPDIR"] => /tmp
_ENV["LOGNAME"] => sebbu
_ENV["LESS"] => -MM
_ENV["TMP"] => /root/tmp
_ENV["QUERY_STRING"] =>
_ENV["LC_CTYPE"] => fr_FR
_ENV["SSH_CONNECTION"] => 83.194.45.194 13397 192.168.1.100 22
_ENV["LESSOPEN"] => |/usr/bin/lesspipe.sh %s
_ENV["CONTENT_TYPE"] =>
_ENV["CC"] => gcc
_ENV["REQUEST_METHOD"] =>
_ENV["LC_TIME"] => fr_FR
_ENV["G_BROKEN_FILENAMES"] => 1
_ENV["LC_NAME"] => fr_FR
PHP License
This program is free software; you can redistribute it and/or modify
it under the terms of the PHP License as published by the PHP Group
and included in the distribution in the file: LICENSE
This program is distributed in the hope that it will be useful,
but WITHOUT ANY WARRANTY; without even the implied warranty of
MERCHANTABILITY or FITNESS FOR A PARTICULAR PURPOSE.
If you did not receive a copy of the PHP license, or have any
questions about PHP licensing, please contact license@php.net.