Test results for 4.3.11-dev [failed]

From: Date: Tue, 18 Jan 2005 21:03:39 +0000
Subject: Test results for 4.3.11-dev [failed]
Groups: php.qa 
Request: Send a blank email to php-qa+get-23034@lists.php.net to get a copy of this message
===================================================================== FAILED TEST SUMMARY --------------------------------------------------------------------- Bug #16069 [ext/iconv/tests/bug16069.phpt] OpenSSL private key functions [ext/openssl/tests/001.phpt] openssl: get public key from generated private key [ext/openssl/tests/bug25614.phpt] Bug #31213 (Sideeffects caused by bug #29493) [ext/standard/tests/array/bug31213.phpt] ===================================================================== ===================================================================== TEST RESULT SUMMARY --------------------------------------------------------------------- Exts skipped : 69 Exts tested : 19 --------------------------------------------------------------------- Number of tests : 617 Tests skipped : 193 (31.3%) Tests warned : 0 (0.0%) Tests failed : 4 (0.6%) Tests passed : 420 (68.1%) --------------------------------------------------------------------- Time taken : 131 seconds ===================================================================== ================================================================================ /usr/local/apache2/build/php4-STABLE-200501181930/ext/iconv/tests/bug16069.phpt ================================================================================ ---- EXPECTED OUTPUT ¥ß¥ê¥Ð¡¼¥ë¥ß¥ê¥Ð¡¼¥ë¥ß¥ê¥Ð¡¼¥ë¥ß¥ê¥Ð¡¼¥ë¥ß¥ê¥Ð¡¼¥ë¥ß¥ê¥Ð¡¼¥ë¥ß¥ê¥Ð¡¼¥ë¥ß¥ê¥Ð¡¼¥ë¥ß¥ê¥Ð¡¼¥ë¥ß¥ê¥Ð¡¼¥ë¥ß¥ê¥Ð¡¼¥ë¥ß¥ê¥Ð¡¼¥ë¥ß¥ê¥Ð¡¼¥ë¥ß¥ê¥Ð¡¼¥ë¥ß¥ê¥Ð¡¼¥ë¥ß¥ê¥Ð¡¼¥ë¥ß¥ê¥Ð¡¼¥ë¥ß¥ê¥Ð¡¼¥ë¥ß¥ê¥Ð¡¼¥ë¥ß¥ê¥Ð¡¼¥ë¥ß¥ê¥Ð¡¼¥ë¥ß¥ê¥Ð¡¼¥ë¥ß¥ê¥Ð¡¼¥ë¥ß¥ê¥Ð¡¼¥ë¥ß¥ê¥Ð¡¼¥ë¥ß¥ê¥Ð¡¼¥ë¥ß¥ê¥Ð¡¼¥ë¥ß¥ê¥Ð¡¼¥ë¥ß¥ê¥Ð¡¼¥ë¥ß¥ê¥Ð¡¼¥ë¥ß¥ê¥Ð¡¼¥ë¥ß¥ê¥Ð¡¼¥ë¥ß¥ê¥Ð¡¼¥ë¥ß¥ê¥Ð¡¼¥ë¥ß¥ê¥Ð¡¼¥ë¥ß¥ê¥Ð¡¼¥ë¥ß¥ê¥Ð¡¼¥ë¥ß¥ê¥Ð¡¼¥ë¥ß¥ê¥Ð¡¼¥ë¥ß¥ê¥Ð¡¼¥ë(¡ë§¥¡ë) ---- ACTUAL OUTPUT ????????????????????????????????????????(¡ë§¥¡ë) ---- FAILED ================================================================================ 001- ¥ß¥ê¥Ð¡¼¥ë¥ß¥ê¥Ð¡¼¥ë¥ß¥ê¥Ð¡¼¥ë¥ß¥ê¥Ð¡¼¥ë¥ß¥ê¥Ð¡¼¥ë¥ß¥ê¥Ð¡¼¥ë¥ß¥ê¥Ð¡¼¥ë¥ß¥ê¥Ð¡¼¥ë¥ß¥ê¥Ð¡¼¥ë¥ß¥ê¥Ð¡¼¥ë¥ß¥ê¥Ð¡¼¥ë¥ß¥ê¥Ð¡¼¥ë¥ß¥ê¥Ð¡¼¥ë¥ß¥ê¥Ð¡¼¥ë¥ß¥ê¥Ð¡¼¥ë¥ß¥ê¥Ð¡¼¥ë¥ß¥ê¥Ð¡¼¥ë¥ß¥ê¥Ð¡¼¥ë¥ß¥ê¥Ð¡¼¥ë¥ß¥ê¥Ð¡¼¥ë¥ß¥ê¥Ð¡¼¥ë¥ß¥ê¥Ð¡¼¥ë¥ß¥ê¥Ð¡¼¥ë¥ß¥ê¥Ð¡¼¥ë¥ß¥ê¥Ð¡¼¥ë¥ß¥ê¥Ð¡¼¥ë¥ß¥ê¥Ð¡¼¥ë¥ß¥ê¥Ð¡¼¥ë¥ß¥ê¥Ð¡¼¥ë¥ß¥ê¥Ð¡¼¥ë¥ß¥ê¥Ð¡¼¥ë¥ß¥ê¥Ð¡¼¥ë¥ß¥ê¥Ð¡¼¥ë¥ß¥ê¥Ð¡¼¥ë¥ß¥ê¥Ð¡¼¥ë¥ß¥ê¥Ð¡¼¥ë¥ß¥ê¥Ð¡¼¥ë¥ß¥ê¥Ð¡¼¥ë¥ß¥ê¥Ð¡¼¥ë¥ß¥ê¥Ð¡¼¥ë(¡ë§¥¡ë) 001+ ????????????????????????????????????????(¡ë§¥¡ë) ================================================================================ ================================================================================ /usr/local/apache2/build/php4-STABLE-200501181930/ext/openssl/tests/001.phpt ================================================================================ ---- EXPECTED OUTPUT Creating private key Export key to file Load key from file - array syntax Load key using direct syntax Load key manually and use string syntax OK! ---- ACTUAL OUTPUT Creating private key failed to create private key ---- FAILED ================================================================================ 002- Export key to file 002+ failed to create private key 003- Load key from file - array syntax 004- Load key using direct syntax 005- Load key manually and use string syntax 006- OK! ================================================================================ ================================================================================ /usr/local/apache2/build/php4-STABLE-200501181930/ext/openssl/tests/bug25614.phpt ================================================================================ ---- EXPECTED OUTPUT Warning: openssl_pkey_get_public(): Don't know how to get public key from this private key (the documentation lied) %s ---- ACTUAL OUTPUT ---- FAILED ================================================================================ 001- Warning: openssl_pkey_get_public(): Don't know how to get public key from this private key (the documentation lied) %s 001+ ================================================================================ ================================================================================ /usr/local/apache2/build/php4-STABLE-200501181930/ext/standard/tests/array/bug31213.phpt ================================================================================ ---- EXPECTED OUTPUT int(1) int(1) int(1) int(2) int(2) int(2) array(2) { ["_a"]=> &int(2) ["_b"]=> &int(2) } int(1) int(1) int(1) int(2) int(2) int(2) array(2) { ["_a"]=> &int(2) ["_b"]=> &int(2) } ---- ACTUAL OUTPUT int(1) int(1) int(1) int(2) int(2) int(2) array(2) { ["_a"]=> &int(2) ["_b"]=> &int(2) } int(1) int(1) int(2) int(2) int(2) int(2) array(2) { ["_a"]=> &int(2) ["_b"]=> &int(2) } ---- FAILED ================================================================================ 015- int(1) 015+ int(2) ================================================================================ ================================================================================ BUILD ENVIRONMENT ================================================================================ OS: Linux - Linux pythagoras.m-cam.com 2.6.8 #1 SMP Wed Sep 22 18:48:59 EDT 2004 sparc64 Automake: automake (GNU automake) 1.4-p6 Copyright (C) 1999, 2001 Free Software Foundation, Inc. This is free software; see the source for copying conditions. There is NO warranty; not even for MERCHANTABILITY or FITNESS FOR A PARTICULAR PURPOSE. Written by Tom Tromey <tromey@redhat.com> Autoconf: autoconf (GNU Autoconf) 2.59 Written by David J. MacKenzie and Akim Demaille. Copyright (C) 2003 Free Software Foundation, Inc. This is free software; see the source for copying conditions. There is NO warranty; not even for MERCHANTABILITY or FITNESS FOR A PARTICULAR PURPOSE. Libtool: ltmain.sh (GNU libtool) 1.4.3 (1.922.2.110 2002/10/23 01:39:54) Compiler: Reading specs from /usr/lib/gcc-lib/sparc-linux/3.3.5/specs Configured with: ../src/configure -v --enable-languages=c,c++,java,f77,pascal,objc,ada,treelang --prefix=/usr --mandir=/usr/share/man --infodir=/usr/share/info --with-gxx-include-dir=/usr/include/c++/3.3 --enable-shared --with-system-zlib --enable-nls --without-included-gettext --enable-__cxa_atexit --enable-clocale=gnu --enable-debug --enable-java-gc=boehm --enable-java-awt=xlib --with-cpu=v7 --enable-objc-gc sparc-linux Thread model: posix gcc version 3.3.5 (Debian 1:3.3.5-5) Bison: bison (GNU Bison) 1.875d Written by Robert Corbett and Richard Stallman. Copyright (C) 2004 Free Software Foundation, Inc. This is free software; see the source for copying conditions. There is NO warranty; not even for MERCHANTABILITY or FITNESS FOR A PARTICULAR PURPOSE. Libraries: libcrypt.so.1 => /lib/libcrypt.so.1 (0x7002c000) libc-client.so.2002edebian => /usr/lib/libc-client.so.2002edebian (0x70068000) libpq.so.3 => /usr/lib/libpq.so.3 (0x70138000) libmcrypt.so.4 => /usr/lib/libmcrypt.so.4 (0x70164000) libltdl.so.3 => /usr/lib/libltdl.so.3 (0x701a4000) libldap.so.2 => /usr/lib/libldap.so.2 (0x701c0000) liblber.so.2 => /usr/lib/liblber.so.2 (0x70208000) libssl.so.0.9.7 => /usr/lib/v9/libssl.so.0.9.7 (0x70228000) libcrypto.so.0.9.7 => /usr/lib/v9/libcrypto.so.0.9.7 (0x70268000) libpam.so.0 => /lib/libpam.so.0 (0x70384000) libz.so.1 => /usr/lib/libz.so.1 (0x7039c000) libresolv.so.2 => /lib/libresolv.so.2 (0x703c0000) libm.so.6 => /lib/libm.so.6 (0x703e4000) libdl.so.2 => /lib/libdl.so.2 (0x70478000) libnsl.so.1 => /lib/libnsl.so.1 (0x7048c000) libgssapi_krb5.so.2 => /usr/lib/libgssapi_krb5.so.2 (0x704b0000) libkrb5.so.3 => /usr/lib/libkrb5.so.3 (0x704d4000) libk5crypto.so.3 => /usr/lib/libk5crypto.so.3 (0x70544000) libcom_err.so.2 => /lib/libcom_err.so.2 (0x70578000) libxml2.so.2 => /usr/lib/libxml2.so.2 (0x7058c000) libpthread.so.0 => /lib/libpthread.so.0 (0x706b0000) libc.so.6 => /lib/libc.so.6 (0x70710000) libsasl2.so.2 => /usr/lib/libsasl2.so.2 (0x70860000) libgnutls.so.11 => /usr/lib/libgnutls.so.11 (0x70888000) /lib/ld-linux.so.2 => /lib/ld-linux.so.2 (0x70000000) libtasn1.so.2 => /usr/lib/libtasn1.so.2 (0x70908000) libgcrypt.so.11 => /usr/lib/libgcrypt.so.11 (0x70928000) libgpg-error.so.0 => /usr/lib/libgpg-error.so.0 (0x7098c000) User's E-mail: ag at m-cam dot com ================================================================================ PHPINFO ================================================================================ phpinfo() PHP Version => 4.3.11-dev System => Linux pythagoras.m-cam.com 2.6.8 #1 SMP Wed Sep 22 18:48:59 EDT 2004 sparc64 Build Date => Jan 18 2005 15:56:27 Configure Command => './configure' '--with-apxs2=/usr/local/apache2/bin/apxs' '--with-gettext' '--with-xml' '--with-dom' '--with-pgsql' '--with-mcrypt' '--with-iconv' '--enable-mbstring' '--with-mbstring=all' '--with-zlib-dir=/usr/include' '--with-imap' '--with-openssl' '--with-ldap' '--with-kerberos' '--with-imap-ssl' '--without-mysql' Server API => Command Line Interface Virtual Directory Support => disabled Configuration File (php.ini) Path => /usr/local/lib/php.ini PHP API => 20020918 PHP Extension => 20020429 Zend Extension => 20021010 Debug Build => no Thread Safety => disabled Registered PHP Streams => php, http, ftp, https, ftps, compress.zlib This program makes use of the Zend Scripting Language Engine: Zend Engine v1.3.0, Copyright (c) 1998-2004 Zend Technologies _______________________________________________________________________ Configuration PHP Core Directive => Local Value => Master Value allow_call_time_pass_reference => On => On allow_url_fopen => On => On always_populate_raw_post_data => Off => Off arg_separator.input => & => & arg_separator.output => & => & asp_tags => Off => Off auto_append_file => no value => no value auto_prepend_file => no value => no value browscap => no value => no value default_charset => no value => no value default_mimetype => text/html => text/html define_syslog_variables => Off => Off disable_classes => no value => no value disable_functions => no value => no value display_errors => On => On display_startup_errors => Off => Off doc_root => no value => no value docref_ext => no value => no value docref_root => no value => no value enable_dl => On => On error_append_string => no value => no value error_log => no value => no value error_prepend_string => no value => no value error_reporting => 2039 => 2039 expose_php => On => On extension_dir => /usr/local/lib/php/extensions/no-debug-non-zts-20020429/ => /usr/local/lib/php/extensions/no-debug-non-zts-20020429/ file_uploads => On => On gpc_order => GPC => GPC highlight.bg => #FFFFFF => #FFFFFF highlight.comment => #FF8000 =>

« previous php.qa (#23034) next »