Test results for 5.0.3 [failed]

From: Date: Wed, 19 Jan 2005 02:20:08 +0000
Subject: Test results for 5.0.3 [failed]
Groups: php.qa 
Request: Send a blank email to php-qa+get-23040@lists.php.net to get a copy of this message
===================================================================== FAILED TEST SUMMARY --------------------------------------------------------------------- Test for buffering in core functions with implicit flush off [tests/func/008.phpt] Convert warnings to exceptions [tests/lang/038.phpt] Bug #29944 (function defined in switch crashes PHP) [tests/lang/bug29944.phpt] Bug #30638 (localeconv returns wrong LC_NUMERIC settings) [tests/lang/bug30638.phpt] Bug #22836 (returning references to NULL) [Zend/tests/bug22836.phpt] Bug #28444 (Cannot access undefined property for object with overloaded property access) [Zend/tests/bug28444.phpt] Test 3: Exception Test [ext/dom/tests/dom003.phpt] Test 5: HTML Test [ext/dom/tests/dom005.phpt] HTML input/output [ext/mbstring/tests/htmlent.phpt] mb_output_handler() (Shift_JIS) [ext/mbstring/tests/mb_output_handler_shift_jis.phpt] mysqli autocommit/commit/rollback [ext/mysqli/tests/014.phpt] Bug #29992 (foreach by reference corrupts the array) [ext/standard/tests/array/bug29992.phpt] File type functions [ext/standard/tests/file/001.phpt] Bug #22414 (passthru() does not read data correctly) [ext/standard/tests/file/bug22414.phpt] Bug #20382 (strtotime ("Monday", $date) produces wrong result on DST changeover) [ext/standard/tests/time/bug20382.phpt] Bug #27719: mktime returns incorrect timestamp for dst days [ext/standard/tests/time/bug27719.phpt] Bug #27780 (strtotime(+1 xxx) returns a wrong date/time) [ext/standard/tests/time/bug27780.phpt] Bug #26614 (CDATA sections skipped on line count) [ext/xml/tests/bug26614.phpt] ===================================================================== ===================================================================== TEST RESULT SUMMARY --------------------------------------------------------------------- Exts skipped : 69 Exts tested : 14 --------------------------------------------------------------------- Number of tests : 1291 712 Tests skipped : 579 (44.8%) -------- Tests warned : 0 (0.0%) (0.0%) Tests failed : 18 (1.4%) (2.5%) Tests passed : 694 (53.8%) (97.5%) --------------------------------------------------------------------- Time taken : 204 seconds ===================================================================== ===================================================================== FAILED TEST SUMMARY --------------------------------------------------------------------- Test for buffering in core functions with implicit flush off [tests/func/008.phpt] Convert warnings to exceptions [tests/lang/038.phpt] Bug #29944 (function defined in switch crashes PHP) [tests/lang/bug29944.phpt] Bug #30638 (localeconv returns wrong LC_NUMERIC settings) [tests/lang/bug30638.phpt] Bug #22836 (returning references to NULL) [Zend/tests/bug22836.phpt] Bug #28444 (Cannot access undefined property for object with overloaded property access) [Zend/tests/bug28444.phpt] Test 3: Exception Test [ext/dom/tests/dom003.phpt] Test 5: HTML Test [ext/dom/tests/dom005.phpt] HTML input/output [ext/mbstring/tests/htmlent.phpt] mb_output_handler() (Shift_JIS) [ext/mbstring/tests/mb_output_handler_shift_jis.phpt] mysqli autocommit/commit/rollback [ext/mysqli/tests/014.phpt] Bug #29992 (foreach by reference corrupts the array) [ext/standard/tests/array/bug29992.phpt] File type functions [ext/standard/tests/file/001.phpt] Bug #22414 (passthru() does not read data correctly) [ext/standard/tests/file/bug22414.phpt] Bug #20382 (strtotime ("Monday", $date) produces wrong result on DST changeover) [ext/standard/tests/time/bug20382.phpt] Bug #27719: mktime returns incorrect timestamp for dst days [ext/standard/tests/time/bug27719.phpt] Bug #27780 (strtotime(+1 xxx) returns a wrong date/time) [ext/standard/tests/time/bug27780.phpt] Bug #26614 (CDATA sections skipped on line count) [ext/xml/tests/bug26614.phpt] ===================================================================== ================================================================================ /usr/local/src/php-5.0.3/tests/func/008.phpt ================================================================================ ---- EXPECTED OUTPUT 'foo1' 'foo2' ---- ACTUAL OUTPUT ---- FAILED ================================================================================ 001- 'foo1' 003- 'foo2' ================================================================================ ================================================================================ /usr/local/src/php-5.0.3/tests/lang/038.phpt ================================================================================ ---- EXPECTED OUTPUT string(15) "Error2Exception" string(5) "fopen" ===DONE=== ---- ACTUAL OUTPUT string(15) "Error2Exception" string(15) "Error2Exception" ===DONE=== ---- FAILED ================================================================================ 002+ string(15) "Error2Exception" 002- string(5) "fopen" ================================================================================ ================================================================================ /usr/local/src/php-5.0.3/tests/lang/bug29944.phpt ================================================================================ ---- EXPECTED OUTPUT 1 ===DONE=== ---- ACTUAL OUTPUT ---- FAILED ================================================================================ 001+ 001- 1 002- ===DONE=== ================================================================================ ================================================================================ /usr/local/src/php-5.0.3/tests/lang/bug30638.phpt ================================================================================ ---- EXPECTED OUTPUT decimal_point: , thousands_sep: . ---- ACTUAL OUTPUT decimal_point: , thousands_sep: ---- FAILED ================================================================================ 002+ thousands_sep: 002- thousands_sep: . ================================================================================ ================================================================================ /usr/local/src/php-5.0.3/Zend/tests/bug22836.phpt ================================================================================ ---- EXPECTED OUTPUT string(3) "foo" 'foo' Notice: Undefined variable: a in %s on line %d Strict Standards: Only variable references should be returned by reference in %s on line %d string(3) "foo" 'foo' Notice: Undefined variable: a in %s on line %d Strict Standards: Only variable references should be returned by reference in %s on line %d string(3) "foo" 'foo' Notice: Undefined variable: a in %s on line %d Strict Standards: Only variable references should be returned by reference in %s on line %d string(3) "foo" 'foo' Notice: Undefined variable: a in %s on line %d Strict Standards: Only variable references should be returned by reference in %s on line %d string(3) "foo" 'foo' Notice: Undefined variable: a in %s on line %d Strict Standards: Only variable references should be returned by reference in %s on line %d string(3) "foo" 'foo' Notice: Undefined variable: a in %s on line %d Strict Standards: Only variable references should be returned by reference in %s on line %d string(3) "foo" 'foo' Notice: Undefined variable: a in %s on line %d Strict Standards: Only variable references should be returned by reference in %s on line %d string(3) "foo" 'foo' Notice: Undefined variable: a in %s on line %d Strict Standards: Only variable references should be returned by reference in %s on line %d string(3) "foo" 'foo' Notice: Undefined variable: a in %s on line %d Strict Standards: Only variable references should be returned by reference in %s on line %d ---- ACTUAL OUTPUT string(3) "foo" 'foo' Notice: Undefined variable: a in /usr/local/src/php-5.0.3/Zend/tests/bug22836.php on line 7 Strict Standards: Only variable references should be returned by reference in /usr/local/src/php-5.0.3/Zend/tests/bug22836.php on line 7 string(3) "foo" 'foo' Notice: Undefined variable: a in /usr/local/src/php-5.0.3/Zend/tests/bug22836.php on line 7 Strict Standards: Only variable references should be returned by reference in /usr/local/src/php-5.0.3/Zend/tests/bug22836.php on line 7 NULL 'foo' Notice: Undefined variable: a in /usr/local/src/php-5.0.3/Zend/tests/bug22836.php on line 7 NULL 'foo' Notice: Undefined variable: a in /usr/local/src/php-5.0.3/Zend/tests/bug22836.php on line 7 NULL 'foo' Notice: Undefined variable: a in /usr/local/src/php-5.0.3/Zend/tests/bug22836.php on line 7 NULL 'foo' Notice: Undefined variable: a in /usr/local/src/php-5.0.3/Zend/tests/bug22836.php on line 7 NULL 'foo' Notice: Undefined variable: a in /usr/local/src/php-5.0.3/Zend/tests/bug22836.php on line 7 NULL 'foo' Notice: Undefined variable: a in /usr/local/src/php-5.0.3/Zend/tests/bug22836.php on line 7 ---- FAILED ================================================================================ 013+ NULL 013- string(3) "foo" 017+ NULL 018+ 'foo' 018- Strict Standards: Only variable references should be returned by reference in %s on line %d 019- string(3) "foo" 020+ Notice: Undefined variable: a in /usr/local/src/php-5.0.3/Zend/tests/bug22836.php on line 7 021+ NULL 022+ 'foo' 023+ 024+ Notice: Undefined variable: a in /usr/local/src/php-5.0.3/Zend/tests/bug22836.php on line 7 025+ NULL 026+ 'foo' 027+ 028+ Notice: Undefined variable: a in /usr/local/src/php-5.0.3/Zend/tests/bug22836.php on line 7 029+ NULL 030+ 'foo' 031+ 032+ Notice: Undefined variable: a in /usr/local/src/php-5.0.3/Zend/tests/bug22836.php on line 7 033+ NULL 023- 024- Strict Standards: Only variable references should be returned by reference in %s on line %d 025- string(3) "foo" 026- 'foo' 027- 028- Notice: Undefined variable: a in %s on line %d 029- 030- Strict Standards: Only variable references should be returned by reference in %s on line %d 031- string(3) "foo" 032- 'foo' 033- 034- Notice: Undefined variable: a in %s on line %d 035- 036- Strict Standards: Only variable references should be returned by reference in %s on line %d 037- string(3) "foo" 038- 'foo' 039- 040- Notice: Undefined variable: a in %s on line %d 041- 042- Strict Standards: Only variable references should be returned by reference in %s on line %d 043- string(3) "foo" 044- 'foo' 045- 046- Notice: Undefined variable: a in %s on line %d 047- 048- Strict Standards: Only variable references should be returned by reference in %s on line %d 049- string(3) "foo" 050- 'foo' 051- 052- Notice: Undefined variable: a in %s on line %d 053- 054- Strict Standards: Only variable references should be returned by reference in %s on line %d ================================================================================ ================================================================================ /usr/local/src/php-5.0.3/Zend/tests/bug28444.phpt ================================================================================ ---- EXPECTED OUTPUT object(Object)#%d (1) { ["x"]=> int(2) } int(2) int(3) Overloaded::__set(y,3) int(3) Overloaded::__get(y) int(3) Overloaded::__set(z,Object id #3) object(Object)#%d (1) { ["x"]=> int(4) } Overloaded::__get(z) int(4) Overloaded::__get(z) int(5) Overloaded::__get(z) int(6) ===DONE=== ---- ACTUAL OUTPUT object(Object)#2 (1) { ["x"]=> int(2) } int(2) int(3) Overloaded::__set(y,3) int(3) Overloaded::__get(y) int(3) Overloaded::__set(z,Object id #3) object(Object)#3 (1) { ["x"]=> int(4) } Overloaded::__get(z) int(4) Overloaded::__get(z) int(5) Fatal error: Cannot access undefined property for object with overloaded property access in /usr/local/src/php-5.0.3/Zend/tests/bug28444.php on line 45 ---- FAILED ================================================================================ 020+ 021+ Fatal error: Cannot access undefined property for object with overloaded property access in /usr/local/src/php-5.0.3/Zend/tests/bug28444.php on line 45 020- Overloaded::__get(z) 021- int(6) 022- ===DONE=== ================================================================================ ================================================================================ /usr/local/src/php-5.0.3/ext/dom/tests/dom003.phpt ================================================================================ ---- EXPECTED OUTPUT --- Catch exception with try/catch object(DOMException)#%d (6) { ["message:protected"]=> string(23) "Hierarchy Request Error" ["string:private"]=> string(0) "" ["file:protected"]=> string(%d) "%s/ext/dom/tests/dom003.php" ["line:protected"]=> int(8) ["trace:private"]=> array(0) { } ["code"]=> int(3) } --- Don't catch exception with try/catch Fatal error: Uncaught exception 'DOMException' with message 'Hierarchy Request Error' in %sdom003.php:%d Stack trace: #0 {main} thrown in %sdom003.php on line %d ---- ACTUAL OUTPUT --- Catch exception with try/catch object(DOMException)#3 (6) { ["message:protected"]=> string(23) "Hierarchy Request Error" ["string:private"]=> string(0) "" ["file:protected"]=> string(49) "/usr/local/src/php-5.0.3/ext/dom/tests/dom003.php" ["line:protected"]=> int(8) ["trace:private"]=> array(1) { [0]=> array(6) { ["file"]=> string(49) "/usr/local/src/php-5.0.3/ext/dom/tests/dom003.php" ["line"]=> int(8) ["function"]=> string(11) "appendChild" ["class"]=> string(10) "DOMElement" ["type"]=> string(2) "->" ["args"]=> array(1) { [0]=> object(DOMElement)#2 (0) { } } } } ["code"]=> int(3) } --- Don't catch exception with try/catch Fatal error: Uncaught exception 'DOMException' with message 'Hierarchy Request Error' in /usr/local/src/php-5.0.3/ext/dom/tests/dom003.php:13 Stack trace: #0 /usr/local/src/php-5.0.3/ext/dom/tests/dom003.php(13): DOMElement->appendChild(Object(DOMElement)) #1 {main} thrown in /usr/local/src/php-5.0.3/ext/dom/tests/dom003.php on line 13 ---- FAILED ================================================================================ 012+ array(1) { 013+ [0]=> 014+ array(6) { 015+ ["file"]=> 016+ string(49) "/usr/local/src/php-5.0.3/ext/dom/tests/dom003.php" 017+ ["line"]=> 018+ int(8) 019+ ["function"]=> 020+ string(11) "appendChild" 021+ ["class"]=> 022+ string(10) "DOMElement" 012- array(0) { 013- } 014- ["code"]=> 015- int(3) 016- } 017- --- Don't catch exception with try/catch 018- 019- Fatal error: Uncaught exception 'DOMException' with message 'Hierarchy Request Error' in %sdom003.php:%d 020- Stack trace: 021- #0 {main} 022- thrown in %sdom003.php on line %d 023+ ["type"]=> 024+ string(2) "->" 025+ ["args"]=> 026+ array(1) { 027+ [0]=> 028+ object(DOMElement)#2 (0) { 029+ } 030+ } 031+ } 032+ } 033+ ["code"]=> 034+ int(3) 035+ } 036+ --- Don't catch exception with try/catch 037+ 038+ Fatal error: Uncaught exception 'DOMException' with message 'Hierarchy Request Error' in /usr/local/src/php-5.0.3/ext/dom/tests/dom003.php:13 039+ Stack trace: 040+ #0 /usr/local/src/php-5.0.3/ext/dom/tests/dom003.php(13): DOMElement->appendChild(Object(DOMElement)) 041+ #1 {main} 042+ thrown in /usr/local/src/php-5.0.3/ext/dom/tests/dom003.php on line 13 ================================================================================ ================================================================================ /usr/local/src/php-5.0.3/ext/dom/tests/dom005.phpt ================================================================================ ---- EXPECTED OUTPUT --- save as XML <?xml version="1.0" standalone="yes"?> <!DOCTYPE html PUBLIC "-//W3C//DTD HTML 4.0 Transitional//EN" "http://www.w3.org/TR/REC-html40/loose.dtd"> <html><head><title>Hello world</title></head><body><p> This is a not well-formed<br/> html files with undeclared entities&#xA0; </p></body></html> --- save as HTML <!DOCTYPE html PUBLIC "-//W3C//DTD HTML 4.0 Transitional//EN" "http://www.w3.org/TR/REC-html40/loose.dtd"> <html> <head><title>Hello world</title></head> <body><p> This is a not well-formed<br> html files with undeclared entities&nbsp; </p></body> </html> ---- ACTUAL OUTPUT --- save as XML <?xml version="1.0" standalone="yes"?> <!DOCTYPE html PUBLIC "-//W3C//DTD HTML 4.0 Transitional//EN" "http://www.w3.org/TR/REC-html40/loose.dtd"> <html><head><title>Hello world</title></head><body><p> This is a not well-formed<br/> html files with undeclared entities  </p></body></html> --- save as HTML <!DOCTYPE html PUBLIC "-//W3C//DTD HTML 4.0 Transitional//EN" "http://www.w3.org/TR/REC-html40/loose.dtd"> <html> <head><title>Hello world</title></head> <body><p> This is a not well-formed<br> html files with undeclared entities&nbsp; </p></body> </html> ---- FAILED ================================================================================ 006+ html files with undeclared entities  006- html files with undeclared entities&#xA0; ================================================================================ ================================================================================ /usr/local/src/php-5.0.3/ext/mbstring/tests/htmlent.phpt ================================================================================ ---- EXPECTED OUTPUT HTML-ENTITIES>UTF-8>HTML-ENTITIES test='&&;&@AB&#128;&#129;&#130;&auml;&ouml;&uuml;&euro;&lang;&rang;' ---- ACTUAL OUTPUT ---- FAILED ================================================================================ 001+ 001- HTML-ENTITIES>UTF-8>HTML-ENTITIES 002- test='&&;&@AB&#128;&#129;&#130;&auml;&ouml;&uuml;&euro;&lang;&rang;' ================================================================================ ================================================================================ /usr/local/src/php-5.0.3/ext/mbstring/tests/mb_output_handler_shift_jis.phpt ================================================================================ ---- EXPECTED OUTPUT string(73) "¥Æ¥¹¥ÈÍÑÆüËܸìʸ»úÎ󡣤³¤Î¥â¥¸¥å¡¼¥ë¤ÏPHP¤Ë¥Þ¥ë¥Á¥Ð¥¤¥È´Ø¿ô¤òÄ󶡤·¤Þ¤¹¡£" ---- ACTUAL OUTPUT ---- FAILED ================================================================================ 001+ 001- string(73) "¥Æ¥¹¥ÈÍÑÆüËܸìʸ»úÎ󡣤³¤Î¥â¥¸¥å¡¼¥ë¤ÏPHP¤Ë¥Þ¥ë¥Á¥Ð¥¤¥È´Ø¿ô¤òÄ󶡤·¤Þ¤¹¡£" ================================================================================ ================================================================================ /usr/local/src/php-5.0.3/ext/mysqli/tests/014.phpt ================================================================================ ---- EXPECTED OUTPUT array(2) { [0]=> string(1) "1" [1]=> string(6) "foobar" } array(2) { [0]=> string(1) "2" [1]=> string(4) "egon" } ---- ACTUAL OUTPUT array(2) { [0]=> string(1) "2" [1]=> string(4) "egon" } array(2) { [0]=> string(1) "2" [1]=> string(4) "egon" } ---- FAILED ================================================================================ 003+ string(1) "2" 003- string(1) "1" 005+ string(4) "egon" 005- string(6) "foobar" ================================================================================ ================================================================================ /usr/local/src/php-5.0.3/ext/standard/tests/array/bug29992.phpt ================================================================================ ---- EXPECTED OUTPUT Array ( [0] => 1 [1] => 2 [2] => 3 ) int(1) int(2) int(3) int(1) int(2) int(3) int(1) int(2) int(3) int(1) int(2) int(3) Array ( [0] => 1 [1] => 2 [2] => 3 ) ===DONE=== ---- ACTUAL OUTPUT Array ( [0] => 1 [1] => 2 [2] => 3 ) int(1) int(2) int(3) int(1) int(2) int(3) int(1) int(2) int(3) int(1) int(2) int(2) Array ( [0] => 1 [1] => 2 [2] => 2 ) ===DONE=== ---- FAILED ================================================================================ 018+ int(2) 018- int(3) 023+ [2] => 2 023- [2] => 3 ================================================================================ ================================================================================ /usr/local/src/php-5.0.3/ext/standard/tests/file/001.phpt ================================================================================ ---- EXPECTED OUTPUT test.file does not exist test.file exists test.link exists test.file is not a symlink test.link is a symlink test.file exists test.link lstat and stat differ at element 1 test.link lstat and stat differ at element 2 test.link lstat and stat differ at element 7 test.link lstat and stat differ at element 8 test.link lstat and stat differ at element 9 test.file is file test.link is link test.file permissions are 0744 test.file size is 0 test.file is writeable test.file is readable test.file is executable test.file is a regular file test.link is a regular file test.link is not a directory ../file is a directory test.file is not a directory test.file does not exist test.file does not exist ---- ACTUAL OUTPUT test.file does not exist test.file exists test.link exists test.file is not a symlink test.link is a symlink test.file exists test.link lstat and stat differ at element 1 test.link lstat and stat differ at element 2 test.link lstat and stat differ at element 4 test.link lstat and stat differ at element 7 test.link lstat and stat differ at element 8 test.link lstat and stat differ at element 9 test.file is file test.link is link test.file permissions are 0744 test.file size is 0 test.file is writeable test.file is readable test.file is executable test.file is a regular file test.link is a regular file test.link is not a directory ../file is a directory test.file is not a directory test.file does not exist test.file does not exist ---- FAILED ================================================================================ 009+ test.link lstat and stat differ at element 4 ================================================================================ ================================================================================ /usr/local/src/php-5.0.3/ext/standard/tests/file/bug22414.phpt ================================================================================ ---- EXPECTED OUTPUT HELLO Works ---- ACTUAL OUTPUT HELLO sh: line 1: /usr/local/php/bin/php: No such file or directory Does not work ---- FAILED ================================================================================ 002+ sh: line 1: /usr/local/php/bin/php: No such file or directory 002- Works 003+ Does not work ================================================================================ ================================================================================ /usr/local/src/php-5.0.3/ext/standard/tests/time/bug20382.phpt ================================================================================ ---- EXPECTED OUTPUT tStamp=Wednesday 2004-10-27 17:17:17 CEST result=Monday 2004-11-01 00:00:00 CET wanted=Monday 2004-11-01 00:00:00 CET ---- ACTUAL OUTPUT tStamp=Wednesday 2004-10-27 17:17:17 CEST result=Sunday 2004-10-31 23:00:00 CET wanted=Monday 2004-11-01 00:00:00 CET ---- FAILED ================================================================================ 002+ result=Sunday 2004-10-31 23:00:00 CET 002- result=Monday 2004-11-01 00:00:00 CET ================================================================================ ================================================================================ /usr/local/src/php-5.0.3/ext/standard/tests/time/bug27719.phpt ================================================================================ ---- EXPECTED OUTPUT 1081054800 04/04/04 12:00:00 %s 1081054800 04/04/04 12:00:00 1075870800 02/04/04 12:00:00 1075867200 02/03/04 11:00:00 1075870800 02/04/04 12:00:00 1081054800 04/04/04 12:00:00 1081051200 04/03/04 11:00:00 1081054800 04/04/04 12:00:00 1081065600 04/04/04 04:00:00 1081062000 04/04/04 03:00:00 1081062000 04/04/04 03:00:00 1086325200 06/04/04 01:00:00 1086321600 06/04/04 12:00:00 1086321600 06/04/04 12:00:00 ---- ACTUAL OUTPUT 1081054800 04/04/04 12:00:00 1081051200 04/03/04 11:00:00 1081054800 04/04/04 12:00:00 1075852800 02/04/04 12:00:00 -14462 12/31/69 07:58:58 1075852800 02/04/04 12:00:00 1081036800 04/04/04 12:00:00 -14462 12/31/69 07:58:58 1081036800 04/04/04 12:00:00 1081047600 04/04/04 03:00:00 -3662 12/31/69 10:58:58 1081047600 04/04/04 03:00:00 1086307200 06/04/04 12:00:00 -14462 12/31/69 07:58:58 1086307200 06/04/04 12:00:00 ---- FAILED ================================================================================ 005+ 1075852800 02/04/04 12:00:00 006+ -14462 12/31/69 07:58:58 007+ 1075852800 02/04/04 12:00:00 008+ 009+ 1081036800 04/04/04 12:00:00 010+ -14462 12/31/69 07:58:58 011+ 1081036800 04/04/04 12:00:00 012+ 013+ 1081047600 04/04/04 03:00:00 014+ -3662 12/31/69 10:58:58 015+ 1081047600 04/04/04 03:00:00 005- 1075870800 02/04/04 12:00:00 006- 1075867200 02/03/04 11:00:00 007- 1075870800 02/04/04 12:00:00 009- 1081054800 04/04/04 12:00:00 010- 1081051200 04/03/04 11:00:00 011- 1081054800 04/04/04 12:00:00 017+ 1086307200 06/04/04 12:00:00 018+ -14462 12/31/69 07:58:58 019+ 1086307200 06/04/04 12:00:00 012- 013- 1081065600 04/04/04 04:00:00 014- 1081062000 04/04/04 03:00:00 015- 1081062000 04/04/04 03:00:00 016- 017- 1086325200 06/04/04 01:00:00 018- 1086321600 06/04/04 12:00:00 019- 1086321600 06/04/04 12:00:00 ================================================================================ ================================================================================ /usr/local/src/php-5.0.3/ext/standard/tests/time/bug27780.phpt ================================================================================ ---- EXPECTED OUTPUT America/Chicago 1076824799 [2004-02-14 23:59:59 CST] [2004-04-07 00:00:00 -2 months +7 days +23 hours +59 minutes +59 seconds] 1076824800 [2004-02-15 00:00:00 CST] [2004-04-07 00:00:00 -2 months +7 days +23 hours +59 minutes +60 seconds] 1076824801 [2004-02-15 00:00:01 CST] [2004-04-07 00:00:00 -2 months +7 days +23 hours +59 minutes +61 seconds] 1079503200 [2004-03-17 00:00:00 CST] [2004-04-07 00:00:00 -21 days] 1080367200 [2004-03-27 00:00:00 CST] [2004-04-07 00:00:00 11 days ago] 1080460800 [2004-03-28 02:00:00 CST] [2004-04-07 00:00:00 -10 day +2 hours] 1081227600 [2004-04-06 00:00:00 CDT] [2004-04-07 00:00:00 -1 day] 1081314000 [2004-04-07 00:00:00 CDT] [2004-04-07 00:00:00] 1081317600 [2004-04-07 01:00:00 CDT] [2004-04-07 00:00:00 +1 hour] 1081321200 [2004-04-07 02:00:00 CDT] [2004-04-07 00:00:00 +2 hour] 1081400400 [2004-04-08 00:00:00 CDT] [2004-04-07 00:00:00 +1 day] 1081400400 [2004-04-08 00:00:00 CDT] [2004-04-07 00:00:00 1 day] 1083128400 [2004-04-28 00:00:00 CDT] [2004-04-07 00:00:00 +21 days] Europe/Amsterdam 1076799599 [2004-02-14 23:59:59 CET] [2004-04-07 00:00:00 -2 months +7 days +23 hours +59 minutes +59 seconds] 1076799600 [2004-02-15 00:00:00 CET] [2004-04-07 00:00:00 -2 months +7 days +23 hours +59 minutes +60 seconds] 1076799601 [2004-02-15 00:00:01 CET] [2004-04-07 00:00:00 -2 months +7 days +23 hours +59 minutes +61 seconds] 1079478000 [2004-03-17 00:00:00 CET] [2004-04-07 00:00:00 -21 days] 1080342000 [2004-03-27 00:00:00 CET] [2004-04-07 00:00:00 11 days ago] 1080435600 [2004-03-28 03:00:00 CEST] [2004-04-07 00:00:00 -10 day +2 hours] 1081202400 [2004-04-06 00:00:00 CEST] [2004-04-07 00:00:00 -1 day] 1081288800 [2004-04-07 00:00:00 CEST] [2004-04-07 00:00:00] 1081292400 [2004-04-07 01:00:00 CEST] [2004-04-07 00:00:00 +1 hour] 1081296000 [2004-04-07 02:00:00 CEST] [2004-04-07 00:00:00 +2 hour] 1081375200 [2004-04-08 00:00:00 CEST] [2004-04-07 00:00:00 +1 day] 1081375200 [2004-04-08 00:00:00 CEST] [2004-04-07 00:00:00 1 day] 1083103200 [2004-04-28 00:00:00 CEST] [2004-04-07 00:00:00 +21 days] Asia/Jerusalem 1076795999 [2004-02-14 23:59:59 IST] [2004-04-07 00:00:00 -2 months +7 days +23 hours +59 minutes +59 seconds] 1076796000 [2004-02-15 00:00:00 IST] [2004-04-07 00:00:00 -2 months +7 days +23 hours +59 minutes +60 seconds] 1076796001 [2004-02-15 00:00:01 IST] [2004-04-07 00:00:00 -2 months +7 days +23 hours +59 minutes +61 seconds] 1079474400 [2004-03-17 00:00:00 IST] [2004-04-07 00:00:00 -21 days] 1080338400 [2004-03-27 00:00:00 IST] [2004-04-07 00:00:00 11 days ago] 1080432000 [2004-03-28 02:00:00 IST] [2004-04-07 00:00:00 -10 day +2 hours] 1081202400 [2004-04-06 00:00:00 IST] [2004-04-07 00:00:00 -1 day] 1081288800 [2004-04-07 00:00:00 IST] [2004-04-07 00:00:00] 1081292400 [2004-04-07 02:00:00 IDT] [2004-04-07 00:00:00 +1 hour] 1081292400 [2004-04-07 02:00:00 IDT] [2004-04-07 00:00:00 +2 hour] 1081371600 [2004-04-08 00:00:00 IDT] [2004-04-07 00:00:00 +1 day] 1081371600 [2004-04-08 00:00:00 IDT] [2004-04-07 00:00:00 1 day] 1083099600 [2004-04-28 00:00:00 IDT] [2004-04-07 00:00:00 +21 days] Asia/Singapore 1076774399 [2004-02-14 23:59:59 SGT] [2004-04-07 00:00:00 -2 months +7 days +23 hours +59 minutes +59 seconds] 1076774400 [2004-02-15 00:00:00 SGT] [2004-04-07 00:00:00 -2 months +7 days +23 hours +59 minutes +60 seconds] 1076774401 [2004-02-15 00:00:01 SGT] [2004-04-07 00:00:00 -2 months +7 days +23 hours +59 minutes +61 seconds] 1079452800 [2004-03-17 00:00:00 SGT] [2004-04-07 00:00:00 -21 days] 1080316800 [2004-03-27 00:00:00 SGT] [2004-04-07 00:00:00 11 days ago] 1080410400 [2004-03-28 02:00:00 SGT] [2004-04-07 00:00:00 -10 day +2 hours] 1081180800 [2004-04-06 00:00:00 SGT] [2004-04-07 00:00:00 -1 day] 1081267200 [2004-04-07 00:00:00 SGT] [2004-04-07 00:00:00] 1081270800 [2004-04-07 01:00:00 SGT] [2004-04-07 00:00:00 +1 hour] 1081274400 [2004-04-07 02:00:00 SGT] [2004-04-07 00:00:00 +2 hour] 1081353600 [2004-04-08 00:00:00 SGT] [2004-04-07 00:00:00 +1 day] 1081353600 [2004-04-08 00:00:00 SGT] [2004-04-07 00:00:00 1 day] 1083081600 [2004-04-28 00:00:00 SGT] [2004-04-07 00:00:00 +21 days] America/Sao_Paulo 1076810399 [2004-02-14 23:59:59 BRST] [2004-04-07 00:00:00 -2 months +7 days +23 hours +59 minutes +59 seconds] 1076810400 [2004-02-14 23:00:00 BRT] [2004-04-07 00:00:00 -2 months +7 days +23 hours +59 minutes +60 seconds] 1076810401 [2004-02-14 23:00:01 BRT] [2004-04-07 00:00:00 -2 months +7 days +23 hours +59 minutes +61 seconds] 1079492400 [2004-03-17 00:00:00 BRT] [2004-04-07 00:00:00 -21 days] 1080356400 [2004-03-27 00:00:00 BRT] [2004-04-07 00:00:00 11 days ago] 1080450000 [2004-03-28 02:00:00 BRT] [2004-04-07 00:00:00 -10 day +2 hours] 1081220400 [2004-04-06 00:00:00 BRT] [2004-04-07 00:00:00 -1 day] 1081306800 [2004-04-07 00:00:00 BRT] [2004-04-07 00:00:00] 1081310400 [2004-04-07 01:00:00 BRT] [2004-04-07 00:00:00 +1 hour] 1081314000 [2004-04-07 02:00:00 BRT] [2004-04-07 00:00:00 +2 hour] 1081393200 [2004-04-08 00:00:00 BRT] [2004-04-07 00:00:00 +1 day] 1081393200 [2004-04-08 00:00:00 BRT] [2004-04-07 00:00:00 1 day] 1083121200 [2004-04-28 00:00:00 BRT] [2004-04-07 00:00:00 +21 days] ---- ACTUAL OUTPUT America/Chicago 1076824799 [2004-02-14 23:59:59 CST] [2004-04-07 00:00:00 -2 months +7 days +23 hours +59 minutes +59 seconds] 1076824800 [2004-02-15 00:00:00 CST] [2004-04-07 00:00:00 -2 months +7 days +23 hours +59 minutes +60 seconds] 1076824801 [2004-02-15 00:00:01 CST] [2004-04-07 00:00:00 -2 months +7 days +23 hours +59 minutes +61 seconds] 1079503200 [2004-03-17 00:00:00 CST] [2004-04-07 00:00:00 -21 days] 1080367200 [2004-03-27 00:00:00 CST] [2004-04-07 00:00:00 11 days ago] 1080460800 [2004-03-28 02:00:00 CST] [2004-04-07 00:00:00 -10 day +2 hours] 1081227600 [2004-04-06 00:00:00 CDT] [2004-04-07 00:00:00 -1 day] 1081314000 [2004-04-07 00:00:00 CDT] [2004-04-07 00:00:00] 1081317600 [2004-04-07 01:00:00 CDT] [2004-04-07 00:00:00 +1 hour] 1081321200 [2004-04-07 02:00:00 CDT] [2004-04-07 00:00:00 +2 hour] 1081400400 [2004-04-08 00:00:00 CDT] [2004-04-07 00:00:00 +1 day] 1081400400 [2004-04-08 00:00:00 CDT] [2004-04-07 00:00:00 1 day] 1083128400 [2004-04-28 00:00:00 CDT] [2004-04-07 00:00:00 +21 days] Europe/Amsterdam 1076799599 [2004-02-14 23:59:59 CET] [2004-04-07 00:00:00 -2 months +7 days +23 hours +59 minutes +59 seconds] 1076799600 [2004-02-15 00:00:00 CET] [2004-04-07 00:00:00 -2 months +7 days +23 hours +59 minutes +60 seconds] 1076799601 [2004-02-15 00:00:01 CET] [2004-04-07 00:00:00 -2 months +7 days +23 hours +59 minutes +61 seconds] 1079478000 [2004-03-17 00:00:00 CET] [2004-04-07 00:00:00 -21 days] 1080342000 [2004-03-27 00:00:00 CET] [2004-04-07 00:00:00 11 days ago] -1 [1970-01-01 00:59:59 CET] [2004-04-07 00:00:00 -10 day +2 hours] 1081202400 [2004-04-06 00:00:00 CEST] [2004-04-07 00:00:00 -1 day] 1081288800 [2004-04-07 00:00:00 CEST] [2004-04-07 00:00:00] 1081292400 [2004-04-07 01:00:00 CEST] [2004-04-07 00:00:00 +1 hour] 1081296000 [2004-04-07 02:00:00 CEST] [2004-04-07 00:00:00 +2 hour] 1081375200 [2004-04-08 00:00:00 CEST] [2004-04-07 00:00:00 +1 day] 1081375200 [2004-04-08 00:00:00 CEST] [2004-04-07 00:00:00 1 day] 1083103200 [2004-04-28 00:00:00 CEST] [2004-04-07 00:00:00 +21 days] Asia/Jerusalem 1076795999 [2004-02-14 23:59:59 IST] [2004-04-07 00:00:00 -2 months +7 days +23 hours +59 minutes +59 seconds] 1076796000 [2004-02-15 00:00:00 IST] [2004-04-07 00:00:00 -2 months +7 days +23 hours +59 minutes +60 seconds] 1076796001 [2004-02-15 00:00:01 IST] [2004-04-07 00:00:00 -2 months +7 days +23 hours +59 minutes +61 seconds] 1079474400 [2004-03-17 00:00:00 IST] [2004-04-07 00:00:00 -21 days] 1080338400 [2004-03-27 00:00:00 IST] [2004-04-07 00:00:00 11 days ago] 1080432000 [2004-03-28 02:00:00 IST] [2004-04-07 00:00:00 -10 day +2 hours] 1081202400 [2004-04-06 00:00:00 IST] [2004-04-07 00:00:00 -1 day] 1081288800 [2004-04-07 00:00:00 IST] [2004-04-07 00:00:00] -1 [1970-01-01 01:59:59 IST] [2004-04-07 00:00:00 +1 hour] 1081292400 [2004-04-07 02:00:00 IDT] [2004-04-07 00:00:00 +2 hour] 1081371600 [2004-04-08 00:00:00 IDT] [2004-04-07 00:00:00 +1 day] 1081371600 [2004-04-08 00:00:00 IDT] [2004-04-07 00:00:00 1 day] 1083099600 [2004-04-28 00:00:00 IDT] [2004-04-07 00:00:00 +21 days] Asia/Singapore 1076774399 [2004-02-14 23:59:59 SGT] [2004-04-07 00:00:00 -2 months +7 days +23 hours +59 minutes +59 seconds] 1076774400 [2004-02-15 00:00:00 SGT] [2004-04-07 00:00:00 -2 months +7 days +23 hours +59 minutes +60 seconds] 1076774401 [2004-02-15 00:00:01 SGT] [2004-04-07 00:00:00 -2 months +7 days +23 hours +59 minutes +61 seconds] 1079452800 [2004-03-17 00:00:00 SGT] [2004-04-07 00:00:00 -21 days] 1080316800 [2004-03-27 00:00:00 SGT] [2004-04-07 00:00:00 11 days ago] 1080410400 [2004-03-28 02:00:00 SGT] [2004-04-07 00:00:00 -10 day +2 hours] 1081180800 [2004-04-06 00:00:00 SGT] [2004-04-07 00:00:00 -1 day] 1081267200 [2004-04-07 00:00:00 SGT] [2004-04-07 00:00:00] 1081270800 [2004-04-07 01:00:00 SGT] [2004-04-07 00:00:00 +1 hour] 1081274400 [2004-04-07 02:00:00 SGT] [2004-04-07 00:00:00 +2 hour] 1081353600 [2004-04-08 00:00:00 SGT] [2004-04-07 00:00:00 +1 day] 1081353600 [2004-04-08 00:00:00 SGT] [2004-04-07 00:00:00 1 day] 1083081600 [2004-04-28 00:00:00 SGT] [2004-04-07 00:00:00 +21 days] America/Sao_Paulo 1076813999 [2004-02-14 23:59:59 BRT] [2004-04-07 00:00:00 -2 months +7 days +23 hours +59 minutes +59 seconds] 1076814000 [2004-02-15 00:00:00 BRT] [2004-04-07 00:00:00 -2 months +7 days +23 hours +59 minutes +60 seconds] 1076814001 [2004-02-15 00:00:01 BRT] [2004-04-07 00:00:00 -2 months +7 days +23 hours +59 minutes +61 seconds] 1079492400 [2004-03-17 00:00:00 BRT] [2004-04-07 00:00:00 -21 days] 1080356400 [2004-03-27 00:00:00 BRT] [2004-04-07 00:00:00 11 days ago] 1080450000 [2004-03-28 02:00:00 BRT] [2004-04-07 00:00:00 -10 day +2 hours] 1081220400 [2004-04-06 00:00:00 BRT] [2004-04-07 00:00:00 -1 day] 1081306800 [2004-04-07 00:00:00 BRT] [2004-04-07 00:00:00] 1081310400 [2004-04-07 01:00:00 BRT] [2004-04-07 00:00:00 +1 hour] 1081314000 [2004-04-07 02:00:00 BRT] [2004-04-07 00:00:00 +2 hour] 1081393200 [2004-04-08 00:00:00 BRT] [2004-04-07 00:00:00 +1 day] 1081393200 [2004-04-08 00:00:00 BRT] [2004-04-07 00:00:00 1 day] 1083121200 [2004-04-28 00:00:00 BRT] [2004-04-07 00:00:00 +21 days] ---- FAILED ================================================================================ 022+ -1 [1970-01-01 00:59:59 CET] [2004-04-07 00:00:00 -10 day +2 hours] 022- 1080435600 [2004-03-28 03:00:00 CEST] [2004-04-07 00:00:00 -10 day +2 hours] 040+ -1 [1970-01-01 01:59:59 IST] [2004-04-07 00:00:00 +1 hour] 040- 1081292400 [2004-04-07 02:00:00 IDT] [2004-04-07 00:00:00 +1 hour] 062+ 1076813999 [2004-02-14 23:59:59 BRT] [2004-04-07 00:00:00 -2 months +7 days +23 hours +59 minutes +59 seconds] 063+ 1076814000 [2004-02-15 00:00:00 BRT] [2004-04-07 00:00:00 -2 months +7 days +23 hours +59 minutes +60 seconds] 064+ 1076814001 [2004-02-15 00:00:01 BRT] [2004-04-07 00:00:00 -2 months +7 days +23 hours +59 minutes +61 seconds] 062- 1076810399 [2004-02-14 23:59:59 BRST] [2004-04-07 00:00:00 -2 months +7 days +23 hours +59 minutes +59 seconds] 063- 1076810400 [2004-02-14 23:00:00 BRT] [2004-04-07 00:00:00 -2 months +7 days +23 hours +59 minutes +60 seconds] 064- 1076810401 [2004-02-14 23:00:01 BRT] [2004-04-07 00:00:00 -2 months +7 days +23 hours +59 minutes +61 seconds] ================================================================================ ================================================================================ /usr/local/src/php-5.0.3/ext/xml/tests/bug26614.phpt ================================================================================ ---- EXPECTED OUTPUT CDATA <DATA> at line 2, col 0 (byte 45) </DATA> at line 9, col 0 (byte 90) Comment <DATA> at line 2, col 0 (byte 45) </DATA> at line 9, col 0 (byte 90) Text <DATA> at line 2, col 0 (byte 45) </DATA> at line 9, col 0 (byte 90) ---- ACTUAL OUTPUT CDATA <DATA> at line 2, col 6 (byte 9) </DATA> at line 4, col 47 (byte 56) Comment <DATA> at line 2, col 6 (byte 9) </DATA> at line 9, col 7 (byte 56) Text <DATA> at line 2, col 6 (byte 9) </DATA> at line 9, col 10 (byte 56) ---- FAILED ================================================================================ 002+ <DATA> at line 2, col 6 (byte 9) 003+ </DATA> at line 4, col 47 (byte 56) 002- <DATA> at line 2, col 0 (byte 45) 003- </DATA> at line 9, col 0 (byte 90) 005+ <DATA> at line 2, col 6 (byte 9) 006+ </DATA> at line 9, col 7 (byte 56) 005- <DATA> at line 2, col 0 (byte 45) 006- </DATA> at line 9, col 0 (byte 90) 008+ <DATA> at line 2, col 6 (byte 9) 009+ </DATA> at line 9, col 10 (byte 56) 008- <DATA> at line 2, col 0 (byte 45) 009- </DATA> at line 9, col 0 (byte 90) ================================================================================ ================================================================================ BUILD ENVIRONMENT ================================================================================ OS: Darwin - Darwin pbook-g4.local 7.7.0 Darwin Kernel Version 7.7.0: Sun Nov 7 16:06:51 PST 2004; root:xnu/xnu-517.9.5.obj~1/RELEASE_PPC Power Macintosh Automake: automake (GNU automake) 1.6.3 Written by Tom Tromey <tromey@redhat.com>. Copyright 2002 Free Software Foundation, Inc. This is free software; see the source for copying conditions. There is NO warranty; not even for MERCHANTABILITY or FITNESS FOR A PARTICULAR PURPOSE. Autoconf: autoconf (GNU Autoconf) 2.57 Written by David J. MacKenzie and Akim Demaille. Copyright 2002 Free Software Foundation, Inc. This is free software; see the source for copying conditions. There is NO warranty; not even for MERCHANTABILITY or FITNESS FOR A PARTICULAR PURPOSE. Bundled Libtool: ltmain.sh (GNU libtool) 1.4.3 (1.922.2.110 2002/10/23 01:39:54) System Libtool: Compiler: Reading specs from /usr/libexec/gcc/darwin/ppc/3.3/specs Thread model: posix gcc version 3.3 20030304 (Apple Computer, Inc. build 1495) Bison: GNU Bison version 1.28 Libraries: User's E-mail: ikar at useragent dot net ================================================================================ PHPINFO ================================================================================ phpinfo() PHP Version => 5.0.3 System => Darwin pbook-g4.local 7.7.0 Darwin Kernel Version 7.7.0: Sun Nov 7 16:06:51 PST 2004; root:xnu/xnu-517.9.5.obj~1/RELEASE_PPC Power Macintosh Build Date => Jan 18 2005 21:10:44 Configure Command => './configure' '--with-apxs=/usr/sbin/apxs' '--enable-safe-mode' '--with-mysqli=/usr/local/mysql/bin/mysql_config' '--enable-mbstring' Server API => Command Line Interface Virtual Directory Support => disabled Configuration File (php.ini) Path => /usr/local/lib PHP API => 20031224 PHP Extension => 20041030 Zend Extension => 220040412 Debug Build => no Thread Safety => disabled IPv6 Support => enabled Registered PHP Streams => php, file, http, ftp Registered Stream Socket Transports => tcp, udp, unix, udg This program makes use of the Zend Scripting Language Engine: Zend Engine v2.0.3, Copyright (c) 1998-2004 Zend Technologies _______________________________________________________________________ Configuration PHP Core Directive => Local Value => Master Value allow_call_time_pass_reference => On => On allow_url_fopen => On => On always_populate_raw_post_data => Off => Off arg_separator.input => & => & arg_separator.output => & => & asp_tags => Off => Off auto_append_file => no value => no value auto_globals_jit => On => On auto_prepend_file => no value => no value browscap => no value => no value default_charset => no value => no value default_mimetype => text/html => text/html define_syslog_variables => Off => Off disable_classes => no value => no value disable_functions => no value => no value display_errors => On => On display_startup_errors => Off => Off doc_root => no value => no value docref_ext => no value => no value docref_root => no value => no value enable_dl => On => On error_append_string => no value => no value error_log => no value => no value error_prepend_string => no value => no value error_reporting => no value => no value expose_php => On => On extension_dir => /usr/local/lib/php/extensions/no-debug-non-zts-20041030 => /usr/local/lib/php/extensions/no-debug-non-zts-20041030 file_uploads => On => On highlight.bg => #FFFFFF => #FFFFFF highlight.comment => #FF8000 => #FF8000 highlight.default => #0000BB => #0000BB highlight.html => #000000 => #000000 highlight.keyword => #007700 => #007700 highlight.string => #DD0000 => #DD0000 html_errors => Off => On ignore_repeated_errors => Off => Off ignore_repeated_source => Off => Off ignore_user_abort => Off => Off implicit_flush => On => Off include_path => .:/usr/local/lib/php => .:/usr/local/lib/php log_errors => Off => Off log_errors_max_len => 1024 => 1024 magic_quotes_gpc => On => On magic_quotes_runtime => Off => Off magic_quotes_sybase => Off => Off mail.force_extra_parameters => no value => no value max_execution_time => 0 => 30 max_input_time => -1 => -1 open_basedir => no value => no value output_buffering => 0 => 0 output_handler => no value => no value post_max_size => 8M => 8M precision => 14 => 14 register_argc_argv => On => On register_globals => Off => Off register_long_arrays => On => On report_memleaks => On => On report_zend_debug => Off => Off safe_mode => On => On safe_mode_exec_dir => /usr/local/php/bin => /usr/local/php/bin safe_mode_gid => Off => Off safe_mode_include_dir => no value => no value sendmail_from => no value => no value sendmail_path => /usr/sbin/sendmail -t -i => /usr/sbin/sendmail -t -i serialize_precision => 100 => 100 short_open_tag => On => On SMTP => localhost => localhost smtp_port => 25 => 25 sql.safe_mode => Off => Off track_errors => Off => Off unserialize_callback_func => no value => no value upload_max_filesize => 2M => 2M upload_tmp_dir => no value => no value user_dir => no value => no value variables_order => EGPCS => EGPCS xmlrpc_error_number => 0 => 0 xmlrpc_errors => Off => Off y2k_compliance => On => On zend.ze1_compatibility_mode => Off => Off ctype ctype functions => enabled dom DOM/XML => enabled DOM/XML API Version => 20031129 libxml Version => 2.5.4 HTML Support => enabled XPath Support => enabled XPointer Support => enabled Schema Support => enabled RelaxNG Support => enabled libxml libXML support => active libXML Version => 2.5.4 libXML streams => enabled mbstring Multibyte Support => enabled Multibyte string engine => libmbfl Multibyte (japanese) regex support => enabled Multibyte regex (oniguruma) version => 2.2.4 mbstring extension makes use of "streamable kanji code filter and converter", which is distributed under the GNU Lesser General Public License version 2.1. Directive => Local Value => Master Value mbstring.detect_order => no value => no value mbstring.encoding_translation => Off => Off mbstring.func_overload => 0 => 0 mbstring.http_input => pass => pass mbstring.http_output => pass => pass mbstring.internal_encoding => ISO-8859-1 => no value mbstring.language => neutral => neutral mbstring.substitute_character => no value => no value mysqli MysqlI Support => enabled Client API version => 4.1.9 MYSQLI_SOCKET => /tmp/mysql.sock Directive => Local Value => Master Value mysqli.default_host => no value => no value mysqli.default_port => 3306 => 3306 mysqli.default_pw => no value => no value mysqli.default_socket => no value => no value mysqli.default_user => no value => no value mysqli.max_links => Unlimited => Unlimited mysqli.reconnect => Off => Off pcre PCRE (Perl Compatible Regular Expressions) Support => enabled PCRE Library Version => 4.5 01-December-2003 posix Revision => $Revision: 1.60 $ session Session Support => enabled Registered save handlers => files user sqlite Registered serializer handlers => php php_binary Directive => Local Value => Master Value session.auto_start => Off => Off session.bug_compat_42 => On => On session.bug_compat_warn => On => On session.cache_expire => 180 => 180 session.cache_limiter => nocache => nocache session.cookie_domain => no value => no value session.cookie_lifetime => 0 => 0 session.cookie_path => / => / session.cookie_secure => Off => Off session.entropy_file => no value => no value session.entropy_length => 0 => 0 session.gc_divisor => 100 => 100 session.gc_maxlifetime => 1440 => 1440 session.gc_probability => 1 => 1 session.hash_bits_per_character => 4 => 4 session.hash_function => 0 => 0 session.name => PHPSESSID => PHPSESSID session.referer_check => no value => no value session.save_handler => files => files session.save_path => no value => no value session.serialize_handler => php => php session.use_cookies => On => On session.use_only_cookies => Off => Off session.use_trans_sid => 0 => 0 SimpleXML Simplexml support => enabled Revision => $Revision: 1.139.2.4 $ Schema support => enabled SPL SPL support => enabled Interfaces => RecursiveIterator, SeekableIterator Classes => ArrayObject, ArrayIterator, CachingIterator, CachingRecursiveIterator, DirectoryIterator, FilterIterator, LimitIterator, ParentIterator, RecursiveDirectoryIterator, RecursiveIteratorIterator, SimpleXMLIterator SQLite SQLite support => enabled PECL Module version => 2.0-dev $Id: sqlite.c,v 1.146.2.3 2004/09/26 01:41:40 wez Exp $ SQLite Library => 2.8.14 SQLite Encoding => iso8859 Directive => Local Value => Master Value sqlite.assoc_case => 0 => 0 standard Regex Library => Bundled library enabled Dynamic Library Support => enabled Path to sendmail => /usr/sbin/sendmail -t -i Directive => Local Value => Master Value assert.active => 1 => 1 assert.bail => 0 => 0 assert.callback => no value => no value assert.quiet_eval => 0 => 0 assert.warning => 1 => 1 auto_detect_line_endings => 0 => 0 date.default_latitude => 31.7667 => 31.7667 date.default_longitude => 35.2333 => 35.2333 date.sunrise_zenith => 90.83 => 90.83 date.sunset_zenith => 90.83 => 90.83 default_socket_timeout => 60 => 60 safe_mode_allowed_env_vars => PHP_ => PHP_ safe_mode_protected_env_vars => LD_LIBRARY_PATH => LD_LIBRARY_PATH url_rewriter.tags => a=href,area=href,frame=src,form=,fieldset= => a=href,area=href,frame=src,form=,fieldset= user_agent => no value => no value tokenizer Tokenizer Support => enabled xml XML Support => active XML Namespace Support => active libxml2 Version => 2.5.4 Additional Modules Module Name Environment Variable => Value TERM_PROGRAM => Apple_Terminal TEST_PHP_SRCDIR => /usr/local/src/php-5.0.3 TERM => xterm-color SHELL => /bin/sh MAKEFLAGS => SSH_CLIENT => deleted TERM_PROGRAM_VERSION => 100.1.4 SSH_TTY => deleted USER => root SCRIPT_FILENAME => SUDO_USER => ikar SUDO_UID => 501 SSH_AUTH_SOCK => deleted __CF_USER_TEXT_ENCODING => 0x1F5:0:0 MAKELEVEL => 1 MFLAGS => PATH => /bin:/sbin:/usr/bin:/usr/sbin _ => /usr/local/src/php-5.0.3/sapi/cli/php PWD => /usr/local/src/php-5.0.3 TEST_PHP_EXECUTABLE => /usr/local/src/php-5.0.3/sapi/cli/php REDIRECT_STATUS => PATH_TRANSLATED => HOME => /Users/ikar SHLVL => 3 SUDO_COMMAND => /usr/bin/make test CONTENT_LENGTH => LOGNAME => root QUERY_STRING => CONTENT_TYPE => SUDO_GID => 501 CC => gcc REQUEST_METHOD => SECURITYSESSIONID => 20f300 PHP Variables Variable => Value _SERVER["TERM_PROGRAM"] => Apple_Terminal _SERVER["TEST_PHP_SRCDIR"] => /usr/local/src/php-5.0.3 _SERVER["TERM"] => xterm-color _SERVER["SHELL"] => /bin/sh _SERVER["MAKEFLAGS"] => _SERVER["SSH_CLIENT"] => deleted _SERVER["TERM_PROGRAM_VERSION"] => 100.1.4 _SERVER["SSH_TTY"] => deleted _SERVER["USER"] => root _SERVER["SCRIPT_FILENAME"] => _SERVER["SUDO_USER"] => ikar _SERVER["SUDO_UID"] => 501 _SERVER["SSH_AUTH_SOCK"] => deleted _SERVER["__CF_USER_TEXT_ENCODING"] => 0x1F5:0:0 _SERVER["MAKELEVEL"] => 1 _SERVER["MFLAGS"] => _SERVER["PATH"] => /bin:/sbin:/usr/bin:/usr/sbin _SERVER["_"] => /usr/local/src/php-5.0.3/sapi/cli/php _SERVER["PWD"] => /usr/local/src/php-5.0.3 _SERVER["TEST_PHP_EXECUTABLE"] => /usr/local/src/php-5.0.3/sapi/cli/php _SERVER["REDIRECT_STATUS"] => _SERVER["PATH_TRANSLATED"] => _SERVER["HOME"] => /Users/ikar _SERVER["SHLVL"] => 3 _SERVER["SUDO_COMMAND"] => /usr/bin/make test _SERVER["CONTENT_LENGTH"] => _SERVER["LOGNAME"] => root _SERVER["QUERY_STRING"] => _SERVER["CONTENT_TYPE"] => _SERVER["SUDO_GID"] => 501 _SERVER["CC"] => gcc _SERVER["REQUEST_METHOD"] => _SERVER["SECURITYSESSIONID"] => 20f300 _SERVER["PHP_SELF"] => _SERVER["SCRIPT_NAME"] => _SERVER["DOCUMENT_ROOT"] => _SERVER["argv"] => Array ( ) _SERVER["argc"] => 0 _ENV["TERM_PROGRAM"] => Apple_Terminal _ENV["TEST_PHP_SRCDIR"] => /usr/local/src/php-5.0.3 _ENV["TERM"] => xterm-color _ENV["SHELL"] => /bin/sh _ENV["MAKEFLAGS"] => _ENV["SSH_CLIENT"] => deleted _ENV["TERM_PROGRAM_VERSION"] => 100.1.4 _ENV["SSH_TTY"] => deleted _ENV["USER"] => root _ENV["SCRIPT_FILENAME"] => _ENV["SUDO_USER"] => ikar _ENV["SUDO_UID"] => 501 _ENV["SSH_AUTH_SOCK"] => deleted _ENV["__CF_USER_TEXT_ENCODING"] => 0x1F5:0:0 _ENV["MAKELEVEL"] => 1 _ENV["MFLAGS"] => _ENV["PATH"] => /bin:/sbin:/usr/bin:/usr/sbin _ENV["_"] => /usr/local/src/php-5.0.3/sapi/cli/php _ENV["PWD"] => /usr/local/src/php-5.0.3 _ENV["TEST_PHP_EXECUTABLE"] => /usr/local/src/php-5.0.3/sapi/cli/php _ENV["REDIRECT_STATUS"] => _ENV["PATH_TRANSLATED"] => _ENV["HOME"] => /Users/ikar _ENV["SHLVL"] => 3 _ENV["SUDO_COMMAND"] => /usr/bin/make test _ENV["CONTENT_LENGTH"] => _ENV["LOGNAME"] => root _ENV["QUERY_STRING"] => _ENV["CONTENT_TYPE"] => _ENV["SUDO_GID"] => 501 _ENV["CC"] => gcc _ENV["REQUEST_METHOD"] => _ENV["SECURITYSESSIONID"] => 20f300 PHP License This program is free software; you can redistribute it and/or modify it under the terms of the PHP License as published by the PHP Group and included in the distribution in the file: LICENSE This program is distributed in the hope that it will be useful, but WITHOUT ANY WARRANTY; without even the implied warranty of MERCHANTABILITY or FITNESS FOR A PARTICULAR PURPOSE. If you did not receive a copy of the PHP license, or have any questions about PHP licensing, please contact license@php.net.

« previous php.qa (#23040) next »