Test results for 5.0.3 [failed]
| From: | noreply@php.net | Date: | Sat, 29 Jan 2005 16:11:23 +0000 |
| Subject: | Test results for 5.0.3 [failed] | ||
| Groups: | php.qa | ||
| Request: | Send a blank email to php-qa+get-23303@lists.php.net to get a copy of this message | ||
=====================================================================
FAILED TEST SUMMARY
---------------------------------------------------------------------
Convert warnings to exceptions [tests/lang/038.phpt]
Bug #29944 (function defined in switch crashes PHP) [tests/lang/bug29944.phpt]
Bug #22836 (returning references to NULL) [Zend/tests/bug22836.phpt]
Bug #28444 (Cannot access undefined property for object with overloaded property access)
[Zend/tests/bug28444.phpt]
Test 3: Exception Test [ext/dom/tests/dom003.phpt]
Bug #29992 (foreach by reference corrupts the array) [ext/standard/tests/array/bug29992.phpt]
Bug #24482 (GLOB_ONLYDIR not working) [ext/standard/tests/file/bug24482.phpt]
Bug #20382 (strtotime ("Monday", $date) produces wrong result on DST changeover)
[ext/standard/tests/time/bug20382.phpt]
Bug #26614 (CDATA sections skipped on line count) [ext/xml/tests/bug26614.phpt]
=====================================================================
=====================================================================
TEST RESULT SUMMARY
---------------------------------------------------------------------
Exts skipped : 61
Exts tested : 22
---------------------------------------------------------------------
Number of tests : 1291 689
Tests skipped : 602 (46.6%) --------
Tests warned : 0 (0.0%) (0.0%)
Tests failed : 9 (0.7%) (1.3%)
Tests passed : 680 (52.7%) (98.7%)
---------------------------------------------------------------------
Time taken : 71 seconds
=====================================================================
=====================================================================
FAILED TEST SUMMARY
---------------------------------------------------------------------
Convert warnings to exceptions [tests/lang/038.phpt]
Bug #29944 (function defined in switch crashes PHP) [tests/lang/bug29944.phpt]
Bug #22836 (returning references to NULL) [Zend/tests/bug22836.phpt]
Bug #28444 (Cannot access undefined property for object with overloaded property access)
[Zend/tests/bug28444.phpt]
Test 3: Exception Test [ext/dom/tests/dom003.phpt]
Bug #29992 (foreach by reference corrupts the array) [ext/standard/tests/array/bug29992.phpt]
Bug #24482 (GLOB_ONLYDIR not working) [ext/standard/tests/file/bug24482.phpt]
Bug #20382 (strtotime ("Monday", $date) produces wrong result on DST changeover)
[ext/standard/tests/time/bug20382.phpt]
Bug #26614 (CDATA sections skipped on line count) [ext/xml/tests/bug26614.phpt]
=====================================================================
================================================================================
/usr/local/src/php-5.0.3/tests/lang/038.phpt
================================================================================
---- EXPECTED OUTPUT
string(15) "Error2Exception"
string(5) "fopen"
===DONE===
---- ACTUAL OUTPUT
string(15) "Error2Exception"
string(15) "Error2Exception"
===DONE===
---- FAILED
================================================================================
002+ string(15) "Error2Exception"
002- string(5) "fopen"
================================================================================
================================================================================
/usr/local/src/php-5.0.3/tests/lang/bug29944.phpt
================================================================================
---- EXPECTED OUTPUT
1
===DONE===
---- ACTUAL OUTPUT
---- FAILED
================================================================================
001+
001- 1
002- ===DONE===
================================================================================
================================================================================
/usr/local/src/php-5.0.3/Zend/tests/bug22836.phpt
================================================================================
---- EXPECTED OUTPUT
string(3) "foo"
'foo'
Notice: Undefined variable: a in %s on line %d
Strict Standards: Only variable references should be returned by reference in %s on line %d
string(3) "foo"
'foo'
Notice: Undefined variable: a in %s on line %d
Strict Standards: Only variable references should be returned by reference in %s on line %d
string(3) "foo"
'foo'
Notice: Undefined variable: a in %s on line %d
Strict Standards: Only variable references should be returned by reference in %s on line %d
string(3) "foo"
'foo'
Notice: Undefined variable: a in %s on line %d
Strict Standards: Only variable references should be returned by reference in %s on line %d
string(3) "foo"
'foo'
Notice: Undefined variable: a in %s on line %d
Strict Standards: Only variable references should be returned by reference in %s on line %d
string(3) "foo"
'foo'
Notice: Undefined variable: a in %s on line %d
Strict Standards: Only variable references should be returned by reference in %s on line %d
string(3) "foo"
'foo'
Notice: Undefined variable: a in %s on line %d
Strict Standards: Only variable references should be returned by reference in %s on line %d
string(3) "foo"
'foo'
Notice: Undefined variable: a in %s on line %d
Strict Standards: Only variable references should be returned by reference in %s on line %d
string(3) "foo"
'foo'
Notice: Undefined variable: a in %s on line %d
Strict Standards: Only variable references should be returned by reference in %s on line %d
---- ACTUAL OUTPUT
string(3) "foo"
'foo'
Notice: Undefined variable: a in /usr/local/src/php-5.0.3/Zend/tests/bug22836.php on line 7
Strict Standards: Only variable references should be returned by reference in
/usr/local/src/php-5.0.3/Zend/tests/bug22836.php on line 7
string(3) "foo"
'foo'
Notice: Undefined variable: a in /usr/local/src/php-5.0.3/Zend/tests/bug22836.php on line 7
Strict Standards: Only variable references should be returned by reference in
/usr/local/src/php-5.0.3/Zend/tests/bug22836.php on line 7
NULL
'foo'
Notice: Undefined variable: a in /usr/local/src/php-5.0.3/Zend/tests/bug22836.php on line 7
NULL
'foo'
Notice: Undefined variable: a in /usr/local/src/php-5.0.3/Zend/tests/bug22836.php on line 7
NULL
'foo'
Notice: Undefined variable: a in /usr/local/src/php-5.0.3/Zend/tests/bug22836.php on line 7
NULL
'foo'
Notice: Undefined variable: a in /usr/local/src/php-5.0.3/Zend/tests/bug22836.php on line 7
NULL
'foo'
Notice: Undefined variable: a in /usr/local/src/php-5.0.3/Zend/tests/bug22836.php on line 7
NULL
'foo'
Notice: Undefined variable: a in /usr/local/src/php-5.0.3/Zend/tests/bug22836.php on line 7
---- FAILED
================================================================================
013+ NULL
013- string(3) "foo"
017+ NULL
018+ 'foo'
018- Strict Standards: Only variable references should be returned by reference in %s on line %d
019- string(3) "foo"
020+ Notice: Undefined variable: a in /usr/local/src/php-5.0.3/Zend/tests/bug22836.php on line 7
021+ NULL
022+ 'foo'
023+
024+ Notice: Undefined variable: a in /usr/local/src/php-5.0.3/Zend/tests/bug22836.php on line 7
025+ NULL
026+ 'foo'
027+
028+ Notice: Undefined variable: a in /usr/local/src/php-5.0.3/Zend/tests/bug22836.php on line 7
029+ NULL
030+ 'foo'
031+
032+ Notice: Undefined variable: a in /usr/local/src/php-5.0.3/Zend/tests/bug22836.php on line 7
033+ NULL
023-
024- Strict Standards: Only variable references should be returned by reference in %s on line %d
025- string(3) "foo"
026- 'foo'
027-
028- Notice: Undefined variable: a in %s on line %d
029-
030- Strict Standards: Only variable references should be returned by reference in %s on line %d
031- string(3) "foo"
032- 'foo'
033-
034- Notice: Undefined variable: a in %s on line %d
035-
036- Strict Standards: Only variable references should be returned by reference in %s on line %d
037- string(3) "foo"
038- 'foo'
039-
040- Notice: Undefined variable: a in %s on line %d
041-
042- Strict Standards: Only variable references should be returned by reference in %s on line %d
043- string(3) "foo"
044- 'foo'
045-
046- Notice: Undefined variable: a in %s on line %d
047-
048- Strict Standards: Only variable references should be returned by reference in %s on line %d
049- string(3) "foo"
050- 'foo'
051-
052- Notice: Undefined variable: a in %s on line %d
053-
054- Strict Standards: Only variable references should be returned by reference in %s on line %d
================================================================================
================================================================================
/usr/local/src/php-5.0.3/Zend/tests/bug28444.phpt
================================================================================
---- EXPECTED OUTPUT
object(Object)#%d (1) {
["x"]=>
int(2)
}
int(2)
int(3)
Overloaded::__set(y,3)
int(3)
Overloaded::__get(y)
int(3)
Overloaded::__set(z,Object id #3)
object(Object)#%d (1) {
["x"]=>
int(4)
}
Overloaded::__get(z)
int(4)
Overloaded::__get(z)
int(5)
Overloaded::__get(z)
int(6)
===DONE===
---- ACTUAL OUTPUT
object(Object)#2 (1) {
["x"]=>
int(2)
}
int(2)
int(3)
Overloaded::__set(y,3)
int(3)
Overloaded::__get(y)
int(3)
Overloaded::__set(z,Object id #3)
object(Object)#3 (1) {
["x"]=>
int(4)
}
Overloaded::__get(z)
int(4)
Overloaded::__get(z)
int(5)
Fatal error: Cannot access undefined property for object with overloaded property access in
/usr/local/src/php-5.0.3/Zend/tests/bug28444.php on line 45
---- FAILED
================================================================================
020+
021+ Fatal error: Cannot access undefined property for object with overloaded property access in
/usr/local/src/php-5.0.3/Zend/tests/bug28444.php on line 45
020- Overloaded::__get(z)
021- int(6)
022- ===DONE===
================================================================================
================================================================================
/usr/local/src/php-5.0.3/ext/dom/tests/dom003.phpt
================================================================================
---- EXPECTED OUTPUT
--- Catch exception with try/catch
object(DOMException)#%d (6) {
["message:protected"]=>
string(23) "Hierarchy Request Error"
["string:private"]=>
string(0) ""
["file:protected"]=>
string(%d) "%s/ext/dom/tests/dom003.php"
["line:protected"]=>
int(8)
["trace:private"]=>
array(0) {
}
["code"]=>
int(3)
}
--- Don't catch exception with try/catch
Fatal error: Uncaught exception 'DOMException' with message 'Hierarchy Request
Error' in %sdom003.php:%d
Stack trace:
#0 {main}
thrown in %sdom003.php on line %d
---- ACTUAL OUTPUT
--- Catch exception with try/catch
object(DOMException)#3 (6) {
["message:protected"]=>
string(23) "Hierarchy Request Error"
["string:private"]=>
string(0) ""
["file:protected"]=>
string(49) "/usr/local/src/php-5.0.3/ext/dom/tests/dom003.php"
["line:protected"]=>
int(8)
["trace:private"]=>
array(1) {
[0]=>
array(6) {
["file"]=>
string(49) "/usr/local/src/php-5.0.3/ext/dom/tests/dom003.php"
["line"]=>
int(8)
["function"]=>
string(11) "appendChild"
["class"]=>
string(10) "DOMElement"
["type"]=>
string(2) "->"
["args"]=>
array(1) {
[0]=>
object(DOMElement)#2 (0) {
}
}
}
}
["code"]=>
int(3)
}
--- Don't catch exception with try/catch
Fatal error: Uncaught exception 'DOMException' with message 'Hierarchy Request
Error' in /usr/local/src/php-5.0.3/ext/dom/tests/dom003.php:13
Stack trace:
#0 /usr/local/src/php-5.0.3/ext/dom/tests/dom003.php(13):
DOMElement->appendChild(Object(DOMElement))
#1 {main}
thrown in /usr/local/src/php-5.0.3/ext/dom/tests/dom003.php on line 13
---- FAILED
================================================================================
012+ array(1) {
013+ [0]=>
014+ array(6) {
015+ ["file"]=>
016+ string(49) "/usr/local/src/php-5.0.3/ext/dom/tests/dom003.php"
017+ ["line"]=>
018+ int(8)
019+ ["function"]=>
020+ string(11) "appendChild"
021+ ["class"]=>
022+ string(10) "DOMElement"
012- array(0) {
013- }
014- ["code"]=>
015- int(3)
016- }
017- --- Don't catch exception with try/catch
018-
019- Fatal error: Uncaught exception 'DOMException' with message 'Hierarchy Request
Error' in %sdom003.php:%d
020- Stack trace:
021- #0 {main}
022- thrown in %sdom003.php on line %d
023+ ["type"]=>
024+ string(2) "->"
025+ ["args"]=>
026+ array(1) {
027+ [0]=>
028+ object(DOMElement)#2 (0) {
029+ }
030+ }
031+ }
032+ }
033+ ["code"]=>
034+ int(3)
035+ }
036+ --- Don't catch exception with try/catch
037+
038+ Fatal error: Uncaught exception 'DOMException' with message 'Hierarchy Request
Error' in /usr/local/src/php-5.0.3/ext/dom/tests/dom003.php:13
039+ Stack trace:
040+ #0 /usr/local/src/php-5.0.3/ext/dom/tests/dom003.php(13):
DOMElement->appendChild(Object(DOMElement))
041+ #1 {main}
042+ thrown in /usr/local/src/php-5.0.3/ext/dom/tests/dom003.php on line 13
================================================================================
================================================================================
/usr/local/src/php-5.0.3/ext/standard/tests/array/bug29992.phpt
================================================================================
---- EXPECTED OUTPUT
Array
(
[0] => 1
[1] => 2
[2] => 3
)
int(1)
int(2)
int(3)
int(1)
int(2)
int(3)
int(1)
int(2)
int(3)
int(1)
int(2)
int(3)
Array
(
[0] => 1
[1] => 2
[2] => 3
)
===DONE===
---- ACTUAL OUTPUT
Array
(
[0] => 1
[1] => 2
[2] => 3
)
int(1)
int(2)
int(3)
int(1)
int(2)
int(3)
int(1)
int(2)
int(3)
int(1)
int(2)
int(2)
Array
(
[0] => 1
[1] => 2
[2] => 2
)
===DONE===
---- FAILED
================================================================================
018+ int(2)
018- int(3)
023+ [2] => 2
023- [2] => 3
================================================================================
================================================================================
/usr/local/src/php-5.0.3/ext/standard/tests/file/bug24482.phpt
================================================================================
---- EXPECTED OUTPUT
OK
---- ACTUAL OUTPUT
---- FAILED
================================================================================
001+
001- OK
================================================================================
================================================================================
/usr/local/src/php-5.0.3/ext/standard/tests/time/bug20382.phpt
================================================================================
---- EXPECTED OUTPUT
tStamp=Wednesday 2004-10-27 17:17:17 CEST
result=Monday 2004-11-01 00:00:00 CET
wanted=Monday 2004-11-01 00:00:00 CET
---- ACTUAL OUTPUT
tStamp=Wednesday 2004-10-27 17:17:17 CEST
result=Sunday 2004-10-31 23:00:00 CET
wanted=Monday 2004-11-01 00:00:00 CET
---- FAILED
================================================================================
002+ result=Sunday 2004-10-31 23:00:00 CET
002- result=Monday 2004-11-01 00:00:00 CET
================================================================================
================================================================================
/usr/local/src/php-5.0.3/ext/xml/tests/bug26614.phpt
================================================================================
---- EXPECTED OUTPUT
CDATA
<DATA> at line 2, col 0 (byte 45)
</DATA> at line 9, col 0 (byte 90)
Comment
<DATA> at line 2, col 0 (byte 45)
</DATA> at line 9, col 0 (byte 90)
Text
<DATA> at line 2, col 0 (byte 45)
</DATA> at line 9, col 0 (byte 90)
---- ACTUAL OUTPUT
CDATA
<DATA> at line 2, col 6 (byte 9)
</DATA> at line 9, col 7 (byte 56)
Comment
<DATA> at line 2, col 6 (byte 9)
</DATA> at line 9, col 7 (byte 56)
Text
<DATA> at line 2, col 6 (byte 9)
</DATA> at line 9, col 10 (byte 56)
---- FAILED
================================================================================
002+ <DATA> at line 2, col 6 (byte 9)
003+ </DATA> at line 9, col 7 (byte 56)
002- <DATA> at line 2, col 0 (byte 45)
003- </DATA> at line 9, col 0 (byte 90)
005+ <DATA> at line 2, col 6 (byte 9)
006+ </DATA> at line 9, col 7 (byte 56)
005- <DATA> at line 2, col 0 (byte 45)
006- </DATA> at line 9, col 0 (byte 90)
008+ <DATA> at line 2, col 6 (byte 9)
009+ </DATA> at line 9, col 10 (byte 56)
008- <DATA> at line 2, col 0 (byte 45)
009- </DATA> at line 9, col 0 (byte 90)
================================================================================
================================================================================
BUILD ENVIRONMENT
================================================================================
OS:
Linux - Linux localhost.localdomain 2.4.26-0vl15 #1 2004ǯ 7·î 2Æü ¶âÍËÆü 19:15:01 JST
i686
Automake:
automake (GNU automake) 1.8.5
Written by Tom Tromey <tromey@redhat.com>.
Copyright 2004 Free Software Foundation, Inc.
This is free software; see the source for copying conditions. There is NO
warranty; not even for MERCHANTABILITY or FITNESS FOR A PARTICULAR PURPOSE.
Autoconf:
autoconf (GNU Autoconf) 2.59
Written by David J. MacKenzie and Akim Demaille.
Copyright (C) 2003 Free Software Foundation, Inc.
This is free software; see the source for copying conditions. There is NO
warranty; not even for MERCHANTABILITY or FITNESS FOR A PARTICULAR PURPOSE.
Bundled Libtool:
ltmain.sh (GNU libtool) 1.4.3 (1.922.2.110 2002/10/23 01:39:54)
System Libtool:
ltmain.sh (GNU libtool) 1.5.6 (1.1220.2.95 2004/04/11 05:50:42)
Copyright (C) 2003 Free Software Foundation, Inc.
This is free software; see the source for copying conditions. There is NO
warranty; not even for MERCHANTABILITY or FITNESS FOR A PARTICULAR PURPOSE.
Compiler:
/usr/lib/gcc-lib/i386-vine-linux/3.3.2/specs ¤«¤é spec ¤òÆÉ¤ß¹þ¤ßÃæ
¥³¥ó¥Õ¥£¥°¥ª¥×¥·¥ç¥ó: ../configure --prefix=/usr --mandir=/usr/share/man
--infodir=/usr/share/info --enable-shared --enable-threads=posix --disable-checking
--with-system-zlib --enable-__cxa_atexit --host=i386-vine-linux
¥¹¥ì¥Ã¥É¥â¥Ç¥ë: posix
gcc ¥Ð¡¼¥¸¥ç¥ó 3.3.2 20031218 (Vine Linux 3.3.2-0vl8)
Bison:
GNU Bison version 1.28
Libraries:
libcrypt.so.1 => /lib/libcrypt.so.1 (0x40021000)
libpq.so.3 => /usr/local/pgsql/lib/libpq.so.3 (0x4004e000)
libmcrypt.so.4 => /usr/local/lib/libmcrypt.so.4 (0x40066000)
libltdl.so.3 => /usr/lib/libltdl.so.3 (0x40097000)
libldap.so.2 => /usr/local/lib/libldap.so.2 (0x4009e000)
liblber.so.2 => /usr/local/lib/liblber.so.2 (0x400c3000)
libgd.so.2 => /usr/local/lib/libgd.so.2 (0x400cf000)
libXpm.so.4 => /usr/X11R6/lib/libXpm.so.4 (0x4011c000)
libX11.so.6 => /usr/X11R6/lib/libX11.so.6 (0x4012b000)
libfontconfig.so.1 => /usr/lib/libfontconfig.so.1 (0x401f3000)
libpng12.so.0 => /usr/local/lib/libpng12.so.0 (0x4021a000)
libm.so.6 => /lib/i686/libm.so.6 (0x40247000)
libt1.so.5 => /usr/lib/libt1.so.5 (0x4026a000)
libfreetype.so.6 => /usr/local/lib/libfreetype.so.6 (0x402be000)
libpng.so.3 => /usr/local/lib/libpng.so.3 (0x40327000)
libjpeg.so.62 => /usr/local/lib/libjpeg.so.62 (0x40354000)
libresolv.so.2 => /lib/libresolv.so.2 (0x40371000)
libdl.so.2 => /lib/libdl.so.2 (0x40383000)
libnsl.so.1 => /lib/libnsl.so.1 (0x40387000)
libxml2.so.2 => /usr/local/lib/libxml2.so.2 (0x4039c000)
libpthread.so.0 => /lib/i686/libpthread.so.0 (0x4047f000)
libiconv.so.2 => /usr/local/lib/libiconv.so.2 (0x404d0000)
libc.so.6 => /lib/i686/libc.so.6 (0x405a6000)
libssl.so.4 => /lib/libssl.so.4 (0x406e0000)
libcrypto.so.4 => /lib/libcrypto.so.4 (0x4070f000)
libXext.so.6 => /usr/X11R6/lib/libXext.so.6 (0x40806000)
libz.so.1 => /usr/lib/libz.so.1 (0x40814000)
libexpat.so.0 => /usr/lib/libexpat.so.0 (0x40822000)
/lib/ld-linux.so.2 => /lib/ld-linux.so.2 (0x40000000)
User's E-mail:
================================================================================
PHPINFO
================================================================================
phpinfo()
PHP Version => 5.0.3
System => Linux localhost.localdomain 2.4.26-0vl15 #1 2004ǯ 7·î 2Æü ¶âÍËÆü 19:15:01
JST i686
Build Date => Jan 30 2005 01:05:43
Configure Command => './configure' '--with-pgsql=/usr/local/pgsql/'
'--enable-track-vars' '--enable-versioning' '--with-regex=sytem'
'--with-gd=/usr' '--enable-gd-native-ttf' '--with-freetype-dir=/usr'
'--with-t1lib=/usr' '--with-jpeg-dir=/usr' '--with-png-dir=/usr'
'--with-ttf=/usr' '--with-gettext=/usr' '--with-tiff-dir=/usr'
'--with-zlib-dir=/usr' '--with-mcrypt=/usr/local/'
'--with-iconv=/usr/local/' '--enable-sysvshm' '--enable-versioning'
'--with-tsrm-pthreads' '--with-pdflib=/usr/local/' '--enable-mbstring'
'--enable-mbregex' '--with-ldap' '--enable-ftp'
'--enable-apache'
Server API => Command Line Interface
Virtual Directory Support => disabled
Configuration File (php.ini) Path => /usr/local/lib
PHP API => 20031224
PHP Extension => 20041030
Zend Extension => 220040412
Debug Build => no
Thread Safety => disabled
IPv6 Support => enabled
Registered PHP Streams => php, file, http, ftp, compress.zlib
Registered Stream Socket Transports => tcp, udp, unix, udg
This program makes use of the Zend Scripting Language Engine:
Zend Engine v2.0.3, Copyright (c) 1998-2004 Zend Technologies
_______________________________________________________________________
Configuration
PHP Core
Directive => Local Value => Master Value
allow_call_time_pass_reference => On => On
allow_url_fopen => On => On
always_populate_raw_post_data => Off => Off
arg_separator.input => & => &
arg_separator.output => & => &
asp_tags => Off => Off
auto_append_file => no value => no value
auto_globals_jit => On => On
auto_prepend_file => no value => no value
browscap => no value => no value
default_charset => no value => no value
default_mimetype => text/html => text/html
define_syslog_variables => Off => Off
disable_classes => no value => no value
disable_functions => no value => no value
display_errors => On => On
display_startup_errors => Off => Off
doc_root => no value => no value
docref_ext => no value => no value
docref_root => no value => no value
enable_dl => On => On
error_append_string => no value => no value
error_log => no value => no value
error_prepend_string => no value => no value
error_reporting => no value => no value
expose_php => On => On
extension_dir => /usr/local/lib/php/extensions/no-debug-non-zts-20041030 =>
/usr/local/lib/php/extensions/no-debug-non-zts-20041030
file_uploads => On => On
highlight.bg => #FFFFFF => #FFFFFF
highlight.comment => #FF8000 => #FF8000
highlight.default => #0000BB => #0000BB
highlight.html => #000000 => #000000
highlight.keyword => #007700 => #007700
highlight.string => #DD0000 => #DD0000
html_errors => Off => On
ignore_repeated_errors => Off => Off
ignore_repeated_source => Off => Off
ignore_user_abort => Off => Off
implicit_flush => On => Off
include_path => .:/usr/local/lib/php => .:/usr/local/lib/php
log_errors => Off => Off
log_errors_max_len => 1024 => 1024
magic_quotes_gpc => On => On
magic_quotes_runtime => Off => Off
magic_quotes_sybase => Off => Off
mail.force_extra_parameters => no value => no value
max_execution_time => 0 => 30
max_input_time => -1 => -1
open_basedir => no value => no value
output_buffering => 0 => 0
output_handler => no value => no value
post_max_size => 8M => 8M
precision => 14 => 14
register_argc_argv => On => On
register_globals => Off => Off
register_long_arrays => On => On
report_memleaks => On => On
report_zend_debug => Off => Off
safe_mode => Off => Off
safe_mode_exec_dir => /usr/local/php/bin => /usr/local/php/bin
safe_mode_gid => Off => Off
safe_mode_include_dir => no value => no value
sendmail_from => no value => no value
sendmail_path => /usr/sbin/sendmail -t -i => /usr/sbin/sendmail -t -i
serialize_precision => 100 => 100
short_open_tag => On => On
SMTP => localhost => localhost
smtp_port => 25 => 25
sql.safe_mode => Off => Off
track_errors => Off => Off
unserialize_callback_func => no value => no value
upload_max_filesize => 2M => 2M
upload_tmp_dir => no value => no value
user_dir => no value => no value
variables_order => EGPCS => EGPCS
xmlrpc_error_number => 0 => 0
xmlrpc_errors => Off => Off
y2k_compliance => On => On
zend.ze1_compatibility_mode => Off => Off
ctype
ctype functions => enabled
dom
DOM/XML => enabled
DOM/XML API Version => 20031129
libxml Version => 2.6.10
HTML Support => enabled
XPath Support => enabled
XPointer Support => enabled
Schema Support => enabled
RelaxNG Support => enabled
ftp
FTP support => enabled
gd
GD Support => enabled
GD Version => 2.0 or higher
FreeType Support => enabled
FreeType Linkage => with freetype
FreeType Version => 2.1.7
T1Lib Support => enabled
GIF Read Support => enabled
GIF Create Support => enabled
JPG Support => enabled
PNG Support => enabled
WBMP Support => enabled
gettext
GetText Support => enabled
iconv
iconv support => enabled
iconv implementation => libiconv
iconv library version => 1.9
Directive => Local Value => Master Value
iconv.input_encoding => ISO-8859-1 => ISO-8859-1
iconv.internal_encoding => ISO-8859-1 => ISO-8859-1
iconv.output_encoding => ISO-8859-1 => ISO-8859-1
ldap
LDAP Support => enabled
RCS Version => $Id: ldap.c,v 1.154 2004/06/28 22:31:28 iliaa Exp $
Total Links => 0/unlimited
API Version => 2004
Vendor Name => OpenLDAP
Vendor Version => 20130
libxml
libXML support => active
libXML Version => 2.6.10
libXML streams => enabled
mbstring
Multibyte Support => enabled
Multibyte string engine => libmbfl
Multibyte (japanese) regex support => enabled
Multibyte regex (oniguruma) version => 2.2.4
mbstring extension makes use of "streamable kanji code filter and converter", which is
distributed under the GNU Lesser General Public License version 2.1.
Directive => Local Value => Master Value
mbstring.detect_order => no value => no value
mbstring.encoding_translation => Off => Off
mbstring.func_overload => 0 => 0
mbstring.http_input => pass => pass
mbstring.http_output => pass => pass
mbstring.internal_encoding => ISO-8859-1 => no value
mbstring.language => neutral => neutral
mbstring.substitute_character => no value => no value
mcrypt
mcrypt support => enabled
Version => 2.5.7
Api No => 20021217
Supported ciphers => cast-128 gost rijndael-128 twofish arcfour cast-256 loki97 rijndael-192
saferplus wake blowfish-compat des rijndael-256 serpent xtea blowfish enigma rc2 tripledes
Supported modes => cbc cfb ctr ecb ncfb nofb ofb stream
Directive => Local Value => Master Value
mcrypt.algorithms_dir => no value => no value
mcrypt.modes_dir => no value => no value
pcre
PCRE (Perl Compatible Regular Expressions) Support => enabled
PCRE Library Version => 4.5 01-December-2003
pgsql
PostgreSQL Support => enabled
PostgreSQL(libpq) Version => 7.4.3
Multibyte character support => enabled
SSL support => enabled
Active Persistent Links => 0
Active Links => 0
Directive => Local Value => Master Value
pgsql.allow_persistent => On => On
pgsql.auto_reset_persistent => Off => Off
pgsql.ignore_notice => Off => Off
pgsql.log_notice => Off => Off
pgsql.max_links => Unlimited => Unlimited
pgsql.max_persistent => Unlimited => Unlimited
posix
Revision => $Revision: 1.60 $
session
Session Support => enabled
Registered save handlers => files user sqlite
Registered serializer handlers => php php_binary
Directive => Local Value => Master Value
session.auto_start => Off => Off
session.bug_compat_42 => On => On
session.bug_compat_warn => On => On
session.cache_expire => 180 => 180
session.cache_limiter => nocache => nocache
session.cookie_domain => no value => no value
session.cookie_lifetime => 0 => 0
session.cookie_path => / => /
session.cookie_secure => Off => Off
session.entropy_file => no value => no value
session.entropy_length => 0 => 0
session.gc_divisor => 100 => 100
session.gc_maxlifetime => 1440 => 1440
session.gc_probability => 1 => 1
session.hash_bits_per_character => 4 => 4
session.hash_function => 0 => 0
session.name => PHPSESSID => PHPSESSID
session.referer_check => no value => no value
session.save_handler => files => files
session.save_path => no value => no value
session.serialize_handler => php => php
session.use_cookies => On => On
session.use_only_cookies => Off => Off
session.use_trans_sid => 0 => 0
SimpleXML
Simplexml support => enabled
Revision => $Revision: 1.139.2.4 $
Schema support => enabled
SPL
SPL support => enabled
Interfaces => RecursiveIterator, SeekableIterator
Classes => ArrayObject, ArrayIterator, CachingIterator, CachingRecursiveIterator,
DirectoryIterator, FilterIterator, LimitIterator, ParentIterator, RecursiveDirectoryIterator,
RecursiveIteratorIterator, SimpleXMLIterator
SQLite
SQLite support => enabled
PECL Module version => 2.0-dev $Id: sqlite.c,v 1.146.2.3 2004/09/26 01:41:40 wez Exp $
SQLite Library => 2.8.14
SQLite Encoding => iso8859
Directive => Local Value => Master Value
sqlite.assoc_case => 0 => 0
standard
Regex Library => Bundled library enabled
Dynamic Library Support => enabled
Path to sendmail => /usr/sbin/sendmail -t -i
Directive => Local Value => Master Value
assert.active => 1 => 1
assert.bail => 0 => 0
assert.callback => no value => no value
assert.quiet_eval => 0 => 0
assert.warning => 1 => 1
auto_detect_line_endings => 0 => 0
date.default_latitude => 31.7667 => 31.7667
date.default_longitude => 35.2333 => 35.2333
date.sunrise_zenith => 90.83 => 90.83
date.sunset_zenith => 90.83 => 90.83
default_socket_timeout => 60 => 60
safe_mode_allowed_env_vars => PHP_ => PHP_
safe_mode_protected_env_vars => LD_LIBRARY_PATH => LD_LIBRARY_PATH
url_rewriter.tags => a=href,area=href,frame=src,form=,fieldset= =>
a=href,area=href,frame=src,form=,fieldset=
user_agent => no value => no value
tokenizer
Tokenizer Support => enabled
xml
XML Support => active
XML Namespace Support => active
libxml2 Version => 2.6.10
zlib
ZLib Support => enabled
Compiled Version => 1.2.1
Linked Version => 1.2.1
Directive => Local Value => Master Value
zlib.output_compression => Off => Off
zlib.output_compression_level => -1 => -1
zlib.output_handler => no value => no value
Additional Modules
Module Name
sysvshm
Environment
Variable => Value
MANPATH => :/usr/local/pgsql/man:/usr/local/pgsql/man:/usr/local/pgsql/man:/usr/local/pgsql/man
HTTP_HOME => file:/usr/share/doc/Vine/index.html
CANNAHOST => unix
HOSTNAME => localhost.localdomain
TEST_PHP_SRCDIR => /usr/local/src/php-5.0.3
XFONTSIZE => normal
DESKTOP_STARTUP_ID =>
SHELL => /bin/sh
TERM => xterm
MAKEFLAGS =>
HISTSIZE => 1000
SSH_CLIENT => deleted
GTK_RC_FILES => /etc/gtk/gtkrc:/home/afro/.gtkrc-1.2-gnome2
WINDOWID => 32456060
SSH_TTY => deleted
WNN6_FRONT_END => kinput2
USER => afro
LS_COLORS =>
SCRIPT_FILENAME =>
PGLIB => /usr/local/pgsql/lib
POSTGRES_HOME => /usr/local/pgsql
SSH_AUTH_SOCK => deleted
USERNAME =>
SESSION_MANAGER => local/localhost.localdomain:/tmp/.ICE-unix/1196
XSESSION_WRAPPER => /usr/bin/ssh-agent
MAKELEVEL => 1
CANNA_SERVER => unix
MFLAGS =>
EMACS_IME => canna
WNN7_FRONT_END => kinput2
DESKTOP_SESSION => default
PATH =>
/usr/local/bin:/usr/bin:/bin:/usr/X11R6/bin:/usr/local/pgsql/bin:/usr/local/pgsql/bin:/usr/local/pgsql/bin:/usr/local/pgsql/bin
MAIL => /var/spool/mail/afro
_ => /usr/local/src/php-5.0.3/sapi/cli/php
PWD => /usr/local/src/php-5.0.3
INPUTRC => /etc/inputrc
XMODIFIERS => @im=kinput2
JSERVER => localhost
LANG => ja_JP.eucJP
TEST_PHP_EXECUTABLE => /usr/local/src/php-5.0.3/sapi/cli/php
REDIRECT_STATUS =>
PATH_TRANSLATED =>
GDMSESSION => default
SSH_ASKPASS => /usr/libexec/openssh/gnome-ssh-askpass
HOME => /root
SHLVL => 4
CONTENT_LENGTH =>
WNN6_SERVER => localhost
WNN7_SERVER => localhost
GNOME_DESKTOP_SESSION_ID => Default
XIM_PROG => canna
BASH_ENV => /home/afro/.bashrc
LOGNAME => afro
QUERY_STRING =>
LESSOPEN => |lesspipe.sh %s
PGDATA => /usr/local/pgsql/data
BROWSER => kterm -e w3m
CONTENT_TYPE =>
DISPLAY => :0.0
CC => gcc
GTK_IM_MODULE => xim
REQUEST_METHOD =>
TK_KCPROTO => kinput2
G_BROKEN_FILENAMES => 1
XAUTHORITY => /root/.xauthiyexOg
COLORTERM => gnome-terminal
which => () { {
alias;
declare -f
} | /usr/bin/which --tty-only --read-alias --read-functions --show-dot --show-tilde
${1+"$@"}
}
ls => () { /bin/ls --color=tty ${1+"$@"}
}
PHP Variables
Variable => Value
_SERVER["MANPATH"] =>
:/usr/local/pgsql/man:/usr/local/pgsql/man:/usr/local/pgsql/man:/usr/local/pgsql/man
_SERVER["HTTP_HOME"] => file:/usr/share/doc/Vine/index.html
_SERVER["CANNAHOST"] => unix
_SERVER["HOSTNAME"] => localhost.localdomain
_SERVER["TEST_PHP_SRCDIR"] => /usr/local/src/php-5.0.3
_SERVER["XFONTSIZE"] => normal
_SERVER["DESKTOP_STARTUP_ID"] =>
_SERVER["SHELL"] => /bin/sh
_SERVER["TERM"] => xterm
_SERVER["MAKEFLAGS"] =>
_SERVER["HISTSIZE"] => 1000
_SERVER["SSH_CLIENT"] => deleted
_SERVER["GTK_RC_FILES"] => /etc/gtk/gtkrc:/home/afro/.gtkrc-1.2-gnome2
_SERVER["WINDOWID"] => 32456060
_SERVER["SSH_TTY"] => deleted
_SERVER["WNN6_FRONT_END"] => kinput2
_SERVER["USER"] => afro
_SERVER["LS_COLORS"] =>
_SERVER["SCRIPT_FILENAME"] =>
_SERVER["PGLIB"] => /usr/local/pgsql/lib
_SERVER["POSTGRES_HOME"] => /usr/local/pgsql
_SERVER["SSH_AUTH_SOCK"] => deleted
_SERVER["USERNAME"] =>
_SERVER["SESSION_MANAGER"] => local/localhost.localdomain:/tmp/.ICE-unix/1196
_SERVER["XSESSION_WRAPPER"] => /usr/bin/ssh-agent
_SERVER["MAKELEVEL"] => 1
_SERVER["CANNA_SERVER"] => unix
_SERVER["MFLAGS"] =>
_SERVER["EMACS_IME"] => canna
_SERVER["WNN7_FRONT_END"] => kinput2
_SERVER["DESKTOP_SESSION"] => default
_SERVER["PATH"] =>
/usr/local/bin:/usr/bin:/bin:/usr/X11R6/bin:/usr/local/pgsql/bin:/usr/local/pgsql/bin:/usr/local/pgsql/bin:/usr/local/pgsql/bin
_SERVER["MAIL"] => /var/spool/mail/afro
_SERVER["_"] => /usr/local/src/php-5.0.3/sapi/cli/php
_SERVER["PWD"] => /usr/local/src/php-5.0.3
_SERVER["INPUTRC"] => /etc/inputrc
_SERVER["XMODIFIERS"] => @im=kinput2
_SERVER["JSERVER"] => localhost
_SERVER["LANG"] => ja_JP.eucJP
_SERVER["TEST_PHP_EXECUTABLE"] => /usr/local/src/php-5.0.3/sapi/cli/php
_SERVER["REDIRECT_STATUS"] =>
_SERVER["PATH_TRANSLATED"] =>
_SERVER["GDMSESSION"] => default
_SERVER["SSH_ASKPASS"] => /usr/libexec/openssh/gnome-ssh-askpass
_SERVER["HOME"] => /root
_SERVER["SHLVL"] => 4
_SERVER["CONTENT_LENGTH"] =>
_SERVER["WNN6_SERVER"] => localhost
_SERVER["WNN7_SERVER"] => localhost
_SERVER["GNOME_DESKTOP_SESSION_ID"] => Default
_SERVER["XIM_PROG"] => canna
_SERVER["BASH_ENV"] => /home/afro/.bashrc
_SERVER["LOGNAME"] => afro
_SERVER["QUERY_STRING"] =>
_SERVER["LESSOPEN"] => |lesspipe.sh %s
_SERVER["PGDATA"] => /usr/local/pgsql/data
_SERVER["BROWSER"] => kterm -e w3m
_SERVER["CONTENT_TYPE"] =>
_SERVER["DISPLAY"] => :0.0
_SERVER["CC"] => gcc
_SERVER["GTK_IM_MODULE"] => xim
_SERVER["REQUEST_METHOD"] =>
_SERVER["TK_KCPROTO"] => kinput2
_SERVER["G_BROKEN_FILENAMES"] => 1
_SERVER["XAUTHORITY"] => /root/.xauthiyexOg
_SERVER["COLORTERM"] => gnome-terminal
_SERVER["which"] => () { {
alias;
declare -f
} | /usr/bin/which --tty-only --read-alias --read-functions --show-dot --show-tilde
${1+"$@"}
}
_SERVER["ls"] => () { /bin/ls --color=tty ${1+"$@"}
}
_SERVER["PHP_SELF"] =>
_SERVER["SCRIPT_NAME"] =>
_SERVER["DOCUMENT_ROOT"] =>
_SERVER["argv"] => Array
(
)
_SERVER["argc"] => 0
_ENV["MANPATH"] =>
:/usr/local/pgsql/man:/usr/local/pgsql/man:/usr/local/pgsql/man:/usr/local/pgsql/man
_ENV["HTTP_HOME"] => file:/usr/share/doc/Vine/index.html
_ENV["CANNAHOST"] => unix
_ENV["HOSTNAME"] => localhost.localdomain
_ENV["TEST_PHP_SRCDIR"] => /usr/local/src/php-5.0.3
_ENV["XFONTSIZE"] => normal
_ENV["DESKTOP_STARTUP_ID"] =>
_ENV["SHELL"] => /bin/sh
_ENV["TERM"] => xterm
_ENV["MAKEFLAGS"] =>
_ENV["HISTSIZE"] => 1000
_ENV["SSH_CLIENT"] => deleted
_ENV["GTK_RC_FILES"] => /etc/gtk/gtkrc:/home/afro/.gtkrc-1.2-gnome2
_ENV["WINDOWID"] => 32456060
_ENV["SSH_TTY"] => deleted
_ENV["WNN6_FRONT_END"] => kinput2
_ENV["USER"] => afro
_ENV["LS_COLORS"] =>
_ENV["SCRIPT_FILENAME"] =>
_ENV["PGLIB"] => /usr/local/pgsql/lib
_ENV["POSTGRES_HOME"] => /usr/local/pgsql
_ENV["SSH_AUTH_SOCK"] => deleted
_ENV["USERNAME"] =>
_ENV["SESSION_MANAGER"] => local/localhost.localdomain:/tmp/.ICE-unix/1196
_ENV["XSESSION_WRAPPER"] => /usr/bin/ssh-agent
_ENV["MAKELEVEL"] => 1
_ENV["CANNA_SERVER"] => unix
_ENV["MFLAGS"] =>
_ENV["EMACS_IME"] => canna
_ENV["WNN7_FRONT_END"] => kinput2
_ENV["DESKTOP_SESSION"] => default
_ENV["PATH"] =>
/usr/local/bin:/usr/bin:/bin:/usr/X11R6/bin:/usr/local/pgsql/bin:/usr/local/pgsql/bin:/usr/local/pgsql/bin:/usr/local/pgsql/bin
_ENV["MAIL"] => /var/spool/mail/afro
_ENV["_"] => /usr/local/src/php-5.0.3/sapi/cli/php
_ENV["PWD"] => /usr/local/src/php-5.0.3
_ENV["INPUTRC"] => /etc/inputrc
_ENV["XMODIFIERS"] => @im=kinput2
_ENV["JSERVER"] => localhost
_ENV["LANG"] => ja_JP.eucJP
_ENV["TEST_PHP_EXECUTABLE"] => /usr/local/src/php-5.0.3/sapi/cli/php
_ENV["REDIRECT_STATUS"] =>
_ENV["PATH_TRANSLATED"] =>
_ENV["GDMSESSION"] => default
_ENV["SSH_ASKPASS"] => /usr/libexec/openssh/gnome-ssh-askpass
_ENV["HOME"] => /root
_ENV["SHLVL"] => 4
_ENV["CONTENT_LENGTH"] =>
_ENV["WNN6_SERVER"] => localhost
_ENV["WNN7_SERVER"] => localhost
_ENV["GNOME_DESKTOP_SESSION_ID"] => Default
_ENV["XIM_PROG"] => canna
_ENV["BASH_ENV"] => /home/afro/.bashrc
_ENV["LOGNAME"] => afro
_ENV["QUERY_STRING"] =>
_ENV["LESSOPEN"] => |lesspipe.sh %s
_ENV["PGDATA"] => /usr/local/pgsql/data
_ENV["BROWSER"] => kterm -e w3m
_ENV["CONTENT_TYPE"] =>
_ENV["DISPLAY"] => :0.0
_ENV["CC"] => gcc
_ENV["GTK_IM_MODULE"] => xim
_ENV["REQUEST_METHOD"] =>
_ENV["TK_KCPROTO"] => kinput2
_ENV["G_BROKEN_FILENAMES"] => 1
_ENV["XAUTHORITY"] => /root/.xauthiyexOg
_ENV["COLORTERM"] => gnome-terminal
_ENV["which"] => () { {
alias;
declare -f
} | /usr/bin/which --tty-only --read-alias --read-functions --show-dot --show-tilde
${1+"$@"}
}
_ENV["ls"] => () { /bin/ls --color=tty ${1+"$@"}
}
PHP License
This program is free software; you can redistribute it and/or modify
it under the terms of the PHP License as published by the PHP Group
and included in the distribution in the file: LICENSE
This program is distributed in the hope that it will be useful,
but WITHOUT ANY WARRANTY; without even the implied warranty of
MERCHANTABILITY or FITNESS FOR A PARTICULAR PURPOSE.
If you did not receive a copy of the PHP license, or have any
questions about PHP licensing, please contact license@php.net.