Test results for 5.0.3 [failed]
| From: | noreply@php.net | Date: | Thu, 17 Feb 2005 22:46:24 +0000 |
| Subject: | Test results for 5.0.3 [failed] | ||
| Groups: | php.qa | ||
| Request: | Send a blank email to php-qa+get-23743@lists.php.net to get a copy of this message | ||
=====================================================================
FAILED TEST SUMMARY
---------------------------------------------------------------------
Test for buffering in core functions with implicit flush off [tests/func/008.phpt]
Convert warnings to exceptions [tests/lang/038.phpt]
Bug #29944 (function defined in switch crashes PHP) [tests/lang/bug29944.phpt]
Bug #22836 (returning references to NULL) [Zend/tests/bug22836.phpt]
Bug #28444 (Cannot access undefined property for object with overloaded property access)
[Zend/tests/bug28444.phpt]
Test 3: Exception Test [ext/dom/tests/dom003.phpt]
Bug #24155 (gdImageRotate270 rotation problem). [ext/gd/tests/bug24155.phpt]
gdimagefill() function (Bug #19366 (fixed in bundled libgd)) [ext/gd/tests/bug27582_1.phpt]
Bug #16069 [ext/iconv/tests/bug16069.phpt]
iconv stream filter [ext/iconv/tests/iconv_stream_filter.phpt]
HTML input/output [ext/mbstring/tests/htmlent.phpt]
mb_output_handler() (Shift_JIS) [ext/mbstring/tests/mb_output_handler_shift_jis.phpt]
Bug #29992 (foreach by reference corrupts the array) [ext/standard/tests/array/bug29992.phpt]
Bug #22414 (passthru() does not read data correctly) [ext/standard/tests/file/bug22414.phpt]
Bug #20382 (strtotime ("Monday", $date) produces wrong result on DST changeover)
[ext/standard/tests/time/bug20382.phpt]
wddx deserialization test [ext/wddx/tests/001.phpt]
Bug #26614 (CDATA sections skipped on line count) [ext/xml/tests/bug26614.phpt]
=====================================================================
=====================================================================
TEST RESULT SUMMARY
---------------------------------------------------------------------
Exts skipped : 52
Exts tested : 31
---------------------------------------------------------------------
Number of tests : 1291 726
Tests skipped : 565 (43.8%) --------
Tests warned : 0 (0.0%) (0.0%)
Tests failed : 17 (1.3%) (2.3%)
Tests passed : 709 (54.9%) (97.7%)
---------------------------------------------------------------------
Time taken : 105 seconds
=====================================================================
=====================================================================
FAILED TEST SUMMARY
---------------------------------------------------------------------
Test for buffering in core functions with implicit flush off [tests/func/008.phpt]
Convert warnings to exceptions [tests/lang/038.phpt]
Bug #29944 (function defined in switch crashes PHP) [tests/lang/bug29944.phpt]
Bug #22836 (returning references to NULL) [Zend/tests/bug22836.phpt]
Bug #28444 (Cannot access undefined property for object with overloaded property access)
[Zend/tests/bug28444.phpt]
Test 3: Exception Test [ext/dom/tests/dom003.phpt]
Bug #24155 (gdImageRotate270 rotation problem). [ext/gd/tests/bug24155.phpt]
gdimagefill() function (Bug #19366 (fixed in bundled libgd)) [ext/gd/tests/bug27582_1.phpt]
Bug #16069 [ext/iconv/tests/bug16069.phpt]
iconv stream filter [ext/iconv/tests/iconv_stream_filter.phpt]
HTML input/output [ext/mbstring/tests/htmlent.phpt]
mb_output_handler() (Shift_JIS) [ext/mbstring/tests/mb_output_handler_shift_jis.phpt]
Bug #29992 (foreach by reference corrupts the array) [ext/standard/tests/array/bug29992.phpt]
Bug #22414 (passthru() does not read data correctly) [ext/standard/tests/file/bug22414.phpt]
Bug #20382 (strtotime ("Monday", $date) produces wrong result on DST changeover)
[ext/standard/tests/time/bug20382.phpt]
wddx deserialization test [ext/wddx/tests/001.phpt]
Bug #26614 (CDATA sections skipped on line count) [ext/xml/tests/bug26614.phpt]
=====================================================================
================================================================================
/usr/local/src/php-5.0.3/tests/func/008.phpt
================================================================================
---- EXPECTED OUTPUT
'foo1'
'foo2'
---- ACTUAL OUTPUT
---- FAILED
================================================================================
001- 'foo1'
003- 'foo2'
================================================================================
================================================================================
/usr/local/src/php-5.0.3/tests/lang/038.phpt
================================================================================
---- EXPECTED OUTPUT
string(15) "Error2Exception"
string(5) "fopen"
===DONE===
---- ACTUAL OUTPUT
string(15) "Error2Exception"
string(15) "Error2Exception"
===DONE===
---- FAILED
================================================================================
002+ string(15) "Error2Exception"
002- string(5) "fopen"
================================================================================
================================================================================
/usr/local/src/php-5.0.3/tests/lang/bug29944.phpt
================================================================================
---- EXPECTED OUTPUT
1
===DONE===
---- ACTUAL OUTPUT
---- FAILED
================================================================================
001+
001- 1
002- ===DONE===
================================================================================
================================================================================
/usr/local/src/php-5.0.3/Zend/tests/bug22836.phpt
================================================================================
---- EXPECTED OUTPUT
string(3) "foo"
'foo'
Notice: Undefined variable: a in %s on line %d
Strict Standards: Only variable references should be returned by reference in %s on line %d
string(3) "foo"
'foo'
Notice: Undefined variable: a in %s on line %d
Strict Standards: Only variable references should be returned by reference in %s on line %d
string(3) "foo"
'foo'
Notice: Undefined variable: a in %s on line %d
Strict Standards: Only variable references should be returned by reference in %s on line %d
string(3) "foo"
'foo'
Notice: Undefined variable: a in %s on line %d
Strict Standards: Only variable references should be returned by reference in %s on line %d
string(3) "foo"
'foo'
Notice: Undefined variable: a in %s on line %d
Strict Standards: Only variable references should be returned by reference in %s on line %d
string(3) "foo"
'foo'
Notice: Undefined variable: a in %s on line %d
Strict Standards: Only variable references should be returned by reference in %s on line %d
string(3) "foo"
'foo'
Notice: Undefined variable: a in %s on line %d
Strict Standards: Only variable references should be returned by reference in %s on line %d
string(3) "foo"
'foo'
Notice: Undefined variable: a in %s on line %d
Strict Standards: Only variable references should be returned by reference in %s on line %d
string(3) "foo"
'foo'
Notice: Undefined variable: a in %s on line %d
Strict Standards: Only variable references should be returned by reference in %s on line %d
---- ACTUAL OUTPUT
string(3) "foo"
'foo'
Notice: Undefined variable: a in /usr/local/src/php-5.0.3/Zend/tests/bug22836.php on line 7
Strict Standards: Only variable references should be returned by reference in
/usr/local/src/php-5.0.3/Zend/tests/bug22836.php on line 7
string(3) "foo"
'foo'
Notice: Undefined variable: a in /usr/local/src/php-5.0.3/Zend/tests/bug22836.php on line 7
Strict Standards: Only variable references should be returned by reference in
/usr/local/src/php-5.0.3/Zend/tests/bug22836.php on line 7
NULL
'foo'
Notice: Undefined variable: a in /usr/local/src/php-5.0.3/Zend/tests/bug22836.php on line 7
NULL
'foo'
Notice: Undefined variable: a in /usr/local/src/php-5.0.3/Zend/tests/bug22836.php on line 7
NULL
'foo'
Notice: Undefined variable: a in /usr/local/src/php-5.0.3/Zend/tests/bug22836.php on line 7
NULL
'foo'
Notice: Undefined variable: a in /usr/local/src/php-5.0.3/Zend/tests/bug22836.php on line 7
NULL
'foo'
Notice: Undefined variable: a in /usr/local/src/php-5.0.3/Zend/tests/bug22836.php on line 7
NULL
'foo'
Notice: Undefined variable: a in /usr/local/src/php-5.0.3/Zend/tests/bug22836.php on line 7
---- FAILED
================================================================================
013+ NULL
013- string(3) "foo"
017+ NULL
018+ 'foo'
018- Strict Standards: Only variable references should be returned by reference in %s on line %d
019- string(3) "foo"
020+ Notice: Undefined variable: a in /usr/local/src/php-5.0.3/Zend/tests/bug22836.php on line 7
021+ NULL
022+ 'foo'
023+
024+ Notice: Undefined variable: a in /usr/local/src/php-5.0.3/Zend/tests/bug22836.php on line 7
025+ NULL
026+ 'foo'
027+
028+ Notice: Undefined variable: a in /usr/local/src/php-5.0.3/Zend/tests/bug22836.php on line 7
029+ NULL
030+ 'foo'
031+
032+ Notice: Undefined variable: a in /usr/local/src/php-5.0.3/Zend/tests/bug22836.php on line 7
033+ NULL
023-
024- Strict Standards: Only variable references should be returned by reference in %s on line %d
025- string(3) "foo"
026- 'foo'
027-
028- Notice: Undefined variable: a in %s on line %d
029-
030- Strict Standards: Only variable references should be returned by reference in %s on line %d
031- string(3) "foo"
032- 'foo'
033-
034- Notice: Undefined variable: a in %s on line %d
035-
036- Strict Standards: Only variable references should be returned by reference in %s on line %d
037- string(3) "foo"
038- 'foo'
039-
040- Notice: Undefined variable: a in %s on line %d
041-
042- Strict Standards: Only variable references should be returned by reference in %s on line %d
043- string(3) "foo"
044- 'foo'
045-
046- Notice: Undefined variable: a in %s on line %d
047-
048- Strict Standards: Only variable references should be returned by reference in %s on line %d
049- string(3) "foo"
050- 'foo'
051-
052- Notice: Undefined variable: a in %s on line %d
053-
054- Strict Standards: Only variable references should be returned by reference in %s on line %d
================================================================================
================================================================================
/usr/local/src/php-5.0.3/Zend/tests/bug28444.phpt
================================================================================
---- EXPECTED OUTPUT
object(Object)#%d (1) {
["x"]=>
int(2)
}
int(2)
int(3)
Overloaded::__set(y,3)
int(3)
Overloaded::__get(y)
int(3)
Overloaded::__set(z,Object id #3)
object(Object)#%d (1) {
["x"]=>
int(4)
}
Overloaded::__get(z)
int(4)
Overloaded::__get(z)
int(5)
Overloaded::__get(z)
int(6)
===DONE===
---- ACTUAL OUTPUT
object(Object)#2 (1) {
["x"]=>
int(2)
}
int(2)
int(3)
Overloaded::__set(y,3)
int(3)
Overloaded::__get(y)
int(3)
Overloaded::__set(z,Object id #3)
object(Object)#3 (1) {
["x"]=>
int(4)
}
Overloaded::__get(z)
int(4)
Overloaded::__get(z)
int(5)
Fatal error: Cannot access undefined property for object with overloaded property access in
/usr/local/src/php-5.0.3/Zend/tests/bug28444.php on line 45
---- FAILED
================================================================================
020+
021+ Fatal error: Cannot access undefined property for object with overloaded property access in
/usr/local/src/php-5.0.3/Zend/tests/bug28444.php on line 45
020- Overloaded::__get(z)
021- int(6)
022- ===DONE===
================================================================================
================================================================================
/usr/local/src/php-5.0.3/ext/dom/tests/dom003.phpt
================================================================================
---- EXPECTED OUTPUT
--- Catch exception with try/catch
object(DOMException)#%d (6) {
["message:protected"]=>
string(23) "Hierarchy Request Error"
["string:private"]=>
string(0) ""
["file:protected"]=>
string(%d) "%s/ext/dom/tests/dom003.php"
["line:protected"]=>
int(8)
["trace:private"]=>
array(0) {
}
["code"]=>
int(3)
}
--- Don't catch exception with try/catch
Fatal error: Uncaught exception 'DOMException' with message 'Hierarchy Request
Error' in %sdom003.php:%d
Stack trace:
#0 {main}
thrown in %sdom003.php on line %d
---- ACTUAL OUTPUT
--- Catch exception with try/catch
object(DOMException)#3 (6) {
["message:protected"]=>
string(23) "Hierarchy Request Error"
["string:private"]=>
string(0) ""
["file:protected"]=>
string(49) "/usr/local/src/php-5.0.3/ext/dom/tests/dom003.php"
["line:protected"]=>
int(8)
["trace:private"]=>
array(1) {
[0]=>
array(6) {
["file"]=>
string(49) "/usr/local/src/php-5.0.3/ext/dom/tests/dom003.php"
["line"]=>
int(8)
["function"]=>
string(11) "appendChild"
["class"]=>
string(10) "DOMElement"
["type"]=>
string(2) "->"
["args"]=>
array(1) {
[0]=>
object(DOMElement)#2 (0) {
}
}
}
}
["code"]=>
int(3)
}
--- Don't catch exception with try/catch
Fatal error: Uncaught exception 'DOMException' with message 'Hierarchy Request
Error' in /usr/local/src/php-5.0.3/ext/dom/tests/dom003.php:13
Stack trace:
#0 /usr/local/src/php-5.0.3/ext/dom/tests/dom003.php(13):
DOMElement->appendChild(Object(DOMElement))
#1 {main}
thrown in /usr/local/src/php-5.0.3/ext/dom/tests/dom003.php on line 13
---- FAILED
================================================================================
012+ array(1) {
013+ [0]=>
014+ array(6) {
015+ ["file"]=>
016+ string(49) "/usr/local/src/php-5.0.3/ext/dom/tests/dom003.php"
017+ ["line"]=>
018+ int(8)
019+ ["function"]=>
020+ string(11) "appendChild"
021+ ["class"]=>
022+ string(10) "DOMElement"
012- array(0) {
013- }
014- ["code"]=>
015- int(3)
016- }
017- --- Don't catch exception with try/catch
018-
019- Fatal error: Uncaught exception 'DOMException' with message 'Hierarchy Request
Error' in %sdom003.php:%d
020- Stack trace:
021- #0 {main}
022- thrown in %sdom003.php on line %d
023+ ["type"]=>
024+ string(2) "->"
025+ ["args"]=>
026+ array(1) {
027+ [0]=>
028+ object(DOMElement)#2 (0) {
029+ }
030+ }
031+ }
032+ }
033+ ["code"]=>
034+ int(3)
035+ }
036+ --- Don't catch exception with try/catch
037+
038+ Fatal error: Uncaught exception 'DOMException' with message 'Hierarchy Request
Error' in /usr/local/src/php-5.0.3/ext/dom/tests/dom003.php:13
039+ Stack trace:
040+ #0 /usr/local/src/php-5.0.3/ext/dom/tests/dom003.php(13):
DOMElement->appendChild(Object(DOMElement))
041+ #1 {main}
042+ thrown in /usr/local/src/php-5.0.3/ext/dom/tests/dom003.php on line 13
================================================================================
================================================================================
/usr/local/src/php-5.0.3/ext/gd/tests/bug24155.phpt
================================================================================
---- EXPECTED OUTPUT
cc867fd65c30883463ce58d0341f0997
---- ACTUAL OUTPUT
409d70b5d493746acc2255c759d73436
---- FAILED
================================================================================
001+ 409d70b5d493746acc2255c759d73436
001- cc867fd65c30883463ce58d0341f0997
================================================================================
================================================================================
/usr/local/src/php-5.0.3/ext/gd/tests/bug27582_1.phpt
================================================================================
---- EXPECTED OUTPUT
08287f8f5d406946009df5f04ca83dc0
---- ACTUAL OUTPUT
b6d55b399e27b895a1fee8a137bb8470
---- FAILED
================================================================================
001+ b6d55b399e27b895a1fee8a137bb8470
001- 08287f8f5d406946009df5f04ca83dc0
================================================================================
================================================================================
/usr/local/src/php-5.0.3/ext/iconv/tests/bug16069.phpt
================================================================================
---- EXPECTED OUTPUT
¥ß¥ê¥Ð¡¼¥ë¥ß¥ê¥Ð¡¼¥ë¥ß¥ê¥Ð¡¼¥ë¥ß¥ê¥Ð¡¼¥ë¥ß¥ê¥Ð¡¼¥ë¥ß¥ê¥Ð¡¼¥ë¥ß¥ê¥Ð¡¼¥ë¥ß¥ê¥Ð¡¼¥ë¥ß¥ê¥Ð¡¼¥ë¥ß¥ê¥Ð¡¼¥ë¥ß¥ê¥Ð¡¼¥ë¥ß¥ê¥Ð¡¼¥ë¥ß¥ê¥Ð¡¼¥ë¥ß¥ê¥Ð¡¼¥ë¥ß¥ê¥Ð¡¼¥ë¥ß¥ê¥Ð¡¼¥ë¥ß¥ê¥Ð¡¼¥ë¥ß¥ê¥Ð¡¼¥ë¥ß¥ê¥Ð¡¼¥ë¥ß¥ê¥Ð¡¼¥ë¥ß¥ê¥Ð¡¼¥ë¥ß¥ê¥Ð¡¼¥ë¥ß¥ê¥Ð¡¼¥ë¥ß¥ê¥Ð¡¼¥ë¥ß¥ê¥Ð¡¼¥ë¥ß¥ê¥Ð¡¼¥ë¥ß¥ê¥Ð¡¼¥ë¥ß¥ê¥Ð¡¼¥ë¥ß¥ê¥Ð¡¼¥ë¥ß¥ê¥Ð¡¼¥ë¥ß¥ê¥Ð¡¼¥ë¥ß¥ê¥Ð¡¼¥ë¥ß¥ê¥Ð¡¼¥ë¥ß¥ê¥Ð¡¼¥ë¥ß¥ê¥Ð¡¼¥ë¥ß¥ê¥Ð¡¼¥ë¥ß¥ê¥Ð¡¼¥ë¥ß¥ê¥Ð¡¼¥ë¥ß¥ê¥Ð¡¼¥ë¥ß¥ê¥Ð¡¼¥ë(¡ë§¥¡ë)
---- ACTUAL OUTPUT
¥ß¥ê¥Ð¡¼¥ë¥ß¥ê¥Ð¡¼¥ë¥ß¥ê¥Ð¡¼¥ë¥ß¥ê¥Ð¡¼¥ë¥ß¥ê¥Ð¡¼¥ë¥ß¥ê¥Ð¡¼¥ë¥ß¥ê¥Ð¡¼¥ë¥ß¥ê¥Ð¡¼¥ë¥ß¥ê¥Ð¡¼¥ë¥ß¥ê¥Ð¡¼¥ë¥ß¥ê¥Ð¡¼¥ë¥ß¥ß¥ê¥Ð¡¼¥ë¥ß¥ê¥Ð¡¼¥ë¥ß¥ê¥Ð¡¼¥ë¥ß¥ê¥Ð¡¼¥ë¥ß¥ê¥Ð¡¼¥ë¥ß¥ê¥Ð¡¼¥ë¥ß¥ê¥Ð¡¼¥ë¥ß¥ê¥Ð¡¼¥ë¥ß¥ê¥Ð¡¼¥ë¥ß¥ê¥Ð¡¼¥ë¥ß¥ê¥Ð¡¼¥ë¥ß¥ê¥Ð¡¼¥ë¥ß¥ê¥Ð¡¼¥ë¥ß¥ê¥Ð¡¼¥ë¥ß¥ê¥Ð¡¼¥ë¥ß¥ê¥Ð¡¼¥ë¥ß¥ê¥Ð¡¼¥ë¥ß¥ê¥Ð¡¼¥ë¥ß¥ê¥Ð¡¼¥ë¥ß¥ê¥Ð¡¼¥ë¥ß¥ê¥Ð¡¼¥ë¥ß¥ê¥Ð¡¼¥ë¥ß¥ê¥Ð¡¼¥ë¥ß¥ê¥Ð¡¼¥ë¥ß¥ê¥Ð¡¼¥ë¥ß¥ê¥Ð¡¼¥ë¥ß¥ê¥Ð¡¼¥ë¥ß¥ê¥Ð¡¼¥ë¥ß¥ê¥Ð¡¼¥ë(¡ë§¥¡ë)
---- FAILED
================================================================================
001+
¥ß¥ê¥Ð¡¼¥ë¥ß¥ê¥Ð¡¼¥ë¥ß¥ê¥Ð¡¼¥ë¥ß¥ê¥Ð¡¼¥ë¥ß¥ê¥Ð¡¼¥ë¥ß¥ê¥Ð¡¼¥ë¥ß¥ê¥Ð¡¼¥ë¥ß¥ê¥Ð¡¼¥ë¥ß¥ê¥Ð¡¼¥ë¥ß¥ê¥Ð¡¼¥ë¥ß¥ê¥Ð¡¼¥ë¥ß¥ß¥ê¥Ð¡¼¥ë¥ß¥ê¥Ð¡¼¥ë¥ß¥ê¥Ð¡¼¥ë¥ß¥ê¥Ð¡¼¥ë¥ß¥ê¥Ð¡¼¥ë¥ß¥ê¥Ð¡¼¥ë¥ß¥ê¥Ð¡¼¥ë¥ß¥ê¥Ð¡¼¥ë¥ß¥ê¥Ð¡¼¥ë¥ß¥ê¥Ð¡¼¥ë¥ß¥ê¥Ð¡¼¥ë¥ß¥ê¥Ð¡¼¥ë¥ß¥ê¥Ð¡¼¥ë¥ß¥ê¥Ð¡¼¥ë¥ß¥ê¥Ð¡¼¥ë¥ß¥ê¥Ð¡¼¥ë¥ß¥ê¥Ð¡¼¥ë¥ß¥ê¥Ð¡¼¥ë¥ß¥ê¥Ð¡¼¥ë¥ß¥ê¥Ð¡¼¥ë¥ß¥ê¥Ð¡¼¥ë¥ß¥ê¥Ð¡¼¥ë¥ß¥ê¥Ð¡¼¥ë¥ß¥ê¥Ð¡¼¥ë¥ß¥ê¥Ð¡¼¥ë¥ß¥ê¥Ð¡¼¥ë¥ß¥ê¥Ð¡¼¥ë¥ß¥ê¥Ð¡¼¥ë¥ß¥ê¥Ð¡¼¥ë(¡ë§¥¡ë)
001-
¥ß¥ê¥Ð¡¼¥ë¥ß¥ê¥Ð¡¼¥ë¥ß¥ê¥Ð¡¼¥ë¥ß¥ê¥Ð¡¼¥ë¥ß¥ê¥Ð¡¼¥ë¥ß¥ê¥Ð¡¼¥ë¥ß¥ê¥Ð¡¼¥ë¥ß¥ê¥Ð¡¼¥ë¥ß¥ê¥Ð¡¼¥ë¥ß¥ê¥Ð¡¼¥ë¥ß¥ê¥Ð¡¼¥ë¥ß¥ê¥Ð¡¼¥ë¥ß¥ê¥Ð¡¼¥ë¥ß¥ê¥Ð¡¼¥ë¥ß¥ê¥Ð¡¼¥ë¥ß¥ê¥Ð¡¼¥ë¥ß¥ê¥Ð¡¼¥ë¥ß¥ê¥Ð¡¼¥ë¥ß¥ê¥Ð¡¼¥ë¥ß¥ê¥Ð¡¼¥ë¥ß¥ê¥Ð¡¼¥ë¥ß¥ê¥Ð¡¼¥ë¥ß¥ê¥Ð¡¼¥ë¥ß¥ê¥Ð¡¼¥ë¥ß¥ê¥Ð¡¼¥ë¥ß¥ê¥Ð¡¼¥ë¥ß¥ê¥Ð¡¼¥ë¥ß¥ê¥Ð¡¼¥ë¥ß¥ê¥Ð¡¼¥ë¥ß¥ê¥Ð¡¼¥ë¥ß¥ê¥Ð¡¼¥ë¥ß¥ê¥Ð¡¼¥ë¥ß¥ê¥Ð¡¼¥ë¥ß¥ê¥Ð¡¼¥ë¥ß¥ê¥Ð¡¼¥ë¥ß¥ê¥Ð¡¼¥ë¥ß¥ê¥Ð¡¼¥ë¥ß¥ê¥Ð¡¼¥ë¥ß¥ê¥Ð¡¼¥ë¥ß¥ê¥Ð¡¼¥ë(¡ë§¥¡ë)
================================================================================
================================================================================
/usr/local/src/php-5.0.3/ext/iconv/tests/iconv_stream_filter.phpt
================================================================================
---- EXPECTED OUTPUT
string(20) "1b244224332473244b24"
string(10) "41244f1b28"
string(2) "42"
string(20) "a4b3a4f3a4cba4c1a4cf"
string(10) "69636f6e76"
string(2) "0a"
Warning: fread(): iconv stream filter ("ISO-2022-JP"=>"EUC-JP"): invalid
multibyte sequence in %s on line %d
string(0) ""
string(0) ""
string(0) ""
---- ACTUAL OUTPUT
string(20) "1b244224332473244b24"
string(10) "41244f1b28"
string(2) "42"
string(20) "a4b3a4f3a4cba4c1a4cf"
string(10) "69636f6e76"
string(2) "0a"
string(20) "1b244f24332466245824"
string(10) "4e24421b28"
string(2) "4f"
---- FAILED
================================================================================
007+ string(20) "1b244f24332466245824"
008+ string(10) "4e24421b28"
009+ string(2) "4f"
007-
008- Warning: fread(): iconv stream filter ("ISO-2022-JP"=>"EUC-JP"): invalid
multibyte sequence in %s on line %d
009- string(0) ""
010- string(0) ""
011- string(0) ""
================================================================================
================================================================================
/usr/local/src/php-5.0.3/ext/mbstring/tests/htmlent.phpt
================================================================================
---- EXPECTED OUTPUT
HTML-ENTITIES>UTF-8>HTML-ENTITIES
test='&&;&@AB€‚äöü€⟨⟩'
---- ACTUAL OUTPUT
---- FAILED
================================================================================
001+
001- HTML-ENTITIES>UTF-8>HTML-ENTITIES
002-
test='&&;&@AB€‚äöü€⟨⟩'
================================================================================
================================================================================
/usr/local/src/php-5.0.3/ext/mbstring/tests/mb_output_handler_shift_jis.phpt
================================================================================
---- EXPECTED OUTPUT
string(73)
"¥Æ¥¹¥ÈÍÑÆüËܸìʸ»úÎ󡣤³¤Î¥â¥¸¥å¡¼¥ë¤ÏPHP¤Ë¥Þ¥ë¥Á¥Ð¥¤¥È´Ø¿ô¤òÄ󶡤·¤Þ¤¹¡£"
---- ACTUAL OUTPUT
---- FAILED
================================================================================
001+
001- string(73)
"¥Æ¥¹¥ÈÍÑÆüËܸìʸ»úÎ󡣤³¤Î¥â¥¸¥å¡¼¥ë¤ÏPHP¤Ë¥Þ¥ë¥Á¥Ð¥¤¥È´Ø¿ô¤òÄ󶡤·¤Þ¤¹¡£"
================================================================================
================================================================================
/usr/local/src/php-5.0.3/ext/standard/tests/array/bug29992.phpt
================================================================================
---- EXPECTED OUTPUT
Array
(
[0] => 1
[1] => 2
[2] => 3
)
int(1)
int(2)
int(3)
int(1)
int(2)
int(3)
int(1)
int(2)
int(3)
int(1)
int(2)
int(3)
Array
(
[0] => 1
[1] => 2
[2] => 3
)
===DONE===
---- ACTUAL OUTPUT
Array
(
[0] => 1
[1] => 2
[2] => 3
)
int(1)
int(2)
int(3)
int(1)
int(2)
int(3)
int(1)
int(2)
int(3)
int(1)
int(2)
int(2)
Array
(
[0] => 1
[1] => 2
[2] => 2
)
===DONE===
---- FAILED
================================================================================
018+ int(2)
018- int(3)
023+ [2] => 2
023- [2] => 3
================================================================================
================================================================================
/usr/local/src/php-5.0.3/ext/standard/tests/file/bug22414.phpt
================================================================================
---- EXPECTED OUTPUT
HELLO
Works
---- ACTUAL OUTPUT
HELLO
sh: line 1: /usr/local/php/bin/php: No such file or directory
Does not work
---- FAILED
================================================================================
002+ sh: line 1: /usr/local/php/bin/php: No such file or directory
002- Works
003+ Does not work
================================================================================
================================================================================
/usr/local/src/php-5.0.3/ext/standard/tests/time/bug20382.phpt
================================================================================
---- EXPECTED OUTPUT
tStamp=Wednesday 2004-10-27 17:17:17 CEST
result=Monday 2004-11-01 00:00:00 CET
wanted=Monday 2004-11-01 00:00:00 CET
---- ACTUAL OUTPUT
tStamp=Wednesday 2004-10-27 17:17:17 CEST
result=Sunday 2004-10-31 23:00:00 CET
wanted=Monday 2004-11-01 00:00:00 CET
---- FAILED
================================================================================
002+ result=Sunday 2004-10-31 23:00:00 CET
002- result=Monday 2004-11-01 00:00:00 CET
================================================================================
================================================================================
/usr/local/src/php-5.0.3/ext/wddx/tests/001.phpt
================================================================================
---- EXPECTED OUTPUT
array(11) {
["aNull"]=>
NULL
["aString"]=>
string(8) "a string"
["aNumber"]=>
float(-12.456)
["aDateTime"]=>
int(897625932)
["aDateTime2"]=>
int(329632332)
["aDateTime3"]=>
string(22) "2040-06-12T04:32:12+00"
["aBoolean"]=>
bool(true)
["anArray"]=>
array(2) {
[0]=>
int(10)
[1]=>
string(14) "second element"
}
["aBinary"]=>
string(11) "binary data"
["anObject"]=>
array(2) {
["s"]=>
string(8) "a string"
["n"]=>
float(-12.456)
}
["aRecordset"]=>
array(2) {
["NAME"]=>
array(2) {
[0]=>
string(8) "John Doe"
[1]=>
string(8) "Jane Doe"
}
["AGE"]=>
array(2) {
[0]=>
int(34)
[1]=>
int(31)
}
}
}
---- ACTUAL OUTPUT
array(11) {
["aNull"]=>
NULL
["aString"]=>
string(8) "a string"
["aNumber"]=>
float(-12.456)
["aDateTime"]=>
int(897625932)
["aDateTime2"]=>
int(329632332)
["aDateTime3"]=>
string(19) "2040-06-12T04:32:12"
["aBoolean"]=>
bool(true)
["anArray"]=>
array(2) {
[0]=>
int(10)
[1]=>
string(14) "second element"
}
["aBinary"]=>
string(11) "binary data"
["anObject"]=>
array(2) {
["s"]=>
string(8) "a string"
["n"]=>
float(-12.456)
}
["aRecordset"]=>
array(2) {
["NAME"]=>
array(2) {
[0]=>
string(8) "John Doe"
[1]=>
string(8) "Jane Doe"
}
["AGE"]=>
array(2) {
[0]=>
int(34)
[1]=>
int(31)
}
}
}
---- FAILED
================================================================================
013+ string(19) "2040-06-12T04:32:12"
013- string(22) "2040-06-12T04:32:12+00"
================================================================================
================================================================================
/usr/local/src/php-5.0.3/ext/xml/tests/bug26614.phpt
================================================================================
---- EXPECTED OUTPUT
CDATA
<DATA> at line 2, col 0 (byte 45)
</DATA> at line 9, col 0 (byte 90)
Comment
<DATA> at line 2, col 0 (byte 45)
</DATA> at line 9, col 0 (byte 90)
Text
<DATA> at line 2, col 0 (byte 45)
</DATA> at line 9, col 0 (byte 90)
---- ACTUAL OUTPUT
CDATA
<DATA> at line 2, col 6 (byte 9)
</DATA> at line 9, col 7 (byte 56)
Comment
<DATA> at line 2, col 6 (byte 9)
</DATA> at line 9, col 7 (byte 56)
Text
<DATA> at line 2, col 6 (byte 9)
</DATA> at line 9, col 10 (byte 56)
---- FAILED
================================================================================
002+ <DATA> at line 2, col 6 (byte 9)
003+ </DATA> at line 9, col 7 (byte 56)
002- <DATA> at line 2, col 0 (byte 45)
003- </DATA> at line 9, col 0 (byte 90)
005+ <DATA> at line 2, col 6 (byte 9)
006+ </DATA> at line 9, col 7 (byte 56)
005- <DATA> at line 2, col 0 (byte 45)
006- </DATA> at line 9, col 0 (byte 90)
008+ <DATA> at line 2, col 6 (byte 9)
009+ </DATA> at line 9, col 10 (byte 56)
008- <DATA> at line 2, col 0 (byte 45)
009- </DATA> at line 9, col 0 (byte 90)
================================================================================
================================================================================
BUILD ENVIRONMENT
================================================================================
OS:
Linux - Linux serwer1.odi-serwer.info 2.6.10-1.14_FC2 #1 Thu Feb 10 17:13:14 EST 2005 i686
Automake:
automake (GNU automake) 1.8.3
Written by Tom Tromey <tromey@redhat.com>.
Copyright 2004 Free Software Foundation, Inc.
This is free software; see the source for copying conditions. There is NO
warranty; not even for MERCHANTABILITY or FITNESS FOR A PARTICULAR PURPOSE.
Autoconf:
autoconf (GNU Autoconf) 2.59
Written by David J. MacKenzie and Akim Demaille.
Copyright (C) 2003 Free Software Foundation, Inc.
This is free software; see the source for copying conditions. There is NO
warranty; not even for MERCHANTABILITY or FITNESS FOR A PARTICULAR PURPOSE.
Bundled Libtool:
ltmain.sh (GNU libtool) 1.4.3 (1.922.2.110 2002/10/23 01:39:54)
System Libtool:
ltmain.sh (GNU libtool) 1.5.6 (1.1220.2.95 2004/04/11 05:50:42)
Copyright (C) 2003 Free Software Foundation, Inc.
This is free software; see the source for copying conditions. There is NO
warranty; not even for MERCHANTABILITY or FITNESS FOR A PARTICULAR PURPOSE.
Compiler:
Reading specs from /usr/lib/gcc-lib/i386-redhat-linux/3.3.3/specs
Configured with: ../configure --prefix=/usr --mandir=/usr/share/man --infodir=/usr/share/info
--enable-shared --enable-threads=posix --disable-checking --disable-libunwind-exceptions
--with-system-zlib --enable-__cxa_atexit --host=i386-redhat-linux
Thread model: posix
gcc version 3.3.3 20040412 (Red Hat Linux 3.3.3-7)
Bison:
bison (GNU Bison) 1.875c
Written by Robert Corbett and Richard Stallman.
Copyright (C) 2003 Free Software Foundation, Inc.
This is free software; see the source for copying conditions. There is NO
warranty; not even for MERCHANTABILITY or FITNESS FOR A PARTICULAR PURPOSE.
Libraries:
libcrypt.so.1 => /lib/libcrypt.so.1 (0x006ab000)
libssl.so.4 => /lib/libssl.so.4 (0x00817000)
libcrypto.so.4 => /lib/libcrypto.so.4 (0x00481000)
libexpat.so.0 => /usr/lib/libexpat.so.0 (0x003d3000)
libpspell.so.15 => /usr/lib/libpspell.so.15 (0x00cdc000)
libmysqlclient.so.12 => /usr/lib/libmysqlclient.so.12 (0x008b3000)
libmhash.so.2 => /usr/lib/libmhash.so.2 (0x00111000)
libmcrypt.so.4 => /usr/lib/libmcrypt.so.4 (0x00747000)
libltdl.so.3 => /usr/lib/libltdl.so.3 (0x00ddb000)
libdl.so.2 => /lib/libdl.so.2 (0x00d42000)
libpam.so.0 => /lib/libpam.so.0 (0x00db6000)
libfreetype.so.6 => /usr/lib/libfreetype.so.6 (0x00130000)
libz.so.1 => /usr/lib/libz.so.1 (0x00195000)
libX11.so.6 => /usr/X11R6/lib/libX11.so.6 (0x0024a000)
libXpm.so.4 => /usr/X11R6/lib/libXpm.so.4 (0x001a6000)
libpng12.so.0 => /usr/lib/libpng12.so.0 (0x00933000)
libjpeg.so.62 => /usr/lib/libjpeg.so.62 (0x006f9000)
libgssapi_krb5.so.2 => /usr/lib/libgssapi_krb5.so.2 (0x00343000)
libkrb5.so.3 => /usr/lib/libkrb5.so.3 (0x001b5000)
libcom_err.so.2 => /lib/libcom_err.so.2 (0x00e54000)
libk5crypto.so.3 => /usr/lib/libk5crypto.so.3 (0x00312000)
libresolv.so.2 => /lib/libresolv.so.2 (0x0021d000)
libm.so.6 => /lib/tls/libm.so.6 (0x00e28000)
libnsl.so.1 => /lib/libnsl.so.1 (0x007b4000)
libcurl.so.3 => /usr/lib/libcurl.so.3 (0x00357000)
libxml2.so.2 => /usr/lib/libxml2.so.2 (0x00572000)
libpthread.so.0 => /lib/tls/libpthread.so.0 (0x00a4f000)
libc.so.6 => /lib/tls/libc.so.6 (0x00a61000)
libaspell.so.15 => /usr/lib/libaspell.so.15 (0x00957000)
libstdc++.so.5 => /usr/lib/libstdc++.so.5 (0x00b7d000)
libgcc_s.so.1 => /lib/libgcc_s.so.1 (0x003c9000)
libnss_files.so.2 => /lib/libnss_files.so.2 (0x00334000)
libnss_dns.so.2 => /lib/libnss_dns.so.2 (0x00381000)
/lib/ld-linux.so.2 => /lib/ld-linux.so.2 (0x00233000)
libXext.so.6 => /usr/X11R6/lib/libXext.so.6 (0x00386000)
User's E-mail: odi at nowe dot pl
================================================================================
PHPINFO
================================================================================
phpinfo()
PHP Version => 5.0.3
System => Linux serwer1.odi-serwer.info 2.6.10-1.14_FC2 #1 Thu Feb 10 17:13:14 EST 2005 i686
Build Date => Feb 17 2005 23:30:02
Configure Command => './configure' '--prefix=/usr/local/php5'
'--with-config-file=/usr/local/php5/lib/php.ini'
'--with-config-file-path=/usr/local/php5/lib/'
'--with-apxs=/usr/local/apache/bin/apxs' '--with-xml'
'--enable-bcmath' '--enable-calendar' '--with-curl'
'--with-dom' '--with-dom-xslt' '--with-dom-exslt'
'--enable-exif' '--with-swf=/usr/local/flash' '--enable-ftp'
'--with-gd' '--with-jpeg-dir=/usr/local' '--with-png-dir=/usr'
'--with-xpm-dir=/usr/X11R6' '--with-gettext' '--with-iconv'
'--with-imap' '--with-imap-ssl' '--with-kerberos'
'--enable-mbstring' '--enable-mbstr-enc-trans' '--enable-mbregex'
'--with-mcrypt' '--enable-memory-limit' '--with-mhash'
'--enable-magic-quotes' '--with-mysql=/usr' '--with-openssl'
'--enable-discard-path' '--with-pdflib' '--with-pear'
'--with-pspell' '--enable-xslt' '--with-xslt-sablot'
'--enable-safe-mode' '--enable-sockets' '--enable-track-vars'
'--with-ttf' '--with-freetype-dir=/usr' '--enable-gd-native-ttf'
'--enable-versioning' '-!
-enable-wddx' '--with-xmlrpc' '--with-zip' '--with-zlib'
Server API => Command Line Interface
Virtual Directory Support => disabled
Configuration File (php.ini) Path => /usr/local/php5/lib/
PHP API => 20031224
PHP Extension => 20041030
Zend Extension => 220040412
Debug Build => no
Thread Safety => disabled
IPv6 Support => enabled
Registered PHP Streams => php, file, http, ftp, compress.zlib, https, ftps
Registered Stream Socket Transports => tcp, udp, unix, udg, ssl, sslv3, sslv2, tls
This program makes use of the Zend Scripting Language Engine:
Zend Engine v2.0.3, Copyright (c) 1998-2004 Zend Technologies
_______________________________________________________________________
Configuration
PHP Core
Directive => Local Value => Master Value
allow_call_time_pass_reference => On => On
allow_url_fopen => On => On
always_populate_raw_post_data => Off => Off
arg_separator.input => & => &
arg_separator.output => & => &
asp_tags => Off => Off
auto_append_file => no value => no value
auto_globals_jit => On => On
auto_prepend_file => no value => no value
browscap => no value => no value
default_charset => no value => no value
default_mimetype => text/html => text/html
define_syslog_variables => Off => Off
disable_classes => no value => no value
disable_functions => no value => no value
display_errors => On => On
display_startup_errors => Off => Off
doc_root => no value => no value
docref_ext => no value => no value
docref_root => no value => no value
enable_dl => On => On
error_append_string => no value => no value
error_log => no value => no value
error_prepend_string => no value => no value
error_reporting => no value => no value
expose_php => On => On
extension_dir => /usr/local/php5/lib/php/extensions/no-debug-non-zts-20041030 =>
/usr/local/php5/lib/php/extensions/no-debug-non-zts-20041030
file_uploads => On => On
highlight.bg => #FFFFFF => #FFFFFF
highlight.comment => #FF8000 => #FF8000
highlight.default => #0000BB => #0000BB
highlight.html => #000000 => #000000
highlight.keyword => #007700 => #007700
highlight.string => #DD0000 => #DD0000
html_errors => Off => On
ignore_repeated_errors => Off => Off
ignore_repeated_source => Off => Off
ignore_user_abort => Off => Off
implicit_flush => On => Off
include_path => .:/usr/local/php5/lib/php => .:/usr/local/php5/lib/php
log_errors => Off => Off
log_errors_max_len => 1024 => 1024
magic_quotes_gpc => On => On
magic_quotes_runtime => Off => Off
magic_quotes_sybase => Off => Off
mail.force_extra_parameters => no value => no value
max_execution_time => 0 => 30
max_input_time => -1 => -1
memory_limit => 8M => 8M
open_basedir => no value => no value
output_buffering => 0 => 0
output_handler => no value => no value
post_max_size => 8M => 8M
precision => 14 => 14
register_argc_argv => On => On
register_globals => Off => Off
register_long_arrays => On => On
report_memleaks => On => On
report_zend_debug => Off => Off
safe_mode => On => On
safe_mode_exec_dir => /usr/local/php/bin => /usr/local/php/bin
safe_mode_gid => Off => Off
safe_mode_include_dir => no value => no value
sendmail_from => no value => no value
sendmail_path => /usr/sbin/sendmail -t -i => /usr/sbin/sendmail -t -i
serialize_precision => 100 => 100
short_open_tag => On => On
SMTP => localhost => localhost
smtp_port => 25 => 25
sql.safe_mode => Off => Off
track_errors => Off => Off
unserialize_callback_func => no value => no value
upload_max_filesize => 2M => 2M
upload_tmp_dir => no value => no value
user_dir => no value => no value
variables_order => EGPCS => EGPCS
xmlrpc_error_number => 0 => 0
xmlrpc_errors => Off => Off
y2k_compliance => On => On
zend.ze1_compatibility_mode => Off => Off
bcmath
BCMath support => enabled
calendar
Calendar support => enabled
ctype
ctype functions => enabled
curl
CURL support => enabled
CURL Information => libcurl/7.12.0 OpenSSL/0.9.7a ipv6 zlib/1.2.1.2
dom
DOM/XML => enabled
DOM/XML API Version => 20031129
libxml Version => 2.6.11
HTML Support => enabled
XPath Support => enabled
XPointer Support => enabled
Schema Support => enabled
RelaxNG Support => enabled
exif
EXIF Support => enabled
EXIF Version => 1.4 $Id: exif.c,v 1.162.2.2 2004/11/10 01:44:28 iliaa Exp $
Supported EXIF Version => 0220
Supported filetypes => JPEG,TIFF
ftp
FTP support => enabled
gd
GD Support => enabled
GD Version => bundled (2.0.28 compatible)
FreeType Support => enabled
FreeType Linkage => with freetype
FreeType Version => 2.1.7
GIF Read Support => enabled
GIF Create Support => enabled
JPG Support => enabled
PNG Support => enabled
WBMP Support => enabled
XPM Support => enabled
XBM Support => enabled
gettext
GetText Support => enabled
iconv
iconv support => enabled
iconv implementation => glibc
iconv library version => 2.3.3
Directive => Local Value => Master Value
iconv.input_encoding => ISO-8859-1 => ISO-8859-1
iconv.internal_encoding => ISO-8859-1 => ISO-8859-1
iconv.output_encoding => ISO-8859-1 => ISO-8859-1
imap
IMAP c-Client Version => 2001
SSL Support => enabled
Kerberos Support => enabled
libxml
libXML support => active
libXML Version => 2.6.11
libXML streams => enabled
mbstring
Multibyte Support => enabled
Multibyte string engine => libmbfl
Multibyte (japanese) regex support => enabled
Multibyte regex (oniguruma) version => 2.2.4
mbstring extension makes use of "streamable kanji code filter and converter", which is
distributed under the GNU Lesser General Public License version 2.1.
Directive => Local Value => Master Value
mbstring.detect_order => no value => no value
mbstring.encoding_translation => Off => Off
mbstring.func_overload => 0 => 0
mbstring.http_input => pass => pass
mbstring.http_output => pass => pass
mbstring.internal_encoding => ISO-8859-1 => no value
mbstring.language => neutral => neutral
mbstring.substitute_character => no value => no value
mcrypt
mcrypt support => enabled
Version => 2.5.7
Api No => 20021217
Supported ciphers => cast-128 gost rijndael-128 twofish arcfour cast-256 loki97 rijndael-192
saferplus wake blowfish-compat des rijndael-256 serpent xtea blowfish enigma rc2 tripledes
Supported modes => cbc cfb ctr ecb ncfb nofb ofb stream
Directive => Local Value => Master Value
mcrypt.algorithms_dir => no value => no value
mcrypt.modes_dir => no value => no value
mhash
MHASH support => Enabled
MHASH API Version => 20020524
mysql
MySQL Support => enabled
Active Persistent Links => 0
Active Links => 0
Client API version => 4.0.23
MYSQL_MODULE_TYPE => external
MYSQL_SOCKET => /var/lib/mysql/mysql.sock
MYSQL_INCLUDE => -I/usr/include/mysql
MYSQL_LIBS => -L/usr/lib -lmysqlclient
Directive => Local Value => Master Value
mysql.allow_persistent => On => On
mysql.connect_timeout => 60 => 60
mysql.default_host => no value => no value
mysql.default_password => no value => no value
mysql.default_port => no value => no value
mysql.default_socket => no value => no value
mysql.default_user => no value => no value
mysql.max_links => Unlimited => Unlimited
mysql.max_persistent => Unlimited => Unlimited
mysql.trace_mode => Off => Off
openssl
OpenSSL support => enabled
OpenSSL Version => OpenSSL 0.9.7a Feb 19 2003
pcre
PCRE (Perl Compatible Regular Expressions) Support => enabled
PCRE Library Version => 4.5 01-December-2003
posix
Revision => $Revision: 1.60 $
pspell
PSpell Support => enabled
session
Session Support => enabled
Registered save handlers => files user sqlite
Registered serializer handlers => php php_binary wddx
Directive => Local Value => Master Value
session.auto_start => Off => Off
session.bug_compat_42 => On => On
session.bug_compat_warn => On => On
session.cache_expire => 180 => 180
session.cache_limiter => nocache => nocache
session.cookie_domain => no value => no value
session.cookie_lifetime => 0 => 0
session.cookie_path => / => /
session.cookie_secure => Off => Off
session.entropy_file => no value => no value
session.entropy_length => 0 => 0
session.gc_divisor => 100 => 100
session.gc_maxlifetime => 1440 => 1440
session.gc_probability => 1 => 1
session.hash_bits_per_character => 4 => 4
session.hash_function => 0 => 0
session.name => PHPSESSID => PHPSESSID
session.referer_check => no value => no value
session.save_handler => files => files
session.save_path => no value => no value
session.serialize_handler => php => php
session.use_cookies => On => On
session.use_only_cookies => Off => Off
session.use_trans_sid => 0 => 0
SimpleXML
Simplexml support => enabled
Revision => $Revision: 1.139.2.4 $
Schema support => enabled
sockets
Sockets Support => enabled
SPL
SPL support => enabled
Interfaces => RecursiveIterator, SeekableIterator
Classes => ArrayObject, ArrayIterator, CachingIterator, CachingRecursiveIterator,
DirectoryIterator, FilterIterator, LimitIterator, ParentIterator, RecursiveDirectoryIterator,
RecursiveIteratorIterator, SimpleXMLIterator
SQLite
SQLite support => enabled
PECL Module version => 2.0-dev $Id: sqlite.c,v 1.146.2.3 2004/09/26 01:41:40 wez Exp $
SQLite Library => 2.8.14
SQLite Encoding => iso8859
Directive => Local Value => Master Value
sqlite.assoc_case => 0 => 0
standard
Regex Library => Bundled library enabled
Dynamic Library Support => enabled
Path to sendmail => /usr/sbin/sendmail -t -i
Directive => Local Value => Master Value
assert.active => 1 => 1
assert.bail => 0 => 0
assert.callback => no value => no value
assert.quiet_eval => 0 => 0
assert.warning => 1 => 1
auto_detect_line_endings => 0 => 0
date.default_latitude => 31.7667 => 31.7667
date.default_longitude => 35.2333 => 35.2333
date.sunrise_zenith => 90.83 => 90.83
date.sunset_zenith => 90.83 => 90.83
default_socket_timeout => 60 => 60
safe_mode_allowed_env_vars => PHP_ => PHP_
safe_mode_protected_env_vars => LD_LIBRARY_PATH => LD_LIBRARY_PATH
url_rewriter.tags => a=href,area=href,frame=src,form=,fieldset= =>
a=href,area=href,frame=src,form=,fieldset=
user_agent => no value => no value
tokenizer
Tokenizer Support => enabled
wddx
WDDX Support => enabled
WDDX Session Serializer => enabled
xml
XML Support => active
XML Namespace Support => active
libxml2 Version => 2.6.11
xmlrpc
core library version => xmlrpc-epi v. 0.51
php extension version => 0.51
author => Dan Libby
homepage => http://xmlrpc-epi.sourceforge.net
open sourced by => Epinions.com
zlib
ZLib Support => enabled
Compiled Version => 1.2.1.2
Linked Version => 1.2.1.2
Directive => Local Value => Master Value
zlib.output_compression => Off => Off
zlib.output_compression_level => -1 => -1
zlib.output_handler => no value => no value
Additional Modules
Module Name
Environment
Variable => Value
HOSTNAME => serwer1.odi-serwer.info
TEST_PHP_SRCDIR => /usr/local/src/php-5.0.3
SHELL => /bin/sh
TERM => xterm
MAKEFLAGS =>
HISTSIZE => 1000
SSH_CLIENT => deleted
SSH_TTY => deleted
USER => odi
LS_COLORS =>
no=00:fi=00:di=01;34:ln=01;36:pi=40;33:so=01;35:do=01;35:bd=40;33;01:cd=40;33;01:or=40;31;01:ex=01;32:*.tar=01;31:*.tgz=01;31:*.arj=01;31:*.taz=01;31:*.lzh=01;31:*.zip=01;31:*.z=01;31:*.Z=01;31:*.gz=01;31:*.bz2=01;31:*.deb=01;31:*.rpm=01;31:*.jar=01;31:*.jpg=01;35:*.jpeg=01;35:*.gif=01;35:*.bmp=01;35:*.pbm=01;35:*.pgm=01;35:*.ppm=01;35:*.tga=01;35:*.xbm=01;35:*.xpm=01;35:*.tif=01;35:*.tiff=01;35:*.png=01;35:*.mov=01;35:*.mpg=01;35:*.mpeg=01;35:*.avi=01;35:*.fli=01;35:*.gl=01;35:*.dl=01;35:*.xcf=01;35:*.xwd=01;35:*.ogg=01;35:*.mp3=01;35:*.wav=01;35:
SCRIPT_FILENAME =>
SSH_AUTH_SOCK => deleted
MAKELEVEL => 1
MFLAGS =>
PATH =>
/usr/local/jdk/bin:/usr/kerberos/bin:/usr/local/bin:/bin:/usr/bin:/usr/X11R6/bin:/usr/local/bin:/usr/X11R6/bin
MAIL => /var/spool/mail/odi
_ => /usr/local/src/php-5.0.3/sapi/cli/php
PWD => /usr/local/src/php-5.0.3
INPUTRC => /etc/inputrc
JAVA_HOME => /usr/local/jdk
EDITOR => pico
LANG => en_US.UTF-8
TEST_PHP_EXECUTABLE => /usr/local/src/php-5.0.3/sapi/cli/php
REDIRECT_STATUS =>
PATH_TRANSLATED =>
HOME => /root
SHLVL => 4
CONTENT_LENGTH =>
LS_OPTIONS => --color=tty -F -a -b -T 0
LOGNAME => odi
QUERY_STRING =>
VISUAL => pico
SSH_CONNECTION => ::ffff:192.168.32.8 2612 ::ffff:83.16.122.21 59184
CLASSPATH => .:/usr/local/jdk/lib/classes.zip
LESSOPEN => |/usr/bin/lesspipe.sh %s
CONTENT_TYPE =>
CC => gcc
REQUEST_METHOD =>
G_BROKEN_FILENAMES => 1
PHP Variables
Variable => Value
_SERVER["HOSTNAME"] => serwer1.odi-serwer.info
_SERVER["TEST_PHP_SRCDIR"] => /usr/local/src/php-5.0.3
_SERVER["SHELL"] => /bin/sh
_SERVER["TERM"] => xterm
_SERVER["MAKEFLAGS"] =>
_SERVER["HISTSIZE"] => 1000
_SERVER["SSH_CLIENT"] => deleted
_SERVER["SSH_TTY"] => deleted
_SERVER["USER"] => odi
_SERVER["LS_COLORS"] =>
no=00:fi=00:di=01;34:ln=01;36:pi=40;33:so=01;35:do=01;35:bd=40;33;01:cd=40;33;01:or=40;31;01:ex=01;32:*.tar=01;31:*.tgz=01;31:*.arj=01;31:*.taz=01;31:*.lzh=01;31:*.zip=01;31:*.z=01;31:*.Z=01;31:*.gz=01;31:*.bz2=01;31:*.deb=01;31:*.rpm=01;31:*.jar=01;31:*.jpg=01;35:*.jpeg=01;35:*.gif=01;35:*.bmp=01;35:*.pbm=01;35:*.pgm=01;35:*.ppm=01;35:*.tga=01;35:*.xbm=01;35:*.xpm=01;35:*.tif=01;35:*.tiff=01;35:*.png=01;35:*.mov=01;35:*.mpg=01;35:*.mpeg=01;35:*.avi=01;35:*.fli=01;35:*.gl=01;35:*.dl=01;35:*.xcf=01;35:*.xwd=01;35:*.ogg=01;35:*.mp3=01;35:*.wav=01;35:
_SERVER["SCRIPT_FILENAME"] =>
_SERVER["SSH_AUTH_SOCK"] => deleted
_SERVER["MAKELEVEL"] => 1
_SERVER["MFLAGS"] =>
_SERVER["PATH"] =>
/usr/local/jdk/bin:/usr/kerberos/bin:/usr/local/bin:/bin:/usr/bin:/usr/X11R6/bin:/usr/local/bin:/usr/X11R6/bin
_SERVER["MAIL"] => /var/spool/mail/odi
_SERVER["_"] => /usr/local/src/php-5.0.3/sapi/cli/php
_SERVER["PWD"] => /usr/local/src/php-5.0.3
_SERVER["INPUTRC"] => /etc/inputrc
_SERVER["JAVA_HOME"] => /usr/local/jdk
_SERVER["EDITOR"] => pico
_SERVER["LANG"] => en_US.UTF-8
_SERVER["TEST_PHP_EXECUTABLE"] => /usr/local/src/php-5.0.3/sapi/cli/php
_SERVER["REDIRECT_STATUS"] =>
_SERVER["PATH_TRANSLATED"] =>
_SERVER["HOME"] => /root
_SERVER["SHLVL"] => 4
_SERVER["CONTENT_LENGTH"] =>
_SERVER["LS_OPTIONS"] => --color=tty -F -a -b -T 0
_SERVER["LOGNAME"] => odi
_SERVER["QUERY_STRING"] =>
_SERVER["VISUAL"] => pico
_SERVER["SSH_CONNECTION"] => ::ffff:192.168.32.8 2612 ::ffff:83.16.122.21 59184
_SERVER["CLASSPATH"] => .:/usr/local/jdk/lib/classes.zip
_SERVER["LESSOPEN"] => |/usr/bin/lesspipe.sh %s
_SERVER["CONTENT_TYPE"] =>
_SERVER["CC"] => gcc
_SERVER["REQUEST_METHOD"] =>
_SERVER["G_BROKEN_FILENAMES"] => 1
_SERVER["PHP_SELF"] =>
_SERVER["SCRIPT_NAME"] =>
_SERVER["DOCUMENT_ROOT"] =>
_SERVER["argv"] => Array
(
)
_SERVER["argc"] => 0
_ENV["HOSTNAME"] => serwer1.odi-serwer.info
_ENV["TEST_PHP_SRCDIR"] => /usr/local/src/php-5.0.3
_ENV["SHELL"] => /bin/sh
_ENV["TERM"] => xterm
_ENV["MAKEFLAGS"] =>
_ENV["HISTSIZE"] => 1000
_ENV["SSH_CLIENT"] => deleted
_ENV["SSH_TTY"] => deleted
_ENV["USER"] => odi
_ENV["LS_COLORS"] =>
no=00:fi=00:di=01;34:ln=01;36:pi=40;33:so=01;35:do=01;35:bd=40;33;01:cd=40;33;01:or=40;31;01:ex=01;32:*.tar=01;31:*.tgz=01;31:*.arj=01;31:*.taz=01;31:*.lzh=01;31:*.zip=01;31:*.z=01;31:*.Z=01;31:*.gz=01;31:*.bz2=01;31:*.deb=01;31:*.rpm=01;31:*.jar=01;31:*.jpg=01;35:*.jpeg=01;35:*.gif=01;35:*.bmp=01;35:*.pbm=01;35:*.pgm=01;35:*.ppm=01;35:*.tga=01;35:*.xbm=01;35:*.xpm=01;35:*.tif=01;35:*.tiff=01;35:*.png=01;35:*.mov=01;35:*.mpg=01;35:*.mpeg=01;35:*.avi=01;35:*.fli=01;35:*.gl=01;35:*.dl=01;35:*.xcf=01;35:*.xwd=01;35:*.ogg=01;35:*.mp3=01;35:*.wav=01;35:
_ENV["SCRIPT_FILENAME"] =>
_ENV["SSH_AUTH_SOCK"] => deleted
_ENV["MAKELEVEL"] => 1
_ENV["MFLAGS"] =>
_ENV["PATH"] =>
/usr/local/jdk/bin:/usr/kerberos/bin:/usr/local/bin:/bin:/usr/bin:/usr/X11R6/bin:/usr/local/bin:/usr/X11R6/bin
_ENV["MAIL"] => /var/spool/mail/odi
_ENV["_"] => /usr/local/src/php-5.0.3/sapi/cli/php
_ENV["PWD"] => /usr/local/src/php-5.0.3
_ENV["INPUTRC"] => /etc/inputrc
_ENV["JAVA_HOME"] => /usr/local/jdk
_ENV["EDITOR"] => pico
_ENV["LANG"] => en_US.UTF-8
_ENV["TEST_PHP_EXECUTABLE"] => /usr/local/src/php-5.0.3/sapi/cli/php
_ENV["REDIRECT_STATUS"] =>
_ENV["PATH_TRANSLATED"] =>
_ENV["HOME"] => /root
_ENV["SHLVL"] => 4
_ENV["CONTENT_LENGTH"] =>
_ENV["LS_OPTIONS"] => --color=tty -F -a -b -T 0
_ENV["LOGNAME"] => odi
_ENV["QUERY_STRING"] =>
_ENV["VISUAL"] => pico
_ENV["SSH_CONNECTION"] => ::ffff:192.168.32.8 2612 ::ffff:83.16.122.21 59184
_ENV["CLASSPATH"] => .:/usr/local/jdk/lib/classes.zip
_ENV["LESSOPEN"] => |/usr/bin/lesspipe.sh %s
_ENV["CONTENT_TYPE"] =>
_ENV["CC"] => gcc
_ENV["REQUEST_METHOD"] =>
_ENV["G_BROKEN_FILENAMES"] => 1
PHP License
This program is free software; you can redistribute it and/or modify
it under the terms of the PHP License as published by the PHP Group
and included in the distribution in the file: LICENSE
This program is distributed in the hope that it will be useful,
but WITHOUT ANY WARRANTY; without even the implied warranty of
MERCHANTABILITY or FITNESS FOR A PARTICULAR PURPOSE.
If you did not receive a copy of the PHP license, or have any
questions about PHP licensing, please contact license@php.net.