Test results for 5.0.3 [failed]

From: Date: Fri, 18 Feb 2005 08:22:57 +0000
Subject: Test results for 5.0.3 [failed]
Groups: php.qa 
Request: Send a blank email to php-qa+get-23754@lists.php.net to get a copy of this message
===================================================================== FAILED TEST SUMMARY --------------------------------------------------------------------- Test for buffering in core functions with implicit flush off [tests/func/008.phpt] Convert warnings to exceptions [tests/lang/038.phpt] Bug #22836 (returning references to NULL) [Zend/tests/bug22836.phpt] Bug #28444 (Cannot access undefined property for object with overloaded property access) [Zend/tests/bug28444.phpt] Test 3: Exception Test [ext/dom/tests/dom003.phpt] iconv stream filter [ext/iconv/tests/iconv_stream_filter.phpt] Ming: Simple SWFAction() test [ext/ming/tests/swfaction.phpt] Bug #29992 (foreach by reference corrupts the array) [ext/standard/tests/array/bug29992.phpt] Bug #24142 (round() problems) [ext/standard/tests/math/bug24142.phpt] Bug #25694 (round() and number_format() inconsistency) [ext/standard/tests/math/bug25694.phpt] Bug #20382 (strtotime ("Monday", $date) produces wrong result on DST changeover) [ext/standard/tests/time/bug20382.phpt] Bug #26614 (CDATA sections skipped on line count) [ext/xml/tests/bug26614.phpt] ===================================================================== ===================================================================== TEST RESULT SUMMARY --------------------------------------------------------------------- Exts skipped : 58 Exts tested : 25 --------------------------------------------------------------------- Number of tests : 1291 643 Tests skipped : 648 (50.2%) -------- Tests warned : 0 (0.0%) (0.0%) Tests failed : 12 (0.9%) (1.9%) Tests passed : 631 (48.9%) (98.1%) --------------------------------------------------------------------- Time taken : 145 seconds ===================================================================== ===================================================================== FAILED TEST SUMMARY --------------------------------------------------------------------- Test for buffering in core functions with implicit flush off [tests/func/008.phpt] Convert warnings to exceptions [tests/lang/038.phpt] Bug #22836 (returning references to NULL) [Zend/tests/bug22836.phpt] Bug #28444 (Cannot access undefined property for object with overloaded property access) [Zend/tests/bug28444.phpt] Test 3: Exception Test [ext/dom/tests/dom003.phpt] iconv stream filter [ext/iconv/tests/iconv_stream_filter.phpt] Ming: Simple SWFAction() test [ext/ming/tests/swfaction.phpt] Bug #29992 (foreach by reference corrupts the array) [ext/standard/tests/array/bug29992.phpt] Bug #24142 (round() problems) [ext/standard/tests/math/bug24142.phpt] Bug #25694 (round() and number_format() inconsistency) [ext/standard/tests/math/bug25694.phpt] Bug #20382 (strtotime ("Monday", $date) produces wrong result on DST changeover) [ext/standard/tests/time/bug20382.phpt] Bug #26614 (CDATA sections skipped on line count) [ext/xml/tests/bug26614.phpt] ===================================================================== ================================================================================ /root/lamp/php-5.0.3/tests/func/008.phpt ================================================================================ ---- EXPECTED OUTPUT 'foo1' 'foo2' ---- ACTUAL OUTPUT ---- FAILED ================================================================================ 001- 'foo1' 003- 'foo2' ================================================================================ ================================================================================ /root/lamp/php-5.0.3/tests/lang/038.phpt ================================================================================ ---- EXPECTED OUTPUT string(15) "Error2Exception" string(5) "fopen" ===DONE=== ---- ACTUAL OUTPUT string(15) "Error2Exception" string(15) "Error2Exception" ===DONE=== ---- FAILED ================================================================================ 002+ string(15) "Error2Exception" 002- string(5) "fopen" ================================================================================ ================================================================================ /root/lamp/php-5.0.3/Zend/tests/bug22836.phpt ================================================================================ ---- EXPECTED OUTPUT string(3) "foo" 'foo' Notice: Undefined variable: a in %s on line %d Strict Standards: Only variable references should be returned by reference in %s on line %d string(3) "foo" 'foo' Notice: Undefined variable: a in %s on line %d Strict Standards: Only variable references should be returned by reference in %s on line %d string(3) "foo" 'foo' Notice: Undefined variable: a in %s on line %d Strict Standards: Only variable references should be returned by reference in %s on line %d string(3) "foo" 'foo' Notice: Undefined variable: a in %s on line %d Strict Standards: Only variable references should be returned by reference in %s on line %d string(3) "foo" 'foo' Notice: Undefined variable: a in %s on line %d Strict Standards: Only variable references should be returned by reference in %s on line %d string(3) "foo" 'foo' Notice: Undefined variable: a in %s on line %d Strict Standards: Only variable references should be returned by reference in %s on line %d string(3) "foo" 'foo' Notice: Undefined variable: a in %s on line %d Strict Standards: Only variable references should be returned by reference in %s on line %d string(3) "foo" 'foo' Notice: Undefined variable: a in %s on line %d Strict Standards: Only variable references should be returned by reference in %s on line %d string(3) "foo" 'foo' Notice: Undefined variable: a in %s on line %d Strict Standards: Only variable references should be returned by reference in %s on line %d ---- ACTUAL OUTPUT string(3) "foo" 'foo' Notice: Undefined variable: a in /root/lamp/php-5.0.3/Zend/tests/bug22836.php on line 7 Strict Standards: Only variable references should be returned by reference in /root/lamp/php-5.0.3/Zend/tests/bug22836.php on line 7 string(3) "foo" 'foo' Notice: Undefined variable: a in /root/lamp/php-5.0.3/Zend/tests/bug22836.php on line 7 Strict Standards: Only variable references should be returned by reference in /root/lamp/php-5.0.3/Zend/tests/bug22836.php on line 7 NULL 'foo' Notice: Undefined variable: a in /root/lamp/php-5.0.3/Zend/tests/bug22836.php on line 7 NULL 'foo' Notice: Undefined variable: a in /root/lamp/php-5.0.3/Zend/tests/bug22836.php on line 7 NULL 'foo' Notice: Undefined variable: a in /root/lamp/php-5.0.3/Zend/tests/bug22836.php on line 7 NULL 'foo' Notice: Undefined variable: a in /root/lamp/php-5.0.3/Zend/tests/bug22836.php on line 7 NULL 'foo' Notice: Undefined variable: a in /root/lamp/php-5.0.3/Zend/tests/bug22836.php on line 7 NULL 'foo' Notice: Undefined variable: a in /root/lamp/php-5.0.3/Zend/tests/bug22836.php on line 7 ---- FAILED ================================================================================ 013+ NULL 013- string(3) "foo" 017+ NULL 018+ 'foo' 018- Strict Standards: Only variable references should be returned by reference in %s on line %d 019- string(3) "foo" 020+ Notice: Undefined variable: a in /root/lamp/php-5.0.3/Zend/tests/bug22836.php on line 7 021+ NULL 022+ 'foo' 023+ 024+ Notice: Undefined variable: a in /root/lamp/php-5.0.3/Zend/tests/bug22836.php on line 7 025+ NULL 026+ 'foo' 027+ 028+ Notice: Undefined variable: a in /root/lamp/php-5.0.3/Zend/tests/bug22836.php on line 7 029+ NULL 030+ 'foo' 031+ 032+ Notice: Undefined variable: a in /root/lamp/php-5.0.3/Zend/tests/bug22836.php on line 7 033+ NULL 023- 024- Strict Standards: Only variable references should be returned by reference in %s on line %d 025- string(3) "foo" 026- 'foo' 027- 028- Notice: Undefined variable: a in %s on line %d 029- 030- Strict Standards: Only variable references should be returned by reference in %s on line %d 031- string(3) "foo" 032- 'foo' 033- 034- Notice: Undefined variable: a in %s on line %d 035- 036- Strict Standards: Only variable references should be returned by reference in %s on line %d 037- string(3) "foo" 038- 'foo' 039- 040- Notice: Undefined variable: a in %s on line %d 041- 042- Strict Standards: Only variable references should be returned by reference in %s on line %d 043- string(3) "foo" 044- 'foo' 045- 046- Notice: Undefined variable: a in %s on line %d 047- 048- Strict Standards: Only variable references should be returned by reference in %s on line %d 049- string(3) "foo" 050- 'foo' 051- 052- Notice: Undefined variable: a in %s on line %d 053- 054- Strict Standards: Only variable references should be returned by reference in %s on line %d ================================================================================ ================================================================================ /root/lamp/php-5.0.3/Zend/tests/bug28444.phpt ================================================================================ ---- EXPECTED OUTPUT object(Object)#%d (1) { ["x"]=> int(2) } int(2) int(3) Overloaded::__set(y,3) int(3) Overloaded::__get(y) int(3) Overloaded::__set(z,Object id #3) object(Object)#%d (1) { ["x"]=> int(4) } Overloaded::__get(z) int(4) Overloaded::__get(z) int(5) Overloaded::__get(z) int(6) ===DONE=== ---- ACTUAL OUTPUT object(Object)#2 (1) { ["x"]=> int(2) } int(2) int(3) Overloaded::__set(y,3) int(3) Overloaded::__get(y) int(3) Overloaded::__set(z,Object id #3) object(Object)#3 (1) { ["x"]=> int(4) } Overloaded::__get(z) int(4) Overloaded::__get(z) int(5) Fatal error: Cannot access undefined property for object with overloaded property access in /root/lamp/php-5.0.3/Zend/tests/bug28444.php on line 45 ---- FAILED ================================================================================ 020+ 021+ Fatal error: Cannot access undefined property for object with overloaded property access in /root/lamp/php-5.0.3/Zend/tests/bug28444.php on line 45 020- Overloaded::__get(z) 021- int(6) 022- ===DONE=== ================================================================================ ================================================================================ /root/lamp/php-5.0.3/ext/dom/tests/dom003.phpt ================================================================================ ---- EXPECTED OUTPUT --- Catch exception with try/catch object(DOMException)#%d (6) { ["message:protected"]=> string(23) "Hierarchy Request Error" ["string:private"]=> string(0) "" ["file:protected"]=> string(%d) "%s/ext/dom/tests/dom003.php" ["line:protected"]=> int(8) ["trace:private"]=> array(0) { } ["code"]=> int(3) } --- Don't catch exception with try/catch Fatal error: Uncaught exception 'DOMException' with message 'Hierarchy Request Error' in %sdom003.php:%d Stack trace: #0 {main} thrown in %sdom003.php on line %d ---- ACTUAL OUTPUT --- Catch exception with try/catch object(DOMException)#3 (6) { ["message:protected"]=> string(23) "Hierarchy Request Error" ["string:private"]=> string(0) "" ["file:protected"]=> string(45) "/root/lamp/php-5.0.3/ext/dom/tests/dom003.php" ["line:protected"]=> int(8) ["trace:private"]=> array(1) { [0]=> array(6) { ["file"]=> string(45) "/root/lamp/php-5.0.3/ext/dom/tests/dom003.php" ["line"]=> int(8) ["function"]=> string(11) "appendChild" ["class"]=> string(10) "DOMElement" ["type"]=> string(2) "->" ["args"]=> array(1) { [0]=> object(DOMElement)#2 (0) { } } } } ["code"]=> int(3) } --- Don't catch exception with try/catch Fatal error: Uncaught exception 'DOMException' with message 'Hierarchy Request Error' in /root/lamp/php-5.0.3/ext/dom/tests/dom003.php:13 Stack trace: #0 /root/lamp/php-5.0.3/ext/dom/tests/dom003.php(13): DOMElement->appendChild(Object(DOMElement)) #1 {main} thrown in /root/lamp/php-5.0.3/ext/dom/tests/dom003.php on line 13 ---- FAILED ================================================================================ 012+ array(1) { 013+ [0]=> 014+ array(6) { 015+ ["file"]=> 016+ string(45) "/root/lamp/php-5.0.3/ext/dom/tests/dom003.php" 017+ ["line"]=> 018+ int(8) 019+ ["function"]=> 020+ string(11) "appendChild" 021+ ["class"]=> 022+ string(10) "DOMElement" 012- array(0) { 013- } 014- ["code"]=> 015- int(3) 016- } 017- --- Don't catch exception with try/catch 018- 019- Fatal error: Uncaught exception 'DOMException' with message 'Hierarchy Request Error' in %sdom003.php:%d 020- Stack trace: 021- #0 {main} 022- thrown in %sdom003.php on line %d 023+ ["type"]=> 024+ string(2) "->" 025+ ["args"]=> 026+ array(1) { 027+ [0]=> 028+ object(DOMElement)#2 (0) { 029+ } 030+ } 031+ } 032+ } 033+ ["code"]=> 034+ int(3) 035+ } 036+ --- Don't catch exception with try/catch 037+ 038+ Fatal error: Uncaught exception 'DOMException' with message 'Hierarchy Request Error' in /root/lamp/php-5.0.3/ext/dom/tests/dom003.php:13 039+ Stack trace: 040+ #0 /root/lamp/php-5.0.3/ext/dom/tests/dom003.php(13): DOMElement->appendChild(Object(DOMElement)) 041+ #1 {main} 042+ thrown in /root/lamp/php-5.0.3/ext/dom/tests/dom003.php on line 13 ================================================================================ ================================================================================ /root/lamp/php-5.0.3/ext/iconv/tests/iconv_stream_filter.phpt ================================================================================ ---- EXPECTED OUTPUT string(20) "1b244224332473244b24" string(10) "41244f1b28" string(2) "42" string(20) "a4b3a4f3a4cba4c1a4cf" string(10) "69636f6e76" string(2) "0a" Warning: fread(): iconv stream filter ("ISO-2022-JP"=>"EUC-JP"): invalid multibyte sequence in %s on line %d string(0) "" string(0) "" string(0) "" ---- ACTUAL OUTPUT string(20) "1b244224332473244b24" string(10) "41244f1b28" string(2) "42" string(20) "a4b3a4f3a4cba4c1a4cf" string(10) "69636f6e76" string(2) "0a" string(20) "1b244f24332466245824" string(10) "4e24421b28" string(2) "4f" ---- FAILED ================================================================================ 007+ string(20) "1b244f24332466245824" 008+ string(10) "4e24421b28" 009+ string(2) "4f" 007- 008- Warning: fread(): iconv stream filter ("ISO-2022-JP"=>"EUC-JP"): invalid multibyte sequence in %s on line %d 009- string(0) "" 010- string(0) "" 011- string(0) "" ================================================================================ ================================================================================ /root/lamp/php-5.0.3/ext/ming/tests/swfaction.phpt ================================================================================ ---- EXPECTED OUTPUT 9e47538692393b9915faf3fc7e686cd5 ---- ACTUAL OUTPUT d0f09a7b6a14d3fe6d570367deb38633 ---- FAILED ================================================================================ 001+ d0f09a7b6a14d3fe6d570367deb38633 001- 9e47538692393b9915faf3fc7e686cd5 ================================================================================ ================================================================================ /root/lamp/php-5.0.3/ext/standard/tests/array/bug29992.phpt ================================================================================ ---- EXPECTED OUTPUT Array ( [0] => 1 [1] => 2 [2] => 3 ) int(1) int(2) int(3) int(1) int(2) int(3) int(1) int(2) int(3) int(1) int(2) int(3) Array ( [0] => 1 [1] => 2 [2] => 3 ) ===DONE=== ---- ACTUAL OUTPUT Array ( [0] => 1 [1] => 2 [2] => 3 ) int(1) int(2) int(3) int(1) int(2) int(3) int(1) int(2) int(3) int(1) int(2) int(2) Array ( [0] => 1 [1] => 2 [2] => 2 ) ===DONE=== ---- FAILED ================================================================================ 018+ int(2) 018- int(3) 023+ [2] => 2 023- [2] => 3 ================================================================================ ================================================================================ /root/lamp/php-5.0.3/ext/standard/tests/math/bug24142.phpt ================================================================================ ---- EXPECTED OUTPUT round(0.005, 2) -> 0.01 round(0.015, 2) -> 0.02 round(0.025, 2) -> 0.03 round(0.035, 2) -> 0.04 round(0.045, 2) -> 0.05 round(0.055, 2) -> 0.06 round(0.065, 2) -> 0.07 round(0.075, 2) -> 0.08 round(0.085, 2) -> 0.09 ---- ACTUAL OUTPUT round(0.005, 2) -> 0.01 round(0.015, 2) -> 0.01 round(0.025, 2) -> 0.03 round(0.035, 2) -> 0.04 round(0.045, 2) -> 0.05 round(0.055, 2) -> 0.06 round(0.065, 2) -> 0.07 round(0.075, 2) -> 0.07 round(0.085, 2) -> 0.08 ---- FAILED ================================================================================ 002+ round(0.015, 2) -> 0.01 002- round(0.015, 2) -> 0.02 008+ round(0.075, 2) -> 0.07 009+ round(0.085, 2) -> 0.08 008- round(0.075, 2) -> 0.08 009- round(0.085, 2) -> 0.09 ================================================================================ ================================================================================ /root/lamp/php-5.0.3/ext/standard/tests/math/bug25694.phpt ================================================================================ ---- EXPECTED OUTPUT round 0.045 = 0.05 number format 0.045 = 0.05 round 0.055 = 0.06 number format 0.055 = 0.06 round 5.045 = 5.05 number format 5.045 = 5.05 round 5.055 = 5.06 number format 5.055 = 5.06 round 3.025 = 3.03 number format 3.025 = 3.03 round 4.025 = 4.03 number format 4.025 = 4.03 ---- ACTUAL OUTPUT round 0.045 = 0.04 number format 0.045 = 0.04 round 0.055 = 0.06 number format 0.055 = 0.06 round 5.045 = 5.04 number format 5.045 = 5.04 round 5.055 = 5.05 number format 5.055 = 5.05 round 3.025 = 3.02 number format 3.025 = 3.02 round 4.025 = 4.03 number format 4.025 = 4.03 ---- FAILED ================================================================================ 001+ round 0.045 = 0.04 002+ number format 0.045 = 0.04 001- round 0.045 = 0.05 002- number format 0.045 = 0.05 007+ round 5.045 = 5.04 008+ number format 5.045 = 5.04 009+ 010+ round 5.055 = 5.05 011+ number format 5.055 = 5.05 012+ 013+ round 3.025 = 3.02 014+ number format 3.025 = 3.02 007- round 5.045 = 5.05 008- number format 5.045 = 5.05 010- round 5.055 = 5.06 011- number format 5.055 = 5.06 012- 013- round 3.025 = 3.03 014- number format 3.025 = 3.03 015- ================================================================================ ================================================================================ /root/lamp/php-5.0.3/ext/standard/tests/time/bug20382.phpt ================================================================================ ---- EXPECTED OUTPUT tStamp=Wednesday 2004-10-27 17:17:17 CEST result=Monday 2004-11-01 00:00:00 CET wanted=Monday 2004-11-01 00:00:00 CET ---- ACTUAL OUTPUT tStamp=Wednesday 2004-10-27 17:17:17 CEST result=Sunday 2004-10-31 23:00:00 CET wanted=Monday 2004-11-01 00:00:00 CET ---- FAILED ================================================================================ 002+ result=Sunday 2004-10-31 23:00:00 CET 002- result=Monday 2004-11-01 00:00:00 CET ================================================================================ ================================================================================ /root/lamp/php-5.0.3/ext/xml/tests/bug26614.phpt ================================================================================ ---- EXPECTED OUTPUT CDATA <DATA> at line 2, col 0 (byte 45) </DATA> at line 9, col 0 (byte 90) Comment <DATA> at line 2, col 0 (byte 45) </DATA> at line 9, col 0 (byte 90) Text <DATA> at line 2, col 0 (byte 45) </DATA> at line 9, col 0 (byte 90) ---- ACTUAL OUTPUT CDATA <DATA> at line 2, col 6 (byte 9) </DATA> at line 9, col 7 (byte 56) Comment <DATA> at line 2, col 6 (byte 9) </DATA> at line 9, col 7 (byte 56) Text <DATA> at line 2, col 6 (byte 9) </DATA> at line 9, col 10 (byte 56) ---- FAILED ================================================================================ 002+ <DATA> at line 2, col 6 (byte 9) 003+ </DATA> at line 9, col 7 (byte 56) 002- <DATA> at line 2, col 0 (byte 45) 003- </DATA> at line 9, col 0 (byte 90) 005+ <DATA> at line 2, col 6 (byte 9) 006+ </DATA> at line 9, col 7 (byte 56) 005- <DATA> at line 2, col 0 (byte 45) 006- </DATA> at line 9, col 0 (byte 90) 008+ <DATA> at line 2, col 6 (byte 9) 009+ </DATA> at line 9, col 10 (byte 56) 008- <DATA> at line 2, col 0 (byte 45) 009- </DATA> at line 9, col 0 (byte 90) ================================================================================ ================================================================================ BUILD ENVIRONMENT ================================================================================ OS: Linux - Linux localhost 2.6.8.1-24mdksmp #1 SMP Thu Jan 13 23:11:43 MST 2005 i686 Automake: Autoconf: Bundled Libtool: ltmain.sh (GNU libtool) 1.4.3 (1.922.2.110 2002/10/23 01:39:54) System Libtool: ltmain.sh (GNU libtool) 1.5.6 (1.1220.2.95 2004/04/11 05:50:42) Copyright (C) 2003 Free Software Foundation, Inc. This is free software; see the source for copying conditions. There is NO warranty; not even for MERCHANTABILITY or FITNESS FOR A PARTICULAR PURPOSE. Compiler: Reading specs from /usr/lib/gcc/i586-mandrake-linux-gnu/3.4.1/specs Configured with: ../configure --prefix=/usr --libdir=/usr/lib --with-slibdir=/lib --mandir=/usr/share/man --infodir=/usr/share/info --enable-shared --enable-threads=posix --disable-checking --enable-long-long --enable-__cxa_atexit --enable-clocale=gnu --disable-libunwind-exceptions --enable-languages=c,c++,ada,f77,objc,java --host=i586-mandrake-linux-gnu --with-system-zlib Thread model: posix gcc version 3.4.1 (Mandrakelinux 10.1 3.4.1-4mdk) Bison: bison (GNU Bison) 1.875d Written by Robert Corbett and Richard Stallman. Copyright (C) 2004 Free Software Foundation, Inc. This is free software; see the source for copying conditions. There is NO warranty; not even for MERCHANTABILITY or FITNESS FOR A PARTICULAR PURPOSE. Libraries: linux-gate.so.1 => (0xffffe000) libcrypt.so.1 => /lib/libcrypt.so.1 (0x4001d000) libexslt.so.0 => /usr/lib/libexslt.so.0 (0x4004a000) libgcrypt.so.11 => /usr/lib/libgcrypt.so.11 (0x4005b000) libgpg-error.so.0 => /usr/lib/libgpg-error.so.0 (0x400a8000) libz.so.1 => /lib/libz.so.1 (0x400ad000) libm.so.6 => /lib/tls/libm.so.6 (0x400be000) libmm.so.1 => /usr/lib/libmm.so.1 (0x400e1000) libmysqlclient.so.14 => /usr/lib/libmysqlclient.so.14 (0x400e5000) libssl.so.0.9.7 => /usr/lib/libssl.so.0.9.7 (0x401e9000) libcrypto.so.0.9.7 => /usr/lib/libcrypto.so.0.9.7 (0x4021a000) libming.so.0 => /usr/lib/libming.so.0 (0x4031a000) libmhash.so.2 => /usr/lib/libmhash.so.2 (0x4035b000) libmcrypt.so.4 => /usr/lib/libmcrypt.so.4 (0x4038c000) libdl.so.2 => /lib/libdl.so.2 (0x40392000) libltdl.so.3 => /usr/lib/libltdl.so.3 (0x40395000) libgd.so.2 => /usr/lib/libgd.so.2 (0x4039c000) libXpm.so.4 => /usr/X11R6/lib/libXpm.so.4 (0x403da000) libX11.so.6 => /usr/X11R6/lib/libX11.so.6 (0x403ea000) libfreetype.so.6 => /usr/lib/libfreetype.so.6 (0x404b5000) libpng12.so.0 => /usr/lib/libpng12.so.0 (0x40521000) libpng.so.3 => /usr/lib/libpng.so.3 (0x40546000) libjpeg.so.62 => /usr/lib/libjpeg.so.62 (0x4056b000) libdb-4.2.so => /usr/lib/libdb-4.2.so (0x4058b000) libgdbm.so.3 => /usr/lib/libgdbm.so.3 (0x40667000) libresolv.so.2 => /lib/libresolv.so.2 (0x4066d000) libnsl.so.1 => /lib/libnsl.so.1 (0x4067e000) libcurl.so.3 => /usr/lib/libcurl.so.3 (0x40691000) libidn.so.11 => /usr/lib/libidn.so.11 (0x406c1000) libxslt.so.1 => /usr/lib/libxslt.so.1 (0x406f2000) libxml2.so.2 => /usr/lib/libxml2.so.2 (0x40723000) libpthread.so.0 => /lib/tls/libpthread.so.0 (0x4080e000) libc.so.6 => /lib/tls/libc.so.6 (0x4081f000) /lib/ld-linux.so.2 => /lib/ld-linux.so.2 (0x40000000) libungif.so.4 => /usr/lib/libungif.so.4 (0x4093e000) libSM.so.6 => /usr/X11R6/lib/libSM.so.6 (0x40947000) libICE.so.6 => /usr/X11R6/lib/libICE.so.6 (0x40950000) User's E-mail: ================================================================================ PHPINFO ================================================================================ phpinfo() PHP Version => 5.0.3 System => Linux localhost 2.6.8.1-24mdksmp #1 SMP Thu Jan 13 23:11:43 MST 2005 i686 Build Date => Feb 17 2005 23:43:04 Configure Command => './configure' '--with-apxs2=/usr/local/apache2/bin/apxs' '--with-config-file-path=/usr/local/apache2/conf' '--disable-debug' '--enable-inline-optimization' '--with-openssl=/usr' '--with-zlib=/usr' '--with-curl=/usr/linclude/curl' '--with-gdbm=/usr/lib' '--with-db4=/usr/lib' '--enable-ftp' '--with-gd=/usr' '--with-jpeg-dir=/usr/lib' '--with-png-dir=/usr/lib' '--with-zlib-dir=/usr' '--enable-gd-native-ttf=/usr/lib' '--with-mcrypt=/usr/lib' '--with-mhash=/usr/lib' '--with-ming=/usr/lib' '--with-mysql=/usr' '--with-mm=/usr/lib' '--with-libxml-dir=/usr/lib' '--with-xsl=/usr/lib' '--with-gettext' Server API => Command Line Interface Virtual Directory Support => disabled Configuration File (php.ini) Path => /usr/local/apache2/conf PHP API => 20031224 PHP Extension => 20041030 Zend Extension => 220040412 Debug Build => no Thread Safety => disabled IPv6 Support => enabled Registered PHP Streams => php, file, http, ftp, compress.zlib, https, ftps Registered Stream Socket Transports => tcp, udp, unix, udg, ssl, sslv3, sslv2, tls This program makes use of the Zend Scripting Language Engine: Zend Engine v2.0.3, Copyright (c) 1998-2004 Zend Technologies _______________________________________________________________________ Configuration PHP Core Directive => Local Value => Master Value allow_call_time_pass_reference => On => On allow_url_fopen => On => On always_populate_raw_post_data => Off => Off arg_separator.input => & => & arg_separator.output => & => & asp_tags => Off => Off auto_append_file => no value => no value auto_globals_jit => On => On auto_prepend_file => no value => no value browscap => no value => no value default_charset => no value => no value default_mimetype => text/html => text/html define_syslog_variables => Off => Off disable_classes => no value => no value disable_functions => no value => no value display_errors => On => On display_startup_errors => Off => Off doc_root => no value => no value docref_ext => no value => no value docref_root => no value => no value enable_dl => On => On error_append_string => no value => no value error_log => no value => no value error_prepend_string => no value => no value error_reporting => no value => no value expose_php => On => On extension_dir => /usr/local/lib/php/extensions/no-debug-non-zts-20041030 => /usr/local/lib/php/extensions/no-debug-non-zts-20041030 file_uploads => On => On highlight.bg => #FFFFFF => #FFFFFF highlight.comment => #FF8000 => #FF8000 highlight.default => #0000BB => #0000BB highlight.html => #000000 => #000000 highlight.keyword => #007700 => #007700 highlight.string => #DD0000 => #DD0000 html_errors => Off => On ignore_repeated_errors => Off => Off ignore_repeated_source => Off => Off ignore_user_abort => Off => Off implicit_flush => On => Off include_path => .:/usr/local/lib/php => .:/usr/local/lib/php log_errors => Off => Off log_errors_max_len => 1024 => 1024 magic_quotes_gpc => On => On magic_quotes_runtime => Off => Off magic_quotes_sybase => Off => Off mail.force_extra_parameters => no value => no value max_execution_time => 0 => 30 max_input_time => -1 => -1 open_basedir => no value => no value output_buffering => 0 => 0 output_handler => no value => no value post_max_size => 8M => 8M precision => 14 => 14 register_argc_argv => On => On register_globals => Off => Off register_long_arrays => On => On report_memleaks => On => On report_zend_debug => Off => Off safe_mode => Off => Off safe_mode_exec_dir => /usr/local/php/bin => /usr/local/php/bin safe_mode_gid => Off => Off safe_mode_include_dir => no value => no value sendmail_from => no value => no value sendmail_path => -t -i => -t -i serialize_precision => 100 => 100 short_open_tag => On => On SMTP => localhost => localhost smtp_port => 25 => 25 sql.safe_mode => Off => Off track_errors => Off => Off unserialize_callback_func => no value => no value upload_max_filesize => 2M => 2M upload_tmp_dir => no value => no value user_dir => no value => no value variables_order => EGPCS => EGPCS xmlrpc_error_number => 0 => 0 xmlrpc_errors => Off => Off y2k_compliance => On => On zend.ze1_compatibility_mode => Off => Off ctype ctype functions => enabled curl CURL support => enabled CURL Information => libcurl/7.12.1 OpenSSL/0.9.7d zlib/1.2.1.1 libidn/0.5.4 dba DBA support => enabled Supported handlers => gdbm cdb cdb_make db4 inifile flatfile dom DOM/XML => enabled DOM/XML API Version => 20031129 libxml Version => 2.6.13 HTML Support => enabled XPath Support => enabled XPointer Support => enabled Schema Support => enabled RelaxNG Support => enabled ftp FTP support => enabled gd GD Support => enabled GD Version => 2.0 or higher JPG Support => enabled PNG Support => enabled WBMP Support => enabled gettext GetText Support => enabled iconv iconv support => enabled iconv implementation => glibc iconv library version => 2.3.3 Directive => Local Value => Master Value iconv.input_encoding => ISO-8859-1 => ISO-8859-1 iconv.internal_encoding => ISO-8859-1 => ISO-8859-1 iconv.output_encoding => ISO-8859-1 => ISO-8859-1 libxml libXML support => active libXML Version => 2.6.13 libXML streams => enabled mcrypt mcrypt support => enabled Version => 2.5.7 Api No => 20021217 Supported ciphers => blowfish-compat arcfour blowfish cast-128 cast-256 des enigma gost loki97 rc2 rijndael-128 rijndael-192 rijndael-256 safer-sk128 safer-sk64 saferplus serpent threeway tripledes twofish wake xtea Supported modes => cbc cfb ctr ecb ncfb nofb ofb stream Directive => Local Value => Master Value mcrypt.algorithms_dir => no value => no value mcrypt.modes_dir => no value => no value mhash MHASH support => Enabled MHASH API Version => 20020524 ming Ming SWF output library => enabled Version => 0.3beta1 mysql MySQL Support => enabled Active Persistent Links => 0 Active Links => 0 Client API version => 4.1.5-gamma MYSQL_MODULE_TYPE => external MYSQL_SOCKET => /var/lib/mysql/mysql.sock MYSQL_INCLUDE => -I/usr/include/mysql MYSQL_LIBS => -L/usr/lib -lmysqlclient Directive => Local Value => Master Value mysql.allow_persistent => On => On mysql.connect_timeout => 60 => 60 mysql.default_host => no value => no value mysql.default_password => no value => no value mysql.default_port => no value => no value mysql.default_socket => no value => no value mysql.default_user => no value => no value mysql.max_links => Unlimited => Unlimited mysql.max_persistent => Unlimited => Unlimited mysql.trace_mode => Off => Off openssl OpenSSL support => enabled OpenSSL Version => OpenSSL 0.9.7d 17 Mar 2004 pcre PCRE (Perl Compatible Regular Expressions) Support => enabled PCRE Library Version => 4.5 01-December-2003 posix Revision => $Revision: 1.60 $ session Session Support => enabled Registered save handlers => files user sqlite mm Registered serializer handlers => php php_binary Directive => Local Value => Master Value session.auto_start => Off => Off session.bug_compat_42 => On => On session.bug_compat_warn => On => On session.cache_expire => 180 => 180 session.cache_limiter => nocache => nocache session.cookie_domain => no value => no value session.cookie_lifetime => 0 => 0 session.cookie_path => / => / session.cookie_secure => Off => Off session.entropy_file => no value => no value session.entropy_length => 0 => 0 session.gc_divisor => 100 => 100 session.gc_maxlifetime => 1440 => 1440 session.gc_probability => 1 => 1 session.hash_bits_per_character => 4 => 4 session.hash_function => 0 => 0 session.name => PHPSESSID => PHPSESSID session.referer_check => no value => no value session.save_handler => files => files session.save_path => no value => no value session.serialize_handler => php => php session.use_cookies => On => On session.use_only_cookies => Off => Off session.use_trans_sid => 0 => 0 SimpleXML Simplexml support => enabled Revision => $Revision: 1.139.2.4 $ Schema support => enabled SPL SPL support => enabled Interfaces => RecursiveIterator, SeekableIterator Classes => ArrayObject, ArrayIterator, CachingIterator, CachingRecursiveIterator, DirectoryIterator, FilterIterator, LimitIterator, ParentIterator, RecursiveDirectoryIterator, RecursiveIteratorIterator, SimpleXMLIterator SQLite SQLite support => enabled PECL Module version => 2.0-dev $Id: sqlite.c,v 1.146.2.3 2004/09/26 01:41:40 wez Exp $ SQLite Library => 2.8.14 SQLite Encoding => iso8859 Directive => Local Value => Master Value sqlite.assoc_case => 0 => 0 standard Regex Library => Bundled library enabled Dynamic Library Support => enabled Directive => Local Value => Master Value assert.active => 1 => 1 assert.bail => 0 => 0 assert.callback => no value => no value assert.quiet_eval => 0 => 0 assert.warning => 1 => 1 auto_detect_line_endings => 0 => 0 date.default_latitude => 31.7667 => 31.7667 date.default_longitude => 35.2333 => 35.2333 date.sunrise_zenith => 90.83 => 90.83 date.sunset_zenith => 90.83 => 90.83 default_socket_timeout => 60 => 60 safe_mode_allowed_env_vars => PHP_ => PHP_ safe_mode_protected_env_vars => LD_LIBRARY_PATH => LD_LIBRARY_PATH url_rewriter.tags => a=href,area=href,frame=src,form=,fieldset= => a=href,area=href,frame=src,form=,fieldset= user_agent => no value => no value tokenizer Tokenizer Support => enabled xml XML Support => active XML Namespace Support => active libxml2 Version => 2.6.13 xsl XSL => enabled libxslt Version => 1.1.10 libxslt compiled against libxml Version => 2.6.12 EXSLT => enabled libexslt Version => 1.1.10 zlib ZLib Support => enabled Compiled Version => 1.2.1.1 Linked Version => 1.2.1.1 Directive => Local Value => Master Value zlib.output_compression => Off => Off zlib.output_compression_level => -1 => -1 zlib.output_handler => no value => no value Additional Modules Module Name Environment Variable => Value LESSKEY => /etc/.less LC_PAPER => en_US LC_ADDRESS => en_US HOSTNAME => localhost LC_MONETARY => en_US TEST_PHP_SRCDIR => /root/lamp/php-5.0.3 IFS => SHELL => /bin/sh TERM => xterm LC_SOURCED => 1 MAKEFLAGS => HISTSIZE => 1000 SSH_CLIENT => deleted COLORTERM_BCE => Eterm TMPDIR => /root/tmp WINDOWID => 6291527 LC_NUMERIC => en_US SSH_TTY => deleted ETERM_THEME_ROOT => /usr/share/Eterm/themes/Eterm USER => ciphex LS_COLORS => no=00:fi=00:di=01;34:ln=01;36:pi=40;33:so=01;35:bd=40;33;01:cd=40;33;01:or=01;05;37;41:mi=01;05;37;41:ex=01;32:*.cmd=01;32:*.exe=01;32:*.com=01;32:*.btm=01;32:*.bat=01;32:*.sh=01;32:*.csh=01;32:*.tar=01;31:*.tgz=01;31:*.arj=01;31:*.taz=01;31:*.lzh=01;31:*.zip=01;31:*.z=01;31:*.Z=01;31:*.gz=01;31:*.bz2=01;31:*.bz=01;31:*.tz=01;31:*.rpm=01;31:*.cpio=01;31:*.jpg=01;35:*.gif=01;35:*.bmp=01;35:*.xbm=01;35:*.xpm=01;35:*.png=01;35:*.tif=01;35: LC_TELEPHONE => en_US SCRIPT_FILENAME => ENV => /root/.bashrc SSH_AUTH_SOCK => deleted USERNAME => root MAKELEVEL => 1 MFLAGS => PATH => /sbin:/usr/sbin:/bin:/usr/bin:/usr/X11R6/bin:/usr/local/bin:/usr/local/sbin MAIL => /var/spool/mail/ciphex LC_MESSAGES => en_US _ => /root/lamp/php-5.0.3/sapi/cli/php LC_COLLATE => en_US SECURE_LEVEL => 3 LC_IDENTIFICATION => en_US PWD => /root/lamp/php-5.0.3 INPUTRC => /etc/inputrc XMODIFIERS => @im=none HELP_BROWSER => LANG => en_US TEST_PHP_EXECUTABLE => /root/lamp/php-5.0.3/sapi/cli/php REDIRECT_STATUS => PYTHONSTARTUP => /etc/pythonrc.py ETERM_VERSION => 0.9.2 LC_MEASUREMENT => en_US PATH_TRANSLATED => HISTCONTROL => ignoredups HOME => /root SHLVL => 6 COLORFGBG => 7;default;0 CONTENT_LENGTH => LANGUAGE => en_US:en GCONF_TMPDIR => /tmp LOGNAME => ciphex LESS => -MM TMP => /root/tmp QUERY_STRING => LC_CTYPE => en_US LESSOPEN => |/usr/bin/lesspipe.sh %s BROWSER => CONTENT_TYPE => DISPLAY => :0.0 CC => gcc REQUEST_METHOD => LC_TIME => en_US G_BROKEN_FILENAMES => 1 XAUTHORITY => /root/.xauthLOrtHV LC_NAME => en_US COLORTERM => Eterm PHP Variables Variable => Value _SERVER["LESSKEY"] => /etc/.less _SERVER["LC_PAPER"] => en_US _SERVER["LC_ADDRESS"] => en_US _SERVER["HOSTNAME"] => localhost _SERVER["LC_MONETARY"] => en_US _SERVER["TEST_PHP_SRCDIR"] => /root/lamp/php-5.0.3 _SERVER["IFS"] => _SERVER["SHELL"] => /bin/sh _SERVER["TERM"] => xterm _SERVER["LC_SOURCED"] => 1 _SERVER["MAKEFLAGS"] => _SERVER["HISTSIZE"] => 1000 _SERVER["SSH_CLIENT"] => deleted _SERVER["COLORTERM_BCE"] => Eterm _SERVER["TMPDIR"] => /root/tmp _SERVER["WINDOWID"] => 6291527 _SERVER["LC_NUMERIC"] => en_US _SERVER["SSH_TTY"] => deleted _SERVER["ETERM_THEME_ROOT"] => /usr/share/Eterm/themes/Eterm _SERVER["USER"] => ciphex _SERVER["LS_COLORS"] => no=00:fi=00:di=01;34:ln=01;36:pi=40;33:so=01;35:bd=40;33;01:cd=40;33;01:or=01;05;37;41:mi=01;05;37;41:ex=01;32:*.cmd=01;32:*.exe=01;32:*.com=01;32:*.btm=01;32:*.bat=01;32:*.sh=01;32:*.csh=01;32:*.tar=01;31:*.tgz=01;31:*.arj=01;31:*.taz=01;31:*.lzh=01;31:*.zip=01;31:*.z=01;31:*.Z=01;31:*.gz=01;31:*.bz2=01;31:*.bz=01;31:*.tz=01;31:*.rpm=01;31:*.cpio=01;31:*.jpg=01;35:*.gif=01;35:*.bmp=01;35:*.xbm=01;35:*.xpm=01;35:*.png=01;35:*.tif=01;35: _SERVER["LC_TELEPHONE"] => en_US _SERVER["SCRIPT_FILENAME"] => _SERVER["ENV"] => /root/.bashrc _SERVER["SSH_AUTH_SOCK"] => deleted _SERVER["USERNAME"] => root _SERVER["MAKELEVEL"] => 1 _SERVER["MFLAGS"] => _SERVER["PATH"] => /sbin:/usr/sbin:/bin:/usr/bin:/usr/X11R6/bin:/usr/local/bin:/usr/local/sbin _SERVER["MAIL"] => /var/spool/mail/ciphex _SERVER["LC_MESSAGES"] => en_US _SERVER["_"] => /root/lamp/php-5.0.3/sapi/cli/php _SERVER["LC_COLLATE"] => en_US _SERVER["SECURE_LEVEL"] => 3 _SERVER["LC_IDENTIFICATION"] => en_US _SERVER["PWD"] => /root/lamp/php-5.0.3 _SERVER["INPUTRC"] => /etc/inputrc _SERVER["XMODIFIERS"] => @im=none _SERVER["HELP_BROWSER"] => _SERVER["LANG"] => en_US _SERVER["TEST_PHP_EXECUTABLE"] => /root/lamp/php-5.0.3/sapi/cli/php _SERVER["REDIRECT_STATUS"] => _SERVER["PYTHONSTARTUP"] => /etc/pythonrc.py _SERVER["ETERM_VERSION"] => 0.9.2 _SERVER["LC_MEASUREMENT"] => en_US _SERVER["PATH_TRANSLATED"] => _SERVER["HISTCONTROL"] => ignoredups _SERVER["HOME"] => /root _SERVER["SHLVL"] => 6 _SERVER["COLORFGBG"] => 7;default;0 _SERVER["CONTENT_LENGTH"] => _SERVER["LANGUAGE"] => en_US:en _SERVER["GCONF_TMPDIR"] => /tmp _SERVER["LOGNAME"] => ciphex _SERVER["LESS"] => -MM _SERVER["TMP"] => /root/tmp _SERVER["QUERY_STRING"] => _SERVER["LC_CTYPE"] => en_US _SERVER["LESSOPEN"] => |/usr/bin/lesspipe.sh %s _SERVER["BROWSER"] => _SERVER["CONTENT_TYPE"] => _SERVER["DISPLAY"] => :0.0 _SERVER["CC"] => gcc _SERVER["REQUEST_METHOD"] => _SERVER["LC_TIME"] => en_US _SERVER["G_BROKEN_FILENAMES"] => 1 _SERVER["XAUTHORITY"] => /root/.xauthLOrtHV _SERVER["LC_NAME"] => en_US _SERVER["COLORTERM"] => Eterm _SERVER["PHP_SELF"] => _SERVER["SCRIPT_NAME"] => _SERVER["DOCUMENT_ROOT"] => _SERVER["argv"] => Array ( ) _SERVER["argc"] => 0 _ENV["LESSKEY"] => /etc/.less _ENV["LC_PAPER"] => en_US _ENV["LC_ADDRESS"] => en_US _ENV["HOSTNAME"] => localhost _ENV["LC_MONETARY"] => en_US _ENV["TEST_PHP_SRCDIR"] => /root/lamp/php-5.0.3 _ENV["IFS"] => _ENV["SHELL"] => /bin/sh _ENV["TERM"] => xterm _ENV["LC_SOURCED"] => 1 _ENV["MAKEFLAGS"] => _ENV["HISTSIZE"] => 1000 _ENV["SSH_CLIENT"] => deleted _ENV["COLORTERM_BCE"] => Eterm _ENV["TMPDIR"] => /root/tmp _ENV["WINDOWID"] => 6291527 _ENV["LC_NUMERIC"] => en_US _ENV["SSH_TTY"] => deleted _ENV["ETERM_THEME_ROOT"] => /usr/share/Eterm/themes/Eterm _ENV["USER"] => ciphex _ENV["LS_COLORS"] => no=00:fi=00:di=01;34:ln=01;36:pi=40;33:so=01;35:bd=40;33;01:cd=40;33;01:or=01;05;37;41:mi=01;05;37;41:ex=01;32:*.cmd=01;32:*.exe=01;32:*.com=01;32:*.btm=01;32:*.bat=01;32:*.sh=01;32:*.csh=01;32:*.tar=01;31:*.tgz=01;31:*.arj=01;31:*.taz=01;31:*.lzh=01;31:*.zip=01;31:*.z=01;31:*.Z=01;31:*.gz=01;31:*.bz2=01;31:*.bz=01;31:*.tz=01;31:*.rpm=01;31:*.cpio=01;31:*.jpg=01;35:*.gif=01;35:*.bmp=01;35:*.xbm=01;35:*.xpm=01;35:*.png=01;35:*.tif=01;35: _ENV["LC_TELEPHONE"] => en_US _ENV["SCRIPT_FILENAME"] => _ENV["ENV"] => /root/.bashrc _ENV["SSH_AUTH_SOCK"] => deleted _ENV["USERNAME"] => root _ENV["MAKELEVEL"] => 1 _ENV["MFLAGS"] => _ENV["PATH"] => /sbin:/usr/sbin:/bin:/usr/bin:/usr/X11R6/bin:/usr/local/bin:/usr/local/sbin _ENV["MAIL"] => /var/spool/mail/ciphex _ENV["LC_MESSAGES"] => en_US _ENV["_"] => /root/lamp/php-5.0.3/sapi/cli/php _ENV["LC_COLLATE"] => en_US _ENV["SECURE_LEVEL"] => 3 _ENV["LC_IDENTIFICATION"] => en_US _ENV["PWD"] => /root/lamp/php-5.0.3 _ENV["INPUTRC"] => /etc/inputrc _ENV["XMODIFIERS"] => @im=none _ENV["HELP_BROWSER"] => _ENV["LANG"] => en_US _ENV["TEST_PHP_EXECUTABLE"] => /root/lamp/php-5.0.3/sapi/cli/php _ENV["REDIRECT_STATUS"] => _ENV["PYTHONSTARTUP"] => /etc/pythonrc.py _ENV["ETERM_VERSION"] => 0.9.2 _ENV["LC_MEASUREMENT"] => en_US _ENV["PATH_TRANSLATED"] => _ENV["HISTCONTROL"] => ignoredups _ENV["HOME"] => /root _ENV["SHLVL"] => 6 _ENV["COLORFGBG"] => 7;default;0 _ENV["CONTENT_LENGTH"] => _ENV["LANGUAGE"] => en_US:en _ENV["GCONF_TMPDIR"] => /tmp _ENV["LOGNAME"] => ciphex _ENV["LESS"] => -MM _ENV["TMP"] => /root/tmp _ENV["QUERY_STRING"] => _ENV["LC_CTYPE"] => en_US _ENV["LESSOPEN"] => |/usr/bin/lesspipe.sh %s _ENV["BROWSER"] => _ENV["CONTENT_TYPE"] => _ENV["DISPLAY"] => :0.0 _ENV["CC"] => gcc _ENV["REQUEST_METHOD"] => _ENV["LC_TIME"] => en_US _ENV["G_BROKEN_FILENAMES"] => 1 _ENV["XAUTHORITY"] => /root/.xauthLOrtHV _ENV["LC_NAME"] => en_US _ENV["COLORTERM"] => Eterm PHP License This program is free software; you can redistribute it and/or modify it under the terms of the PHP License as published by the PHP Group and included in the distribution in the file: LICENSE This program is distributed in the hope that it will be useful, but WITHOUT ANY WARRANTY; without even the implied warranty of MERCHANTABILITY or FITNESS FOR A PARTICULAR PURPOSE. If you did not receive a copy of the PHP license, or have any questions about PHP licensing, please contact license@php.net.

« previous php.qa (#23754) next »