Test results for 5.0.3 [failed]

From: Date: Thu, 24 Mar 2005 17:54:04 +0000
Subject: Test results for 5.0.3 [failed]
Groups: php.qa 
Request: Send a blank email to php-qa+get-24658@lists.php.net to get a copy of this message
===================================================================== FAILED TEST SUMMARY --------------------------------------------------------------------- Test for buffering in core functions with implicit flush off [tests/func/008.phpt] Convert warnings to exceptions [tests/lang/038.phpt] Bug #22836 (returning references to NULL) [Zend/tests/bug22836.phpt] Bug #28444 (Cannot access undefined property for object with overloaded property access) [Zend/tests/bug28444.phpt] Test 3: Exception Test [ext/dom/tests/dom003.phpt] Bug #16069 [ext/iconv/tests/bug16069.phpt] iconv stream filter [ext/iconv/tests/iconv_stream_filter.phpt] OpenSSL private key functions [ext/openssl/tests/001.phpt] Bug #29992 (foreach by reference corrupts the array) [ext/standard/tests/array/bug29992.phpt] Bug #20382 (strtotime ("Monday", $date) produces wrong result on DST changeover) [ext/standard/tests/time/bug20382.phpt] Bug #26614 (CDATA sections skipped on line count) [ext/xml/tests/bug26614.phpt] ===================================================================== ===================================================================== TEST RESULT SUMMARY --------------------------------------------------------------------- Exts skipped : 66 Exts tested : 17 --------------------------------------------------------------------- Number of tests : 1291 616 Tests skipped : 675 (52.3%) -------- Tests warned : 0 (0.0%) (0.0%) Tests failed : 11 (0.9%) (1.8%) Tests passed : 605 (46.9%) (98.2%) --------------------------------------------------------------------- Time taken : 45 seconds ===================================================================== ===================================================================== FAILED TEST SUMMARY --------------------------------------------------------------------- Test for buffering in core functions with implicit flush off [tests/func/008.phpt] Convert warnings to exceptions [tests/lang/038.phpt] Bug #22836 (returning references to NULL) [Zend/tests/bug22836.phpt] Bug #28444 (Cannot access undefined property for object with overloaded property access) [Zend/tests/bug28444.phpt] Test 3: Exception Test [ext/dom/tests/dom003.phpt] Bug #16069 [ext/iconv/tests/bug16069.phpt] iconv stream filter [ext/iconv/tests/iconv_stream_filter.phpt] OpenSSL private key functions [ext/openssl/tests/001.phpt] Bug #29992 (foreach by reference corrupts the array) [ext/standard/tests/array/bug29992.phpt] Bug #20382 (strtotime ("Monday", $date) produces wrong result on DST changeover) [ext/standard/tests/time/bug20382.phpt] Bug #26614 (CDATA sections skipped on line count) [ext/xml/tests/bug26614.phpt] ===================================================================== ================================================================================ /root/php-5.0.3/tests/func/008.phpt ================================================================================ ---- EXPECTED OUTPUT 'foo1' 'foo2' ---- ACTUAL OUTPUT ---- FAILED ================================================================================ 001- 'foo1' 003- 'foo2' ================================================================================ ================================================================================ /root/php-5.0.3/tests/lang/038.phpt ================================================================================ ---- EXPECTED OUTPUT string(15) "Error2Exception" string(5) "fopen" ===DONE=== ---- ACTUAL OUTPUT string(15) "Error2Exception" string(15) "Error2Exception" ===DONE=== ---- FAILED ================================================================================ 002+ string(15) "Error2Exception" 002- string(5) "fopen" ================================================================================ ================================================================================ /root/php-5.0.3/Zend/tests/bug22836.phpt ================================================================================ ---- EXPECTED OUTPUT string(3) "foo" 'foo' Notice: Undefined variable: a in %s on line %d Strict Standards: Only variable references should be returned by reference in %s on line %d string(3) "foo" 'foo' Notice: Undefined variable: a in %s on line %d Strict Standards: Only variable references should be returned by reference in %s on line %d string(3) "foo" 'foo' Notice: Undefined variable: a in %s on line %d Strict Standards: Only variable references should be returned by reference in %s on line %d string(3) "foo" 'foo' Notice: Undefined variable: a in %s on line %d Strict Standards: Only variable references should be returned by reference in %s on line %d string(3) "foo" 'foo' Notice: Undefined variable: a in %s on line %d Strict Standards: Only variable references should be returned by reference in %s on line %d string(3) "foo" 'foo' Notice: Undefined variable: a in %s on line %d Strict Standards: Only variable references should be returned by reference in %s on line %d string(3) "foo" 'foo' Notice: Undefined variable: a in %s on line %d Strict Standards: Only variable references should be returned by reference in %s on line %d string(3) "foo" 'foo' Notice: Undefined variable: a in %s on line %d Strict Standards: Only variable references should be returned by reference in %s on line %d string(3) "foo" 'foo' Notice: Undefined variable: a in %s on line %d Strict Standards: Only variable references should be returned by reference in %s on line %d ---- ACTUAL OUTPUT string(3) "foo" 'foo' Notice: Undefined variable: a in /root/php-5.0.3/Zend/tests/bug22836.php on line 7 Strict Standards: Only variable references should be returned by reference in /root/php-5.0.3/Zend/tests/bug22836.php on line 7 string(3) "foo" 'foo' Notice: Undefined variable: a in /root/php-5.0.3/Zend/tests/bug22836.php on line 7 Strict Standards: Only variable references should be returned by reference in /root/php-5.0.3/Zend/tests/bug22836.php on line 7 NULL 'foo' Notice: Undefined variable: a in /root/php-5.0.3/Zend/tests/bug22836.php on line 7 NULL 'foo' Notice: Undefined variable: a in /root/php-5.0.3/Zend/tests/bug22836.php on line 7 NULL 'foo' Notice: Undefined variable: a in /root/php-5.0.3/Zend/tests/bug22836.php on line 7 NULL 'foo' Notice: Undefined variable: a in /root/php-5.0.3/Zend/tests/bug22836.php on line 7 NULL 'foo' Notice: Undefined variable: a in /root/php-5.0.3/Zend/tests/bug22836.php on line 7 NULL 'foo' Notice: Undefined variable: a in /root/php-5.0.3/Zend/tests/bug22836.php on line 7 ---- FAILED ================================================================================ 013+ NULL 013- string(3) "foo" 017+ NULL 018+ 'foo' 018- Strict Standards: Only variable references should be returned by reference in %s on line %d 019- string(3) "foo" 020+ Notice: Undefined variable: a in /root/php-5.0.3/Zend/tests/bug22836.php on line 7 021+ NULL 022+ 'foo' 023+ 024+ Notice: Undefined variable: a in /root/php-5.0.3/Zend/tests/bug22836.php on line 7 025+ NULL 026+ 'foo' 027+ 028+ Notice: Undefined variable: a in /root/php-5.0.3/Zend/tests/bug22836.php on line 7 029+ NULL 030+ 'foo' 031+ 032+ Notice: Undefined variable: a in /root/php-5.0.3/Zend/tests/bug22836.php on line 7 033+ NULL 023- 024- Strict Standards: Only variable references should be returned by reference in %s on line %d 025- string(3) "foo" 026- 'foo' 027- 028- Notice: Undefined variable: a in %s on line %d 029- 030- Strict Standards: Only variable references should be returned by reference in %s on line %d 031- string(3) "foo" 032- 'foo' 033- 034- Notice: Undefined variable: a in %s on line %d 035- 036- Strict Standards: Only variable references should be returned by reference in %s on line %d 037- string(3) "foo" 038- 'foo' 039- 040- Notice: Undefined variable: a in %s on line %d 041- 042- Strict Standards: Only variable references should be returned by reference in %s on line %d 043- string(3) "foo" 044- 'foo' 045- 046- Notice: Undefined variable: a in %s on line %d 047- 048- Strict Standards: Only variable references should be returned by reference in %s on line %d 049- string(3) "foo" 050- 'foo' 051- 052- Notice: Undefined variable: a in %s on line %d 053- 054- Strict Standards: Only variable references should be returned by reference in %s on line %d ================================================================================ ================================================================================ /root/php-5.0.3/Zend/tests/bug28444.phpt ================================================================================ ---- EXPECTED OUTPUT object(Object)#%d (1) { ["x"]=> int(2) } int(2) int(3) Overloaded::__set(y,3) int(3) Overloaded::__get(y) int(3) Overloaded::__set(z,Object id #3) object(Object)#%d (1) { ["x"]=> int(4) } Overloaded::__get(z) int(4) Overloaded::__get(z) int(5) Overloaded::__get(z) int(6) ===DONE=== ---- ACTUAL OUTPUT object(Object)#2 (1) { ["x"]=> int(2) } int(2) int(3) Overloaded::__set(y,3) int(3) Overloaded::__get(y) int(3) Overloaded::__set(z,Object id #3) object(Object)#3 (1) { ["x"]=> int(4) } Overloaded::__get(z) int(4) Overloaded::__get(z) int(5) Fatal error: Cannot access undefined property for object with overloaded property access in /root/php-5.0.3/Zend/tests/bug28444.php on line 45 ---- FAILED ================================================================================ 020+ 021+ Fatal error: Cannot access undefined property for object with overloaded property access in /root/php-5.0.3/Zend/tests/bug28444.php on line 45 020- Overloaded::__get(z) 021- int(6) 022- ===DONE=== ================================================================================ ================================================================================ /root/php-5.0.3/ext/dom/tests/dom003.phpt ================================================================================ ---- EXPECTED OUTPUT --- Catch exception with try/catch object(DOMException)#%d (6) { ["message:protected"]=> string(23) "Hierarchy Request Error" ["string:private"]=> string(0) "" ["file:protected"]=> string(%d) "%s/ext/dom/tests/dom003.php" ["line:protected"]=> int(8) ["trace:private"]=> array(0) { } ["code"]=> int(3) } --- Don't catch exception with try/catch Fatal error: Uncaught exception 'DOMException' with message 'Hierarchy Request Error' in %sdom003.php:%d Stack trace: #0 {main} thrown in %sdom003.php on line %d ---- ACTUAL OUTPUT --- Catch exception with try/catch object(DOMException)#3 (6) { ["message:protected"]=> string(23) "Hierarchy Request Error" ["string:private"]=> string(0) "" ["file:protected"]=> string(40) "/root/php-5.0.3/ext/dom/tests/dom003.php" ["line:protected"]=> int(8) ["trace:private"]=> array(1) { [0]=> array(6) { ["file"]=> string(40) "/root/php-5.0.3/ext/dom/tests/dom003.php" ["line"]=> int(8) ["function"]=> string(11) "appendChild" ["class"]=> string(10) "DOMElement" ["type"]=> string(2) "->" ["args"]=> array(1) { [0]=> object(DOMElement)#2 (0) { } } } } ["code"]=> int(3) } --- Don't catch exception with try/catch Fatal error: Uncaught exception 'DOMException' with message 'Hierarchy Request Error' in /root/php-5.0.3/ext/dom/tests/dom003.php:13 Stack trace: #0 /root/php-5.0.3/ext/dom/tests/dom003.php(13): DOMElement->appendChild(Object(DOMElement)) #1 {main} thrown in /root/php-5.0.3/ext/dom/tests/dom003.php on line 13 ---- FAILED ================================================================================ 012+ array(1) { 013+ [0]=> 014+ array(6) { 015+ ["file"]=> 016+ string(40) "/root/php-5.0.3/ext/dom/tests/dom003.php" 017+ ["line"]=> 018+ int(8) 019+ ["function"]=> 020+ string(11) "appendChild" 021+ ["class"]=> 022+ string(10) "DOMElement" 012- array(0) { 013- } 014- ["code"]=> 015- int(3) 016- } 017- --- Don't catch exception with try/catch 018- 019- Fatal error: Uncaught exception 'DOMException' with message 'Hierarchy Request Error' in %sdom003.php:%d 020- Stack trace: 021- #0 {main} 022- thrown in %sdom003.php on line %d 023+ ["type"]=> 024+ string(2) "->" 025+ ["args"]=> 026+ array(1) { 027+ [0]=> 028+ object(DOMElement)#2 (0) { 029+ } 030+ } 031+ } 032+ } 033+ ["code"]=> 034+ int(3) 035+ } 036+ --- Don't catch exception with try/catch 037+ 038+ Fatal error: Uncaught exception 'DOMException' with message 'Hierarchy Request Error' in /root/php-5.0.3/ext/dom/tests/dom003.php:13 039+ Stack trace: 040+ #0 /root/php-5.0.3/ext/dom/tests/dom003.php(13): DOMElement->appendChild(Object(DOMElement)) 041+ #1 {main} 042+ thrown in /root/php-5.0.3/ext/dom/tests/dom003.php on line 13 ================================================================================ ================================================================================ /root/php-5.0.3/ext/iconv/tests/bug16069.phpt ================================================================================ ---- EXPECTED OUTPUT ¥ß¥ê¥Ð¡¼¥ë¥ß¥ê¥Ð¡¼¥ë¥ß¥ê¥Ð¡¼¥ë¥ß¥ê¥Ð¡¼¥ë¥ß¥ê¥Ð¡¼¥ë¥ß¥ê¥Ð¡¼¥ë¥ß¥ê¥Ð¡¼¥ë¥ß¥ê¥Ð¡¼¥ë¥ß¥ê¥Ð¡¼¥ë¥ß¥ê¥Ð¡¼¥ë¥ß¥ê¥Ð¡¼¥ë¥ß¥ê¥Ð¡¼¥ë¥ß¥ê¥Ð¡¼¥ë¥ß¥ê¥Ð¡¼¥ë¥ß¥ê¥Ð¡¼¥ë¥ß¥ê¥Ð¡¼¥ë¥ß¥ê¥Ð¡¼¥ë¥ß¥ê¥Ð¡¼¥ë¥ß¥ê¥Ð¡¼¥ë¥ß¥ê¥Ð¡¼¥ë¥ß¥ê¥Ð¡¼¥ë¥ß¥ê¥Ð¡¼¥ë¥ß¥ê¥Ð¡¼¥ë¥ß¥ê¥Ð¡¼¥ë¥ß¥ê¥Ð¡¼¥ë¥ß¥ê¥Ð¡¼¥ë¥ß¥ê¥Ð¡¼¥ë¥ß¥ê¥Ð¡¼¥ë¥ß¥ê¥Ð¡¼¥ë¥ß¥ê¥Ð¡¼¥ë¥ß¥ê¥Ð¡¼¥ë¥ß¥ê¥Ð¡¼¥ë¥ß¥ê¥Ð¡¼¥ë¥ß¥ê¥Ð¡¼¥ë¥ß¥ê¥Ð¡¼¥ë¥ß¥ê¥Ð¡¼¥ë¥ß¥ê¥Ð¡¼¥ë¥ß¥ê¥Ð¡¼¥ë¥ß¥ê¥Ð¡¼¥ë¥ß¥ê¥Ð¡¼¥ë(¡ë§¥¡ë) ---- ACTUAL OUTPUT ¥ß¥ê¥Ð¡¼¥ë¥ß¥ê¥Ð¡¼¥ë¥ß¥ê¥Ð¡¼¥ë¥ß¥ê¥Ð¡¼¥ë¥ß¥ê¥Ð¡¼¥ë¥ß¥ê¥Ð¡¼¥ë¥ß¥ê¥Ð¡¼¥ë¥ß¥ê¥Ð¡¼¥ë¥ß¥ê¥Ð¡¼¥ë¥ß¥ê¥Ð¡¼¥ë¥ß¥ê¥Ð¡¼¥ë¥ß¥ß¥ê¥Ð¡¼¥ë¥ß¥ê¥Ð¡¼¥ë¥ß¥ê¥Ð¡¼¥ë¥ß¥ê¥Ð¡¼¥ë¥ß¥ê¥Ð¡¼¥ë¥ß¥ê¥Ð¡¼¥ë¥ß¥ê¥Ð¡¼¥ë¥ß¥ê¥Ð¡¼¥ë¥ß¥ê¥Ð¡¼¥ë¥ß¥ê¥Ð¡¼¥ë¥ß¥ê¥Ð¡¼¥ë¥ß¥ê¥Ð¡¼¥ë¥ß¥ê¥Ð¡¼¥ë¥ß¥ê¥Ð¡¼¥ë¥ß¥ê¥Ð¡¼¥ë¥ß¥ê¥Ð¡¼¥ë¥ß¥ê¥Ð¡¼¥ë¥ß¥ê¥Ð¡¼¥ë¥ß¥ê¥Ð¡¼¥ë¥ß¥ê¥Ð¡¼¥ë¥ß¥ê¥Ð¡¼¥ë¥ß¥ê¥Ð¡¼¥ë¥ß¥ê¥Ð¡¼¥ë¥ß¥ê¥Ð¡¼¥ë¥ß¥ê¥Ð¡¼¥ë¥ß¥ê¥Ð¡¼¥ë¥ß¥ê¥Ð¡¼¥ë¥ß¥ê¥Ð¡¼¥ë¥ß¥ê¥Ð¡¼¥ë(¡ë§¥¡ë) ---- FAILED ================================================================================ 001+ ¥ß¥ê¥Ð¡¼¥ë¥ß¥ê¥Ð¡¼¥ë¥ß¥ê¥Ð¡¼¥ë¥ß¥ê¥Ð¡¼¥ë¥ß¥ê¥Ð¡¼¥ë¥ß¥ê¥Ð¡¼¥ë¥ß¥ê¥Ð¡¼¥ë¥ß¥ê¥Ð¡¼¥ë¥ß¥ê¥Ð¡¼¥ë¥ß¥ê¥Ð¡¼¥ë¥ß¥ê¥Ð¡¼¥ë¥ß¥ß¥ê¥Ð¡¼¥ë¥ß¥ê¥Ð¡¼¥ë¥ß¥ê¥Ð¡¼¥ë¥ß¥ê¥Ð¡¼¥ë¥ß¥ê¥Ð¡¼¥ë¥ß¥ê¥Ð¡¼¥ë¥ß¥ê¥Ð¡¼¥ë¥ß¥ê¥Ð¡¼¥ë¥ß¥ê¥Ð¡¼¥ë¥ß¥ê¥Ð¡¼¥ë¥ß¥ê¥Ð¡¼¥ë¥ß¥ê¥Ð¡¼¥ë¥ß¥ê¥Ð¡¼¥ë¥ß¥ê¥Ð¡¼¥ë¥ß¥ê¥Ð¡¼¥ë¥ß¥ê¥Ð¡¼¥ë¥ß¥ê¥Ð¡¼¥ë¥ß¥ê¥Ð¡¼¥ë¥ß¥ê¥Ð¡¼¥ë¥ß¥ê¥Ð¡¼¥ë¥ß¥ê¥Ð¡¼¥ë¥ß¥ê¥Ð¡¼¥ë¥ß¥ê¥Ð¡¼¥ë¥ß¥ê¥Ð¡¼¥ë¥ß¥ê¥Ð¡¼¥ë¥ß¥ê¥Ð¡¼¥ë¥ß¥ê¥Ð¡¼¥ë¥ß¥ê¥Ð¡¼¥ë¥ß¥ê¥Ð¡¼¥ë(¡ë§¥¡ë) 001- ¥ß¥ê¥Ð¡¼¥ë¥ß¥ê¥Ð¡¼¥ë¥ß¥ê¥Ð¡¼¥ë¥ß¥ê¥Ð¡¼¥ë¥ß¥ê¥Ð¡¼¥ë¥ß¥ê¥Ð¡¼¥ë¥ß¥ê¥Ð¡¼¥ë¥ß¥ê¥Ð¡¼¥ë¥ß¥ê¥Ð¡¼¥ë¥ß¥ê¥Ð¡¼¥ë¥ß¥ê¥Ð¡¼¥ë¥ß¥ê¥Ð¡¼¥ë¥ß¥ê¥Ð¡¼¥ë¥ß¥ê¥Ð¡¼¥ë¥ß¥ê¥Ð¡¼¥ë¥ß¥ê¥Ð¡¼¥ë¥ß¥ê¥Ð¡¼¥ë¥ß¥ê¥Ð¡¼¥ë¥ß¥ê¥Ð¡¼¥ë¥ß¥ê¥Ð¡¼¥ë¥ß¥ê¥Ð¡¼¥ë¥ß¥ê¥Ð¡¼¥ë¥ß¥ê¥Ð¡¼¥ë¥ß¥ê¥Ð¡¼¥ë¥ß¥ê¥Ð¡¼¥ë¥ß¥ê¥Ð¡¼¥ë¥ß¥ê¥Ð¡¼¥ë¥ß¥ê¥Ð¡¼¥ë¥ß¥ê¥Ð¡¼¥ë¥ß¥ê¥Ð¡¼¥ë¥ß¥ê¥Ð¡¼¥ë¥ß¥ê¥Ð¡¼¥ë¥ß¥ê¥Ð¡¼¥ë¥ß¥ê¥Ð¡¼¥ë¥ß¥ê¥Ð¡¼¥ë¥ß¥ê¥Ð¡¼¥ë¥ß¥ê¥Ð¡¼¥ë¥ß¥ê¥Ð¡¼¥ë¥ß¥ê¥Ð¡¼¥ë¥ß¥ê¥Ð¡¼¥ë(¡ë§¥¡ë) ================================================================================ ================================================================================ /root/php-5.0.3/ext/iconv/tests/iconv_stream_filter.phpt ================================================================================ ---- EXPECTED OUTPUT string(20) "1b244224332473244b24" string(10) "41244f1b28" string(2) "42" string(20) "a4b3a4f3a4cba4c1a4cf" string(10) "69636f6e76" string(2) "0a" Warning: fread(): iconv stream filter ("ISO-2022-JP"=>"EUC-JP"): invalid multibyte sequence in %s on line %d string(0) "" string(0) "" string(0) "" ---- ACTUAL OUTPUT string(20) "1b244224332473244b24" string(10) "41244f1b28" string(2) "42" string(20) "a4b3a4f3a4cba4c1a4cf" string(10) "69636f6e76" string(2) "0a" string(20) "1b244f24332466245824" string(10) "4e24421b28" string(2) "4f" ---- FAILED ================================================================================ 007+ string(20) "1b244f24332466245824" 008+ string(10) "4e24421b28" 009+ string(2) "4f" 007- 008- Warning: fread(): iconv stream filter ("ISO-2022-JP"=>"EUC-JP"): invalid multibyte sequence in %s on line %d 009- string(0) "" 010- string(0) "" 011- string(0) "" ================================================================================ ================================================================================ /root/php-5.0.3/ext/openssl/tests/001.phpt ================================================================================ ---- EXPECTED OUTPUT Creating private key Export key to file Load key from file - array syntax Load key using direct syntax Load key manually and use string syntax OK! ---- ACTUAL OUTPUT Creating private key Export key to file Load key from file - array syntax failed to load key using array syntax ---- FAILED ================================================================================ 004+ failed to load key using array syntax 004- Load key using direct syntax 005- Load key manually and use string syntax 006- OK! ================================================================================ ================================================================================ /root/php-5.0.3/ext/standard/tests/array/bug29992.phpt ================================================================================ ---- EXPECTED OUTPUT Array ( [0] => 1 [1] => 2 [2] => 3 ) int(1) int(2) int(3) int(1) int(2) int(3) int(1) int(2) int(3) int(1) int(2) int(3) Array ( [0] => 1 [1] => 2 [2] => 3 ) ===DONE=== ---- ACTUAL OUTPUT Array ( [0] => 1 [1] => 2 [2] => 3 ) int(1) int(2) int(3) int(1) int(2) int(3) int(1) int(2) int(3) int(1) int(2) int(2) Array ( [0] => 1 [1] => 2 [2] => 2 ) ===DONE=== ---- FAILED ================================================================================ 018+ int(2) 018- int(3) 023+ [2] => 2 023- [2] => 3 ================================================================================ ================================================================================ /root/php-5.0.3/ext/standard/tests/time/bug20382.phpt ================================================================================ ---- EXPECTED OUTPUT tStamp=Wednesday 2004-10-27 17:17:17 CEST result=Monday 2004-11-01 00:00:00 CET wanted=Monday 2004-11-01 00:00:00 CET ---- ACTUAL OUTPUT tStamp=Wednesday 2004-10-27 17:17:17 CEST result=Sunday 2004-10-31 23:00:00 CET wanted=Monday 2004-11-01 00:00:00 CET ---- FAILED ================================================================================ 002+ result=Sunday 2004-10-31 23:00:00 CET 002- result=Monday 2004-11-01 00:00:00 CET ================================================================================ ================================================================================ /root/php-5.0.3/ext/xml/tests/bug26614.phpt ================================================================================ ---- EXPECTED OUTPUT CDATA <DATA> at line 2, col 0 (byte 45) </DATA> at line 9, col 0 (byte 90) Comment <DATA> at line 2, col 0 (byte 45) </DATA> at line 9, col 0 (byte 90) Text <DATA> at line 2, col 0 (byte 45) </DATA> at line 9, col 0 (byte 90) ---- ACTUAL OUTPUT CDATA <DATA> at line 2, col 6 (byte 9) </DATA> at line 9, col 7 (byte 56) Comment <DATA> at line 2, col 6 (byte 9) </DATA> at line 9, col 7 (byte 56) Text <DATA> at line 2, col 6 (byte 9) </DATA> at line 9, col 10 (byte 56) ---- FAILED ================================================================================ 002+ <DATA> at line 2, col 6 (byte 9) 003+ </DATA> at line 9, col 7 (byte 56) 002- <DATA> at line 2, col 0 (byte 45) 003- </DATA> at line 9, col 0 (byte 90) 005+ <DATA> at line 2, col 6 (byte 9) 006+ </DATA> at line 9, col 7 (byte 56) 005- <DATA> at line 2, col 0 (byte 45) 006- </DATA> at line 9, col 0 (byte 90) 008+ <DATA> at line 2, col 6 (byte 9) 009+ </DATA> at line 9, col 10 (byte 56) 008- <DATA> at line 2, col 0 (byte 45) 009- </DATA> at line 9, col 0 (byte 90) ================================================================================ ================================================================================ BUILD ENVIRONMENT ================================================================================ OS: Linux - Linux chip 2.6.8-24.11-smp #1 SMP Fri Jan 14 13:01:26 UTC 2005 x86_64 Automake: automake (GNU automake) 1.9.1 Written by Tom Tromey <tromey@redhat.com>. Copyright 2004 Free Software Foundation, Inc. This is free software; see the source for copying conditions. There is NO warranty; not even for MERCHANTABILITY or FITNESS FOR A PARTICULAR PURPOSE. Autoconf: autoconf (GNU Autoconf) 2.59 Written by David J. MacKenzie and Akim Demaille. Copyright (C) 2003 Free Software Foundation, Inc. This is free software; see the source for copying conditions. There is NO warranty; not even for MERCHANTABILITY or FITNESS FOR A PARTICULAR PURPOSE. Bundled Libtool: ltmain.sh (GNU libtool) 1.4.3 (1.922.2.110 2002/10/23 01:39:54) System Libtool: ltmain.sh (GNU libtool) 1.5.8 (1.1220.2.118 2004/08/07 12:24:38) Copyright (C) 2003 Free Software Foundation, Inc. This is free software; see the source for copying conditions. There is NO warranty; not even for MERCHANTABILITY or FITNESS FOR A PARTICULAR PURPOSE. Compiler: Reading specs from /usr/lib64/gcc-lib/x86_64-suse-linux/3.3.4/specs Configured with: ../configure --enable-threads=posix --prefix=/usr --with-local-prefix=/usr/local --infodir=/usr/share/info --mandir=/usr/share/man --enable-languages=c,c++,f77,objc,java,ada --disable-checking --libdir=/usr/lib64 --enable-libgcj --with-gxx-include-dir=/usr/include/g++ --with-slibdir=/lib64 --with-system-zlib --enable-shared --enable-__cxa_atexit x86_64-suse-linux Thread model: posix gcc version 3.3.4 (pre 3.3.5 20040809) Bison: bison (GNU Bison) 1.875 Written by Robert Corbett and Richard Stallman. Copyright (C) 2002 Free Software Foundation, Inc. This is free software; see the source for copying conditions. There is NO warranty; not even for MERCHANTABILITY or FITNESS FOR A PARTICULAR PURPOSE. Libraries: libcrypt.so.1 => /lib64/libcrypt.so.1 (0x0000002a9566d000) libmysqlclient.so.12 => /usr/local/mysql/lib/mysql/libmysqlclient.so.12 (0x0000002a957a7000) libz.so.1 => /lib64/libz.so.1 (0x0000002a958e9000) libm.so.6 => /lib64/tls/libm.so.6 (0x0000002a959fc000) libssl.so.0.9.7 => /usr/local/openssl/lib/libssl.so.0.9.7 (0x0000002a95b54000) libcrypto.so.0.9.7 => /usr/local/openssl/lib/libcrypto.so.0.9.7 (0x0000002a95c8c000) libresolv.so.2 => /lib64/libresolv.so.2 (0x0000002a95ed2000) libdl.so.2 => /lib64/libdl.so.2 (0x0000002a95fe8000) libnsl.so.1 => /lib64/libnsl.so.1 (0x0000002a960eb000) libxml2.so.2 => /usr/lib64/libxml2.so.2 (0x0000002a96201000) libc.so.6 => /lib64/tls/libc.so.6 (0x0000002a96415000) /lib64/ld-linux-x86-64.so.2 => /lib64/ld-linux-x86-64.so.2 (0x0000002a95556000) libpthread.so.0 => /lib64/tls/libpthread.so.0 (0x0000002a96637000) User's E-mail: jpatterson at paybycash dot com ================================================================================ PHPINFO ================================================================================ phpinfo() PHP Version => 5.0.3 System => Linux chip 2.6.8-24.11-smp #1 SMP Fri Jan 14 13:01:26 UTC 2005 x86_64 Build Date => Mar 24 2005 12:52:04 Configure Command => './configure' '--prefix=/usr/local/php5' '--with-apxs2=/usr/local/apache/bin/apxs' '--with-openssl=/usr/local/openssl' '--with-zlib=/usr/local/zlib' '--with-mysql=/usr/local/mysql' '--enable-sockets' Server API => Command Line Interface Virtual Directory Support => disabled Configuration File (php.ini) Path => /usr/local/php5/lib PHP API => 20031224 PHP Extension => 20041030 Zend Extension => 220040412 Debug Build => no Thread Safety => disabled IPv6 Support => enabled Registered PHP Streams => php, file, http, ftp, compress.zlib, https, ftps Registered Stream Socket Transports => tcp, udp, unix, udg, ssl, sslv3, sslv2, tls This program makes use of the Zend Scripting Language Engine: Zend Engine v2.0.3, Copyright (c) 1998-2004 Zend Technologies _______________________________________________________________________ Configuration PHP Core Directive => Local Value => Master Value allow_call_time_pass_reference => On => On allow_url_fopen => On => On always_populate_raw_post_data => Off => Off arg_separator.input => & => & arg_separator.output => & => & asp_tags => Off => Off auto_append_file => no value => no value auto_globals_jit => On => On auto_prepend_file => no value => no value browscap => no value => no value default_charset => no value => no value default_mimetype => text/html => text/html define_syslog_variables => Off => Off disable_classes => no value => no value disable_functions => no value => no value display_errors => On => On display_startup_errors => Off => Off doc_root => no value => no value docref_ext => no value => no value docref_root => no value => no value enable_dl => On => On error_append_string => no value => no value error_log => no value => no value error_prepend_string => no value => no value error_reporting => no value => no value expose_php => On => On extension_dir => /usr/local/php5/lib/php/extensions/no-debug-non-zts-20041030 => /usr/local/php5/lib/php/extensions/no-debug-non-zts-20041030 file_uploads => On => On highlight.bg => #FFFFFF => #FFFFFF highlight.comment => #FF8000 => #FF8000 highlight.default => #0000BB => #0000BB highlight.html => #000000 => #000000 highlight.keyword => #007700 => #007700 highlight.string => #DD0000 => #DD0000 html_errors => Off => On ignore_repeated_errors => Off => Off ignore_repeated_source => Off => Off ignore_user_abort => Off => Off implicit_flush => On => Off include_path => .:/usr/local/php5/lib/php => .:/usr/local/php5/lib/php log_errors => Off => Off log_errors_max_len => 1024 => 1024 magic_quotes_gpc => On => On magic_quotes_runtime => Off => Off magic_quotes_sybase => Off => Off mail.force_extra_parameters => no value => no value max_execution_time => 0 => 30 max_input_time => -1 => -1 open_basedir => no value => no value output_buffering => 0 => 0 output_handler => no value => no value post_max_size => 8M => 8M precision => 14 => 14 register_argc_argv => On => On register_globals => Off => Off register_long_arrays => On => On report_memleaks => On => On report_zend_debug => Off => Off safe_mode => Off => Off safe_mode_exec_dir => /usr/local/php/bin => /usr/local/php/bin safe_mode_gid => Off => Off safe_mode_include_dir => no value => no value sendmail_from => no value => no value sendmail_path => /usr/sbin/sendmail -t -i => /usr/sbin/sendmail -t -i serialize_precision => 100 => 100 short_open_tag => On => On SMTP => localhost => localhost smtp_port => 25 => 25 sql.safe_mode => Off => Off track_errors => Off => Off unserialize_callback_func => no value => no value upload_max_filesize => 2M => 2M upload_tmp_dir => no value => no value user_dir => no value => no value variables_order => EGPCS => EGPCS xmlrpc_error_number => 0 => 0 xmlrpc_errors => Off => Off y2k_compliance => On => On zend.ze1_compatibility_mode => Off => Off ctype ctype functions => enabled dom DOM/XML => enabled DOM/XML API Version => 20031129 libxml Version => 2.6.12 HTML Support => enabled XPath Support => enabled XPointer Support => enabled Schema Support => enabled RelaxNG Support => enabled iconv iconv support => enabled iconv implementation => glibc iconv library version => 2.3.3 Directive => Local Value => Master Value iconv.input_encoding => ISO-8859-1 => ISO-8859-1 iconv.internal_encoding => ISO-8859-1 => ISO-8859-1 iconv.output_encoding => ISO-8859-1 => ISO-8859-1 libxml libXML support => active libXML Version => 2.6.12 libXML streams => enabled mysql MySQL Support => enabled Active Persistent Links => 0 Active Links => 0 Client API version => 4.0.24 MYSQL_MODULE_TYPE => external MYSQL_SOCKET => /tmp/mysql.sock MYSQL_INCLUDE => -I/usr/local/mysql/include/mysql MYSQL_LIBS => -L/usr/local/mysql/lib/mysql -lmysqlclient Directive => Local Value => Master Value mysql.allow_persistent => On => On mysql.connect_timeout => 60 => 60 mysql.default_host => no value => no value mysql.default_password => no value => no value mysql.default_port => no value => no value mysql.default_socket => no value => no value mysql.default_user => no value => no value mysql.max_links => Unlimited => Unlimited mysql.max_persistent => Unlimited => Unlimited mysql.trace_mode => Off => Off openssl OpenSSL support => enabled OpenSSL Version => OpenSSL 0.9.7e 25 Oct 2004 pcre PCRE (Perl Compatible Regular Expressions) Support => enabled PCRE Library Version => 4.5 01-December-2003 posix Revision => $Revision: 1.60 $ session Session Support => enabled Registered save handlers => files user sqlite Registered serializer handlers => php php_binary Directive => Local Value => Master Value session.auto_start => Off => Off session.bug_compat_42 => On => On session.bug_compat_warn => On => On session.cache_expire => 180 => 180 session.cache_limiter => nocache => nocache session.cookie_domain => no value => no value session.cookie_lifetime => 0 => 0 session.cookie_path => / => / session.cookie_secure => Off => Off session.entropy_file => no value => no value session.entropy_length => 0 => 0 session.gc_divisor => 100 => 100 session.gc_maxlifetime => 1440 => 1440 session.gc_probability => 1 => 1 session.hash_bits_per_character => 4 => 4 session.hash_function => 0 => 0 session.name => PHPSESSID => PHPSESSID session.referer_check => no value => no value session.save_handler => files => files session.save_path => no value => no value session.serialize_handler => php => php session.use_cookies => On => On session.use_only_cookies => Off => Off session.use_trans_sid => 0 => 0 SimpleXML Simplexml support => enabled Revision => $Revision: 1.139.2.4 $ Schema support => enabled sockets Sockets Support => enabled SPL SPL support => enabled Interfaces => RecursiveIterator, SeekableIterator Classes => ArrayObject, ArrayIterator, CachingIterator, CachingRecursiveIterator, DirectoryIterator, FilterIterator, LimitIterator, ParentIterator, RecursiveDirectoryIterator, RecursiveIteratorIterator, SimpleXMLIterator SQLite SQLite support => enabled PECL Module version => 2.0-dev $Id: sqlite.c,v 1.146.2.3 2004/09/26 01:41:40 wez Exp $ SQLite Library => 2.8.14 SQLite Encoding => iso8859 Directive => Local Value => Master Value sqlite.assoc_case => 0 => 0 standard Regex Library => Bundled library enabled Dynamic Library Support => enabled Path to sendmail => /usr/sbin/sendmail -t -i Directive => Local Value => Master Value assert.active => 1 => 1 assert.bail => 0 => 0 assert.callback => no value => no value assert.quiet_eval => 0 => 0 assert.warning => 1 => 1 auto_detect_line_endings => 0 => 0 date.default_latitude => 31.7667 => 31.7667 date.default_longitude => 35.2333 => 35.2333 date.sunrise_zenith => 90.83 => 90.83 date.sunset_zenith => 90.83 => 90.83 default_socket_timeout => 60 => 60 safe_mode_allowed_env_vars => PHP_ => PHP_ safe_mode_protected_env_vars => LD_LIBRARY_PATH => LD_LIBRARY_PATH url_rewriter.tags => a=href,area=href,frame=src,form=,fieldset= => a=href,area=href,frame=src,form=,fieldset= user_agent => no value => no value tokenizer Tokenizer Support => enabled xml XML Support => active XML Namespace Support => active libxml2 Version => 2.6.12 zlib ZLib Support => enabled Compiled Version => 1.2.2 Linked Version => 1.2.1 Directive => Local Value => Master Value zlib.output_compression => Off => Off zlib.output_compression_level => -1 => -1 zlib.output_handler => no value => no value Additional Modules Module Name Environment Variable => Value LESSKEY => /etc/lesskey.bin MANPATH => /usr/share/man:/usr/local/man:/usr/X11R6/man:/opt/gnome/share/man INFODIR => /usr/local/info:/usr/share/info:/usr/info NNTPSERVER => news HOSTNAME => chip TEST_PHP_SRCDIR => /root/php-5.0.3 GNOME2_PATH => /usr/local:/opt/gnome:/usr XKEYSYMDB => /usr/X11R6/lib/X11/XKeysymDB SHELL => /bin/sh TERM => linux HOST => chip PROFILEREAD => true MAKEFLAGS => HISTSIZE => 1000 SSH_CLIENT => deleted QTDIR => /usr/lib/qt3 SSH_TTY => deleted GROFF_NO_SGR => yes USER => root LS_COLORS => no=00:fi=00:di=01;34:ln=00;36:pi=40;33:so=01;35:do=01;35:bd=40;33;01:cd=40;33;01:or=40;31:ex=00;32:*.cmd=00;32:*.exe=01;32:*.com=01;32:*.bat=01;32:*.btm=01;32:*.dll=01;32:*.tar=00;31:*.tbz=00;31:*.tgz=00;31:*.rpm=00;31:*.deb=00;31:*.arj=00;31:*.taz=00;31:*.lzh=00;31:*.zip=00;31:*.zoo=00;31:*.z=00;31:*.Z=00;31:*.gz=00;31:*.bz2=00;31:*.tb2=00;31:*.tz2=00;31:*.tbz2=00;31:*.avi=01;35:*.bmp=01;35:*.fli=01;35:*.gif=01;35:*.jpg=01;35:*.jpeg=01;35:*.mng=01;35:*.mov=01;35:*.mpg=01;35:*.pcx=01;35:*.pbm=01;35:*.pgm=01;35:*.png=01;35:*.ppm=01;35:*.tga=01;35:*.tif=01;35:*.xbm=01;35:*.xpm=01;35:*.dl=01;35:*.gl=01;35:*.aiff=00;32:*.au=00;32:*.mid=00;32:*.mp3=00;32:*.ogg=00;32:*.voc=00;32:*.wav=00;32: SCRIPT_FILENAME => XNLSPATH => /usr/X11R6/lib/X11/nls SSH_AUTH_SOCK => deleted HOSTTYPE => x86_64 MAKELEVEL => 1 PAGER => less MFLAGS => MINICOM => -c on PATH => /sbin:/usr/sbin:/usr/local/sbin:/root/bin:/usr/local/bin:/usr/bin:/usr/X11R6/bin:/bin:/usr/games:/opt/gnome/bin:/usr/local/python/bin:/usr/local/openssl/bin:/usr/local/php4/bin CPU => x86_64 _ => /root/php-5.0.3/sapi/cli/php PWD => /root/php-5.0.3 INPUTRC => /etc/inputrc TEST_PHP_EXECUTABLE => /root/php-5.0.3/sapi/cli/php REDIRECT_STATUS => PATH_TRANSLATED => TEXINPUTS => :/root/.TeX:/usr/share/doc/.TeX:/usr/doc/.TeX HOME => /root SHLVL => 3 CONTENT_LENGTH => OSTYPE => linux LESS_ADVANCED_PREPROCESSOR => no XCURSOR_THEME => crystalwhite LS_OPTIONS => -a -N --color=tty -T 0 WINDOWMANAGER => /usr/X11R6/bin/kde GTK_PATH => /usr/local/lib/gtk-2.0:/opt/gnome/lib/gtk-2.0:/usr/lib/gtk-2.0 MACHTYPE => x86_64-suse-linux LOGNAME => root LESS => -M -I QUERY_STRING => CVS_RSH => ssh GTK_PATH64 => /usr/local/lib64/gtk-2.0:/opt/gnome/lib64/gtk-2.0:/usr/lib64/gtk-2.0 LC_CTYPE => en_US.UTF-8 ACLOCAL_FLAGS => -I /opt/gnome/share/aclocal LESSOPEN => lessopen.sh %s PKG_CONFIG_PATH => /opt/gnome/lib64/pkgconfig INFOPATH => /usr/local/info:/usr/share/info:/usr/info:/opt/gnome/share/info CONTENT_TYPE => CC => gcc REQUEST_METHOD => LESSCLOSE => lessclose.sh %s %s G_BROKEN_FILENAMES => 1 COLORTERM => 1 PHP Variables Variable => Value _SERVER["LESSKEY"] => /etc/lesskey.bin _SERVER["MANPATH"] => /usr/share/man:/usr/local/man:/usr/X11R6/man:/opt/gnome/share/man _SERVER["INFODIR"] => /usr/local/info:/usr/share/info:/usr/info _SERVER["NNTPSERVER"] => news _SERVER["HOSTNAME"] => chip _SERVER["TEST_PHP_SRCDIR"] => /root/php-5.0.3 _SERVER["GNOME2_PATH"] => /usr/local:/opt/gnome:/usr _SERVER["XKEYSYMDB"] => /usr/X11R6/lib/X11/XKeysymDB _SERVER["SHELL"] => /bin/sh _SERVER["TERM"] => linux _SERVER["HOST"] => chip _SERVER["PROFILEREAD"] => true _SERVER["MAKEFLAGS"] => _SERVER["HISTSIZE"] => 1000 _SERVER["SSH_CLIENT"] => deleted _SERVER["QTDIR"] => /usr/lib/qt3 _SERVER["SSH_TTY"] => deleted _SERVER["GROFF_NO_SGR"] => yes _SERVER["USER"] => root _SERVER["LS_COLORS"] => no=00:fi=00:di=01;34:ln=00;36:pi=40;33:so=01;35:do=01;35:bd=40;33;01:cd=40;33;01:or=40;31:ex=00;32:*.cmd=00;32:*.exe=01;32:*.com=01;32:*.bat=01;32:*.btm=01;32:*.dll=01;32:*.tar=00;31:*.tbz=00;31:*.tgz=00;31:*.rpm=00;31:*.deb=00;31:*.arj=00;31:*.taz=00;31:*.lzh=00;31:*.zip=00;31:*.zoo=00;31:*.z=00;31:*.Z=00;31:*.gz=00;31:*.bz2=00;31:*.tb2=00;31:*.tz2=00;31:*.tbz2=00;31:*.avi=01;35:*.bmp=01;35:*.fli=01;35:*.gif=01;35:*.jpg=01;35:*.jpeg=01;35:*.mng=01;35:*.mov=01;35:*.mpg=01;35:*.pcx=01;35:*.pbm=01;35:*.pgm=01;35:*.png=01;35:*.ppm=01;35:*.tga=01;35:*.tif=01;35:*.xbm=01;35:*.xpm=01;35:*.dl=01;35:*.gl=01;35:*.aiff=00;32:*.au=00;32:*.mid=00;32:*.mp3=00;32:*.ogg=00;32:*.voc=00;32:*.wav=00;32: _SERVER["SCRIPT_FILENAME"] => _SERVER["XNLSPATH"] => /usr/X11R6/lib/X11/nls _SERVER["SSH_AUTH_SOCK"] => deleted _SERVER["HOSTTYPE"] => x86_64 _SERVER["MAKELEVEL"] => 1 _SERVER["PAGER"] => less _SERVER["MFLAGS"] => _SERVER["MINICOM"] => -c on _SERVER["PATH"] => /sbin:/usr/sbin:/usr/local/sbin:/root/bin:/usr/local/bin:/usr/bin:/usr/X11R6/bin:/bin:/usr/games:/opt/gnome/bin:/usr/local/python/bin:/usr/local/openssl/bin:/usr/local/php4/bin _SERVER["CPU"] => x86_64 _SERVER["_"] => /root/php-5.0.3/sapi/cli/php _SERVER["PWD"] => /root/php-5.0.3 _SERVER["INPUTRC"] => /etc/inputrc _SERVER["TEST_PHP_EXECUTABLE"] => /root/php-5.0.3/sapi/cli/php _SERVER["REDIRECT_STATUS"] => _SERVER["PATH_TRANSLATED"] => _SERVER["TEXINPUTS"] => :/root/.TeX:/usr/share/doc/.TeX:/usr/doc/.TeX _SERVER["HOME"] => /root _SERVER["SHLVL"] => 3 _SERVER["CONTENT_LENGTH"] => _SERVER["OSTYPE"] => linux _SERVER["LESS_ADVANCED_PREPROCESSOR"] => no _SERVER["XCURSOR_THEME"] => crystalwhite _SERVER["LS_OPTIONS"] => -a -N --color=tty -T 0 _SERVER["WINDOWMANAGER"] => /usr/X11R6/bin/kde _SERVER["GTK_PATH"] => /usr/local/lib/gtk-2.0:/opt/gnome/lib/gtk-2.0:/usr/lib/gtk-2.0 _SERVER["MACHTYPE"] => x86_64-suse-linux _SERVER["LOGNAME"] => root _SERVER["LESS"] => -M -I _SERVER["QUERY_STRING"] => _SERVER["CVS_RSH"] => ssh _SERVER["GTK_PATH64"] => /usr/local/lib64/gtk-2.0:/opt/gnome/lib64/gtk-2.0:/usr/lib64/gtk-2.0 _SERVER["LC_CTYPE"] => en_US.UTF-8 _SERVER["ACLOCAL_FLAGS"] => -I /opt/gnome/share/aclocal _SERVER["LESSOPEN"] => lessopen.sh %s _SERVER["PKG_CONFIG_PATH"] => /opt/gnome/lib64/pkgconfig _SERVER["INFOPATH"] => /usr/local/info:/usr/share/info:/usr/info:/opt/gnome/share/info _SERVER["CONTENT_TYPE"] => _SERVER["CC"] => gcc _SERVER["REQUEST_METHOD"] => _SERVER["LESSCLOSE"] => lessclose.sh %s %s _SERVER["G_BROKEN_FILENAMES"] => 1 _SERVER["COLORTERM"] => 1 _SERVER["PHP_SELF"] => _SERVER["SCRIPT_NAME"] => _SERVER["DOCUMENT_ROOT"] => _SERVER["argv"] => Array ( ) _SERVER["argc"] => 0 _ENV["LESSKEY"] => /etc/lesskey.bin _ENV["MANPATH"] => /usr/share/man:/usr/local/man:/usr/X11R6/man:/opt/gnome/share/man _ENV["INFODIR"] => /usr/local/info:/usr/share/info:/usr/info _ENV["NNTPSERVER"] => news _ENV["HOSTNAME"] => chip _ENV["TEST_PHP_SRCDIR"] => /root/php-5.0.3 _ENV["GNOME2_PATH"] => /usr/local:/opt/gnome:/usr _ENV["XKEYSYMDB"] => /usr/X11R6/lib/X11/XKeysymDB _ENV["SHELL"] => /bin/sh _ENV["TERM"] => linux _ENV["HOST"] => chip _ENV["PROFILEREAD"] => true _ENV["MAKEFLAGS"] => _ENV["HISTSIZE"] => 1000 _ENV["SSH_CLIENT"] => deleted _ENV["QTDIR"] => /usr/lib/qt3 _ENV["SSH_TTY"] => deleted _ENV["GROFF_NO_SGR"] => yes _ENV["USER"] => root _ENV["LS_COLORS"] => no=00:fi=00:di=01;34:ln=00;36:pi=40;33:so=01;35:do=01;35:bd=40;33;01:cd=40;33;01:or=40;31:ex=00;32:*.cmd=00;32:*.exe=01;32:*.com=01;32:*.bat=01;32:*.btm=01;32:*.dll=01;32:*.tar=00;31:*.tbz=00;31:*.tgz=00;31:*.rpm=00;31:*.deb=00;31:*.arj=00;31:*.taz=00;31:*.lzh=00;31:*.zip=00;31:*.zoo=00;31:*.z=00;31:*.Z=00;31:*.gz=00;31:*.bz2=00;31:*.tb2=00;31:*.tz2=00;31:*.tbz2=00;31:*.avi=01;35:*.bmp=01;35:*.fli=01;35:*.gif=01;35:*.jpg=01;35:*.jpeg=01;35:*.mng=01;35:*.mov=01;35:*.mpg=01;35:*.pcx=01;35:*.pbm=01;35:*.pgm=01;35:*.png=01;35:*.ppm=01;35:*.tga=01;35:*.tif=01;35:*.xbm=01;35:*.xpm=01;35:*.dl=01;35:*.gl=01;35:*.aiff=00;32:*.au=00;32:*.mid=00;32:*.mp3=00;32:*.ogg=00;32:*.voc=00;32:*.wav=00;32: _ENV["SCRIPT_FILENAME"] => _ENV["XNLSPATH"] => /usr/X11R6/lib/X11/nls _ENV["SSH_AUTH_SOCK"] => deleted _ENV["HOSTTYPE"] => x86_64 _ENV["MAKELEVEL"] => 1 _ENV["PAGER"] => less _ENV["MFLAGS"] => _ENV["MINICOM"] => -c on _ENV["PATH"] => /sbin:/usr/sbin:/usr/local/sbin:/root/bin:/usr/local/bin:/usr/bin:/usr/X11R6/bin:/bin:/usr/games:/opt/gnome/bin:/usr/local/python/bin:/usr/local/openssl/bin:/usr/local/php4/bin _ENV["CPU"] => x86_64 _ENV["_"] => /root/php-5.0.3/sapi/cli/php _ENV["PWD"] => /root/php-5.0.3 _ENV["INPUTRC"] => /etc/inputrc _ENV["TEST_PHP_EXECUTABLE"] => /root/php-5.0.3/sapi/cli/php _ENV["REDIRECT_STATUS"] => _ENV["PATH_TRANSLATED"] => _ENV["TEXINPUTS"] => :/root/.TeX:/usr/share/doc/.TeX:/usr/doc/.TeX _ENV["HOME"] => /root _ENV["SHLVL"] => 3 _ENV["CONTENT_LENGTH"] => _ENV["OSTYPE"] => linux _ENV["LESS_ADVANCED_PREPROCESSOR"] => no _ENV["XCURSOR_THEME"] => crystalwhite _ENV["LS_OPTIONS"] => -a -N --color=tty -T 0 _ENV["WINDOWMANAGER"] => /usr/X11R6/bin/kde _ENV["GTK_PATH"] => /usr/local/lib/gtk-2.0:/opt/gnome/lib/gtk-2.0:/usr/lib/gtk-2.0 _ENV["MACHTYPE"] => x86_64-suse-linux _ENV["LOGNAME"] => root _ENV["LESS"] => -M -I _ENV["QUERY_STRING"] => _ENV["CVS_RSH"] => ssh _ENV["GTK_PATH64"] => /usr/local/lib64/gtk-2.0:/opt/gnome/lib64/gtk-2.0:/usr/lib64/gtk-2.0 _ENV["LC_CTYPE"] => en_US.UTF-8 _ENV["ACLOCAL_FLAGS"] => -I /opt/gnome/share/aclocal _ENV["LESSOPEN"] => lessopen.sh %s _ENV["PKG_CONFIG_PATH"] => /opt/gnome/lib64/pkgconfig _ENV["INFOPATH"] => /usr/local/info:/usr/share/info:/usr/info:/opt/gnome/share/info _ENV["CONTENT_TYPE"] => _ENV["CC"] => gcc _ENV["REQUEST_METHOD"] => _ENV["LESSCLOSE"] => lessclose.sh %s %s _ENV["G_BROKEN_FILENAMES"] => 1 _ENV["COLORTERM"] => 1 PHP License This program is free software; you can redistribute it and/or modify it under the terms of the PHP License as published by the PHP Group and included in the distribution in the file: LICENSE This program is distributed in the hope that it will be useful, but WITHOUT ANY WARRANTY; without even the implied warranty of MERCHANTABILITY or FITNESS FOR A PARTICULAR PURPOSE. If you did not receive a copy of the PHP license, or have any questions about PHP licensing, please contact license@php.net.

« previous php.qa (#24658) next »