Test results for 5.1.0-dev [failed]

From: Date: Mon, 27 Jun 2005 18:16:40 +0000
Subject: Test results for 5.1.0-dev [failed]
Groups: php.qa 
Request: Send a blank email to php-qa+get-25227@lists.php.net to get a copy of this message
===================================================================== FAILED TEST SUMMARY --------------------------------------------------------------------- Test for buffering in core functions with implicit flush off [tests/func/008.phpt] Bug #16069 [ext/iconv/tests/bug16069.phpt] iconv stream filter [ext/iconv/tests/iconv_stream_filter.phpt] PDO_SQLite: Deriving PDO [ext/pdo_sqlite/tests/pdo_026.phpt] PDO_SQLite2: Deriving PDO [ext/sqlite/tests/pdo/pdo_026.phpt] various fputcsv() functionality tests [ext/standard/tests/file/fputcsv.phpt] Bug #26614 (CDATA sections skipped on line count) [ext/xml/tests/bug26614.phpt] ===================================================================== ===================================================================== TEST RESULT SUMMARY --------------------------------------------------------------------- Exts skipped : 62 Exts tested : 22 --------------------------------------------------------------------- Number of tests : 1906 1002 Tests skipped : 904 ( 47.4%) -------- Tests warned : 0 ( 0.0%) ( 0.0%) Tests failed : 7 ( 0.4%) ( 0.7%) Tests passed : 995 ( 52.2%) ( 99.3%) --------------------------------------------------------------------- Time taken : 102 seconds ===================================================================== ===================================================================== FAILED TEST SUMMARY --------------------------------------------------------------------- Test for buffering in core functions with implicit flush off [tests/func/008.phpt] Bug #16069 [ext/iconv/tests/bug16069.phpt] iconv stream filter [ext/iconv/tests/iconv_stream_filter.phpt] PDO_SQLite: Deriving PDO [ext/pdo_sqlite/tests/pdo_026.phpt] PDO_SQLite2: Deriving PDO [ext/sqlite/tests/pdo/pdo_026.phpt] various fputcsv() functionality tests [ext/standard/tests/file/fputcsv.phpt] Bug #26614 (CDATA sections skipped on line count) [ext/xml/tests/bug26614.phpt] ===================================================================== ================================================================================ /cvs/php-src/tests/func/008.phpt ================================================================================ ---- EXPECTED OUTPUT 'foo1' 'foo2' ---- ACTUAL OUTPUT ---- FAILED ================================================================================ 001- 'foo1' 003- 'foo2' ================================================================================ ================================================================================ /cvs/php-src/ext/iconv/tests/bug16069.phpt ================================================================================ ---- EXPECTED OUTPUT ¥ß¥ê¥Ð¡¼¥ë¥ß¥ê¥Ð¡¼¥ë¥ß¥ê¥Ð¡¼¥ë¥ß¥ê¥Ð¡¼¥ë¥ß¥ê¥Ð¡¼¥ë¥ß¥ê¥Ð¡¼¥ë¥ß¥ê¥Ð¡¼¥ë¥ß¥ê¥Ð¡¼¥ë¥ß¥ê¥Ð¡¼¥ë¥ß¥ê¥Ð¡¼¥ë¥ß¥ê¥Ð¡¼¥ë¥ß¥ê¥Ð¡¼¥ë¥ß¥ê¥Ð¡¼¥ë¥ß¥ê¥Ð¡¼¥ë¥ß¥ê¥Ð¡¼¥ë¥ß¥ê¥Ð¡¼¥ë¥ß¥ê¥Ð¡¼¥ë¥ß¥ê¥Ð¡¼¥ë¥ß¥ê¥Ð¡¼¥ë¥ß¥ê¥Ð¡¼¥ë¥ß¥ê¥Ð¡¼¥ë¥ß¥ê¥Ð¡¼¥ë¥ß¥ê¥Ð¡¼¥ë¥ß¥ê¥Ð¡¼¥ë¥ß¥ê¥Ð¡¼¥ë¥ß¥ê¥Ð¡¼¥ë¥ß¥ê¥Ð¡¼¥ë¥ß¥ê¥Ð¡¼¥ë¥ß¥ê¥Ð¡¼¥ë¥ß¥ê¥Ð¡¼¥ë¥ß¥ê¥Ð¡¼¥ë¥ß¥ê¥Ð¡¼¥ë¥ß¥ê¥Ð¡¼¥ë¥ß¥ê¥Ð¡¼¥ë¥ß¥ê¥Ð¡¼¥ë¥ß¥ê¥Ð¡¼¥ë¥ß¥ê¥Ð¡¼¥ë¥ß¥ê¥Ð¡¼¥ë¥ß¥ê¥Ð¡¼¥ë¥ß¥ê¥Ð¡¼¥ë(¡ë§¥¡ë) ---- ACTUAL OUTPUT ????????????????????????????????????????(¡ë§¥¡ë) ---- FAILED ================================================================================ 001+ ????????????????????????????????????????(¡ë§¥¡ë) 001- ¥ß¥ê¥Ð¡¼¥ë¥ß¥ê¥Ð¡¼¥ë¥ß¥ê¥Ð¡¼¥ë¥ß¥ê¥Ð¡¼¥ë¥ß¥ê¥Ð¡¼¥ë¥ß¥ê¥Ð¡¼¥ë¥ß¥ê¥Ð¡¼¥ë¥ß¥ê¥Ð¡¼¥ë¥ß¥ê¥Ð¡¼¥ë¥ß¥ê¥Ð¡¼¥ë¥ß¥ê¥Ð¡¼¥ë¥ß¥ê¥Ð¡¼¥ë¥ß¥ê¥Ð¡¼¥ë¥ß¥ê¥Ð¡¼¥ë¥ß¥ê¥Ð¡¼¥ë¥ß¥ê¥Ð¡¼¥ë¥ß¥ê¥Ð¡¼¥ë¥ß¥ê¥Ð¡¼¥ë¥ß¥ê¥Ð¡¼¥ë¥ß¥ê¥Ð¡¼¥ë¥ß¥ê¥Ð¡¼¥ë¥ß¥ê¥Ð¡¼¥ë¥ß¥ê¥Ð¡¼¥ë¥ß¥ê¥Ð¡¼¥ë¥ß¥ê¥Ð¡¼¥ë¥ß¥ê¥Ð¡¼¥ë¥ß¥ê¥Ð¡¼¥ë¥ß¥ê¥Ð¡¼¥ë¥ß¥ê¥Ð¡¼¥ë¥ß¥ê¥Ð¡¼¥ë¥ß¥ê¥Ð¡¼¥ë¥ß¥ê¥Ð¡¼¥ë¥ß¥ê¥Ð¡¼¥ë¥ß¥ê¥Ð¡¼¥ë¥ß¥ê¥Ð¡¼¥ë¥ß¥ê¥Ð¡¼¥ë¥ß¥ê¥Ð¡¼¥ë¥ß¥ê¥Ð¡¼¥ë¥ß¥ê¥Ð¡¼¥ë¥ß¥ê¥Ð¡¼¥ë(¡ë§¥¡ë) ================================================================================ ================================================================================ /cvs/php-src/ext/iconv/tests/iconv_stream_filter.phpt ================================================================================ ---- EXPECTED OUTPUT string(20) "1b244224332473244b24" string(10) "41244f1b28" string(2) "42" string(20) "a4b3a4f3a4cba4c1a4cf" string(10) "69636f6e76" string(2) "0a" Warning: fread(): iconv stream filter ("ISO-2022-JP"=>"EUC-JP"): invalid multibyte sequence in %s on line %d string(0) "" string(0) "" string(0) "" ---- ACTUAL OUTPUT string(20) "1b244224332473244b24" string(10) "41244f1b28" string(2) "42" string(20) "a4b3a4f3a4cba4c1a4cf" string(10) "69636f6e76" string(2) "0a" string(20) "1b244f24332466245824" string(10) "4e24421b28" string(2) "4f" ---- FAILED ================================================================================ 007+ string(20) "1b244f24332466245824" 008+ string(10) "4e24421b28" 009+ string(2) "4f" 007- 008- Warning: fread(): iconv stream filter ("ISO-2022-JP"=>"EUC-JP"): invalid multibyte sequence in %s on line %d 009- string(0) "" 010- string(0) "" 011- string(0) "" ================================================================================ ================================================================================ /cvs/php-src/ext/pdo_sqlite/tests/pdo_026.phpt ================================================================================ ---- EXPECTED OUTPUT string(11) "PDODatabase" string(12) "PDOStatement" PDODatabase::query() PDOStatementX::__construct() string(13) "PDOStatementX" string(11) "PDODatabase" array(3) { ["id"]=> string(2) "10" ["val"]=> string(3) "Abc" ["val2"]=> string(3) "zxy" } array(3) { ["id"]=> string(2) "20" ["val"]=> string(3) "Def" ["val2"]=> string(3) "wvu" } array(3) { ["id"]=> string(2) "30" ["val"]=> string(3) "Ghi" ["val2"]=> string(3) "tsr" } ===DONE=== PDODatabase::__destruct() PDOStatementX::__destruct() ---- ACTUAL OUTPUT Notice: Undefined variable: USER in /cvs/php-src/ext/pdo/tests/pdo_026.inc on line 48 Notice: Undefined variable: PASSWD in /cvs/php-src/ext/pdo/tests/pdo_026.inc on line 48 string(11) "PDODatabase" string(12) "PDOStatement" PDODatabase::query() PDOStatementX::__construct() string(13) "PDOStatementX" string(11) "PDODatabase" array(3) { ["id"]=> string(2) "10" ["val"]=> string(3) "Abc" ["val2"]=> string(3) "zxy" } array(3) { ["id"]=> string(2) "20" ["val"]=> string(3) "Def" ["val2"]=> string(3) "wvu" } array(3) { ["id"]=> string(2) "30" ["val"]=> string(3) "Ghi" ["val2"]=> string(3) "tsr" } ===DONE=== PDODatabase::__destruct() PDOStatementX::__destruct() ---- FAILED ================================================================================ 001+ Notice: Undefined variable: USER in /cvs/php-src/ext/pdo/tests/pdo_026.inc on line 48 002+ 003+ Notice: Undefined variable: PASSWD in /cvs/php-src/ext/pdo/tests/pdo_026.inc on line 48 ================================================================================ ================================================================================ /cvs/php-src/ext/sqlite/tests/pdo/pdo_026.phpt ================================================================================ ---- EXPECTED OUTPUT string(11) "PDODatabase" string(12) "PDOStatement" PDODatabase::query() PDOStatementX::__construct() string(13) "PDOStatementX" string(11) "PDODatabase" array(3) { ["id"]=> string(2) "10" ["val"]=> string(3) "Abc" ["val2"]=> string(3) "zxy" } array(3) { ["id"]=> string(2) "20" ["val"]=> string(3) "Def" ["val2"]=> string(3) "wvu" } array(3) { ["id"]=> string(2) "30" ["val"]=> string(3) "Ghi" ["val2"]=> string(3) "tsr" } ===DONE=== PDODatabase::__destruct() PDOStatementX::__destruct() ---- ACTUAL OUTPUT Notice: Undefined variable: USER in /cvs/php-src/ext/pdo/tests/pdo_026.inc on line 48 Notice: Undefined variable: PASSWD in /cvs/php-src/ext/pdo/tests/pdo_026.inc on line 48 string(11) "PDODatabase" string(12) "PDOStatement" PDODatabase::query() PDOStatementX::__construct() string(13) "PDOStatementX" string(11) "PDODatabase" array(3) { ["id"]=> string(2) "10" ["val"]=> string(3) "Abc" ["val2"]=> string(3) "zxy" } array(3) { ["id"]=> string(2) "20" ["val"]=> string(3) "Def" ["val2"]=> string(3) "wvu" } array(3) { ["id"]=> string(2) "30" ["val"]=> string(3) "Ghi" ["val2"]=> string(3) "tsr" } ===DONE=== PDODatabase::__destruct() PDOStatementX::__destruct() ---- FAILED ================================================================================ 001+ Notice: Undefined variable: USER in /cvs/php-src/ext/pdo/tests/pdo_026.inc on line 48 002+ 003+ Notice: Undefined variable: PASSWD in /cvs/php-src/ext/pdo/tests/pdo_026.inc on line 48 ================================================================================ ================================================================================ /cvs/php-src/ext/standard/tests/file/fputcsv.phpt ================================================================================ ---- EXPECTED OUTPUT $list = array ( 0 => 'aaa,bbb', 1 => 'aaa,"""bbb"""', 2 => '"""aaa""","""bbb"""', 3 => 'aaa,bbb', 4 => '"""aaa""",bbb', 5 => '"""aaa"""," ""bbb"""', 6 => ',', 7 => 'aaa,', 8 => ',"""aaa"""', 9 => '"""""",""""""', 10 => '"""""""""""""",', 11 => '"""""""""""",aaa', 12 => 'aaa,"bbb "', 13 => 'aaa,"""bbb """', 14 => '"aaa""aaa""","""bbb""bbb"', 15 => '"aaa""aaa""""""",bbb', 16 => 'aaa,"""\\""bbb",ccc', 17 => '"aaa""\\""a""","""bbb"""', 18 => '"""\\""""","""aaa"""', 19 => '"""\\""""""",aaa', ); $list = array ( 0 => 'aaa,bbb', 1 => 'aaa,"bbb"', 2 => '"aaa","bbb"', 3 => 'aaa,bbb', 4 => '"aaa",bbb', 5 => '"aaa", "bbb"', 6 => ',', 7 => 'aaa,', 8 => ',"aaa"', 9 => '"",""', 10 => '"""""",', 11 => '""""",aaa', 12 => 'aaa,bbb ', 13 => 'aaa,"bbb "', 14 => 'aaa"aaa","bbb"bbb', 15 => 'aaa"aaa""",bbb', 16 => 'aaa,"\\"bbb,ccc', 17 => 'aaa"\\"a","bbb"', 18 => '"\\"","aaa"', 19 => '"\\""",aaa', ); ===DONE=== ---- ACTUAL OUTPUT $list = array ( 0 => 'aaa,bbb', 1 => 'aaa,"""bbb"""', 2 => '"""aaa""","""bbb"""', 3 => 'aaa,bbb', 4 => '"""aaa""",bbb', 5 => '"""aaa"""," ""bbb"""', 6 => ',', 7 => 'aaa,', 8 => ',"""aaa"""', 9 => '"""""",""""""', 10 => '"""""""""""""",', 11 => '"""""""""""",aaa', 12 => 'aaa,"bbb "', 13 => 'aaa,"""bbb """', 14 => '"aaa""aaa""","""bbb""bbb"', 15 => '"aaa""aaa""""""",bbb', 16 => 'aaa,"""\\""bbb",ccc', 17 => '"aaa""\\""a""","""bbb"""', 18 => '"""\\""""","""aaa"""', 19 => '"""\\""""""",aaa', ); $list = array ( 0 => 'aaa,bbb', 1 => 'aaa,"bbb"', 2 => '"aaa","bbb"', 3 => 'aaa,bbb', 4 => '"aaa",bbb', 5 => '"aaa", "bbb"', 6 => ',', 7 => 'aaa,', 8 => ',"aaa"', 9 => '"",""', 10 => '"""""",', 11 => '""""",aaa', 12 => 'aaa,bbb ', 13 => 'aaa,"bbb "', 14 => 'aaa"aaa","bbb"bbb', 15 => 'aaa"aaa""",bbb', 16 => 'aaa,"\\"bbb",ccc', 17 => 'aaa"\\"a""","bbb"', 18 => '"\\""","aaa"""', 19 => '"\\"""",aaa ', ); ===DONE=== ---- FAILED ================================================================================ 040+ 16 => 'aaa,"\\"bbb",ccc', 041+ 17 => 'aaa"\\"a""","bbb"', 042+ 18 => '"\\""","aaa"""', 043+ 19 => '"\\"""",aaa 044+ ', 040- 16 => 'aaa,"\\"bbb,ccc', 041- 17 => 'aaa"\\"a","bbb"', 042- 18 => '"\\"","aaa"', 043- 19 => '"\\""",aaa', ================================================================================ ================================================================================ /cvs/php-src/ext/xml/tests/bug26614.phpt ================================================================================ ---- EXPECTED OUTPUT CDATA <DATA> at line 2, col 0 (byte 45) </DATA> at line 9, col 0 (byte 90) Comment <DATA> at line 2, col 0 (byte 45) </DATA> at line 9, col 0 (byte 90) Text <DATA> at line 2, col 0 (byte 45) </DATA> at line 9, col 0 (byte 90) ---- ACTUAL OUTPUT CDATA <DATA> at line 2, col 6 (byte 9) </DATA> at line 9, col 8 (byte 56) Comment <DATA> at line 2, col 6 (byte 9) </DATA> at line 9, col 8 (byte 56) Text <DATA> at line 2, col 6 (byte 9) </DATA> at line 9, col 8 (byte 56) ---- FAILED ================================================================================ 002+ <DATA> at line 2, col 6 (byte 9) 003+ </DATA> at line 9, col 8 (byte 56) 002- <DATA> at line 2, col 0 (byte 45) 003- </DATA> at line 9, col 0 (byte 90) 005+ <DATA> at line 2, col 6 (byte 9) 006+ </DATA> at line 9, col 8 (byte 56) 005- <DATA> at line 2, col 0 (byte 45) 006- </DATA> at line 9, col 0 (byte 90) 008+ <DATA> at line 2, col 6 (byte 9) 009+ </DATA> at line 9, col 8 (byte 56) 008- <DATA> at line 2, col 0 (byte 45) 009- </DATA> at line 9, col 0 (byte 90) ================================================================================ ================================================================================ BUILD ENVIRONMENT ================================================================================ OS: Linux - Linux linux.mshome.net 2.6.11.10 #2 Sat May 28 12:09:55 WEST 2005 i686 Automake: automake (GNU automake) 1.9.5 Written by Tom Tromey <tromey@redhat.com>. Copyright 2005 Free Software Foundation, Inc. This is free software; see the source for copying conditions. There is NO warranty; not even for MERCHANTABILITY or FITNESS FOR A PARTICULAR PURPOSE. Autoconf: autoconf (GNU Autoconf) 2.59 Written by David J. MacKenzie and Akim Demaille. Copyright (C) 2003 Free Software Foundation, Inc. This is free software; see the source for copying conditions. There is NO warranty; not even for MERCHANTABILITY or FITNESS FOR A PARTICULAR PURPOSE. Bundled Libtool: ltmain.sh (GNU libtool) 1.5.18 (1.1220.2.245 2005/05/16 08:55:27) Copyright (C) 2005 Free Software Foundation, Inc. This is free software; see the source for copying conditions. There is NO warranty; not even for MERCHANTABILITY or FITNESS FOR A PARTICULAR PURPOSE. System Libtool: ltmain.sh (GNU libtool) 1.5.16 (1.1220.2.235 2005/04/25 18:13:26) Copyright (C) 2005 Free Software Foundation, Inc. This is free software; see the source for copying conditions. There is NO warranty; not even for MERCHANTABILITY or FITNESS FOR A PARTICULAR PURPOSE. Compiler: Reading specs from /usr/lib/gcc-lib/i686-pc-linux-gnu/3.3.5-20050130/specs Configured with: /var/tmp/portage/gcc-3.3.5.20050130-r1/work/gcc-3.3.5/configure --enable-version-specific-runtime-libs --prefix=/usr --bindir=/usr/i686-pc-linux-gnu/gcc-bin/3.3.5-20050130 --includedir=/usr/lib/gcc-lib/i686-pc-linux-gnu/3.3.5-20050130/include --datadir=/usr/share/gcc-data/i686-pc-linux-gnu/3.3.5-20050130 --mandir=/usr/share/gcc-data/i686-pc-linux-gnu/3.3.5-20050130/man --infodir=/usr/share/gcc-data/i686-pc-linux-gnu/3.3.5-20050130/info --with-gxx-include-dir=/usr/lib/gcc-lib/i686-pc-linux-gnu/3.3.5-20050130/include/g++-v3 --host=i686-pc-linux-gnu --disable-altivec --enable-nls --without-included-gettext --with-system-zlib --disable-checking --disable-werror --disable-libunwind-exceptions --disable-multilib --disable-libgcj --enable-languages=c,c++ --enable-shared --enable-threads=posix --enable-__cxa_atexit --enable-clocale=gnu Thread model: posix gcc version 3.3.5-20050130 (Gentoo Linux 3.3.5.20050130-r1, ssp-3.3.5.20050130-1, pie-8.7.7.1) Bison: bison (GNU Bison) 1.875d Written by Robert Corbett and Richard Stallman. Copyright (C) 2004 Free Software Foundation, Inc. This is free software; see the source for copying conditions. There is NO warranty; not even for MERCHANTABILITY or FITNESS FOR A PARTICULAR PURPOSE. Libraries: linux-gate.so.1 => (0xffffe000) libcrypt.so.1 => /lib/libcrypt.so.1 (0xb7faf000) libhistory.so.5 => /lib/libhistory.so.5 (0xb7fa8000) libreadline.so.5 => /lib/libreadline.so.5 (0xb7f7b000) libncurses.so.5 => /lib/libncurses.so.5 (0xb7f39000) libbz2.so.1 => /usr/lib/libbz2.so.1 (0xb7f2a000) libz.so.1 => /lib/libz.so.1 (0xb7f19000) libresolv.so.2 => /lib/libresolv.so.2 (0xb7f04000) libm.so.6 => /lib/libm.so.6 (0xb7ee1000) libdl.so.2 => /lib/libdl.so.2 (0xb7edd000) libnsl.so.1 => /lib/libnsl.so.1 (0xb7ec8000) libssl.so.0.9.7 => /usr/lib/libssl.so.0.9.7 (0xb7e97000) libcrypto.so.0.9.7 => /usr/lib/libcrypto.so.0.9.7 (0xb7d96000) libxml2.so.2 => /usr/lib/libxml2.so.2 (0xb7c87000) libpthread.so.0 => /lib/libpthread.so.0 (0xb7c35000) libc.so.6 => /lib/libc.so.6 (0xb7b1e000) libgpm.so.1 => /lib/libgpm.so.1 (0xb7b18000) /lib/ld-linux.so.2 (0xb7feb000) User's E-mail: nlopess at php dot net ================================================================================ PHPINFO ================================================================================ phpinfo() PHP Version => 5.1.0-dev System => Linux linux.mshome.net 2.6.11.10 #2 Sat May 28 12:09:55 WEST 2005 i686 Build Date => Jun 27 2005 19:07:47 Configure Command => './configure' '--disable-cgi' '--enable-pcntl' '--with-ftp' '--with-tidy' '--with-apxs2=/usr/local/apache2/bin/apxs' '--with-readline' '--with-bz2' '--with-zlib' '--with-openssl' '--with-zend-vm=GOTO' 'CFLAGS=-msse -msse2 -mmmx -pipe -O2 -g' Server API => Command Line Interface Virtual Directory Support => disabled Configuration File (php.ini) Path => /usr/local/lib PHP API => 20041225 PHP Extension => 20050617 Zend Extension => 220050617 Debug Build => no Thread Safety => disabled Zend Memory Manager => enabled IPv6 Support => enabled Registered PHP Streams => php, file, http, ftp, compress.bzip2, compress.zlib, https, ftps Registered Stream Socket Transports => tcp, udp, unix, udg, ssl, sslv3, sslv2, tls Registered Stream Filters => string.rot13, string.toupper, string.tolower, string.strip_tags, convert.*, convert.iconv.*, bzip2.*, zlib.* This program makes use of the Zend Scripting Language Engine: Zend Engine v2.1.0-dev, Copyright (c) 1998-2004 Zend Technologies _______________________________________________________________________ Configuration PHP Core Directive => Local Value => Master Value allow_call_time_pass_reference => On => On allow_url_fopen => On => On always_populate_raw_post_data => Off => Off arg_separator.input => & => & arg_separator.output => & => & asp_tags => Off => Off auto_append_file => no value => no value auto_globals_jit => On => On auto_prepend_file => no value => no value browscap => no value => no value default_charset => no value => no value default_mimetype => text/html => text/html define_syslog_variables => Off => Off disable_classes => no value => no value disable_functions => no value => no value display_errors => On => On display_startup_errors => Off => Off doc_root => no value => no value docref_ext => no value => no value docref_root => no value => no value enable_dl => On => On error_append_string => no value => no value error_log => no value => no value error_prepend_string => no value => no value error_reporting => no value => no value expose_php => On => On extension_dir => /usr/local/lib/php/extensions/no-debug-non-zts-20050617 => /usr/local/lib/php/extensions/no-debug-non-zts-20050617 file_uploads => On => On highlight.bg => #FFFFFF => #FFFFFF highlight.comment => #FF8000 => #FF8000 highlight.default => #0000BB => #0000BB highlight.html => #000000 => #000000 highlight.keyword => #007700 => #007700 highlight.string => #DD0000 => #DD0000 html_errors => Off => On ignore_repeated_errors => Off => Off ignore_repeated_source => Off => Off ignore_user_abort => Off => Off implicit_flush => On => Off include_path => .:/usr/local/lib/php => .:/usr/local/lib/php log_errors => Off => Off log_errors_max_len => 1024 => 1024 magic_quotes_gpc => On => On magic_quotes_runtime => Off => Off magic_quotes_sybase => Off => Off mail.force_extra_parameters => no value => no value max_execution_time => 0 => 30 max_input_time => -1 => -1 open_basedir => no value => no value output_buffering => 0 => 0 output_handler => no value => no value post_max_size => 8M => 8M precision => 14 => 14 realpath_cache_size => 16K => 16K realpath_cache_ttl => 120 => 120 register_argc_argv => On => On register_globals => Off => Off register_long_arrays => On => On report_memleaks => On => On report_zend_debug => Off => Off safe_mode => Off => Off safe_mode_exec_dir => /usr/local/php/bin => /usr/local/php/bin safe_mode_gid => Off => Off safe_mode_include_dir => no value => no value sendmail_from => no value => no value sendmail_path => /usr/sbin/sendmail -t -i => /usr/sbin/sendmail -t -i serialize_precision => 100 => 100 short_open_tag => On => On SMTP => localhost => localhost smtp_port => 25 => 25 sql.safe_mode => Off => Off track_errors => Off => Off unserialize_callback_func => no value => no value upload_max_filesize => 2M => 2M upload_tmp_dir => no value => no value user_dir => no value => no value variables_order => EGPCS => EGPCS xmlrpc_error_number => 0 => 0 xmlrpc_errors => Off => Off y2k_compliance => On => On zend.ze1_compatibility_mode => Off => Off bz2 BZip2 Support => Enabled Stream Wrapper support => compress.bz2:// Stream Filter support => bzip2.decompress, bzip2.compress BZip2 Version => 1.0.3, 15-Feb-2005 ctype ctype functions => enabled date date/time support => enabled dom DOM/XML => enabled DOM/XML API Version => 20031129 libxml Version => 2.6.17 HTML Support => enabled XPath Support => enabled XPointer Support => enabled Schema Support => enabled RelaxNG Support => enabled iconv iconv support => enabled iconv implementation => glibc iconv library version => 2.3.4 Directive => Local Value => Master Value iconv.input_encoding => ISO-8859-1 => ISO-8859-1 iconv.internal_encoding => ISO-8859-1 => ISO-8859-1 iconv.output_encoding => ISO-8859-1 => ISO-8859-1 libxml libXML support => active libXML Version => 2.6.17 libXML streams => enabled openssl OpenSSL support => enabled OpenSSL Version => OpenSSL 0.9.7e 25 Oct 2004 pcntl pcntl support => enabled pcre PCRE (Perl Compatible Regular Expressions) Support => enabled PCRE Library Version => 5.0 13-Sep-2004 PDO PDO support => enabled PDO drivers => sqlite2, sqlite pdo_sqlite PDO Driver for SQLite 3.x => enabled PECL Module version => (bundled) 0.3 $Id: pdo_sqlite.c,v 1.9 2005/06/23 00:19:16 helly Exp $ SQLite Library => 3.1.3 posix Revision => $Revision: 1.67 $ session Session Support => enabled Registered save handlers => files user sqlite Registered serializer handlers => php php_binary Directive => Local Value => Master Value session.auto_start => Off => Off session.bug_compat_42 => On => On session.bug_compat_warn => On => On session.cache_expire => 180 => 180 session.cache_limiter => nocache => nocache session.cookie_domain => no value => no value session.cookie_lifetime => 0 => 0 session.cookie_path => / => / session.cookie_secure => Off => Off session.entropy_file => no value => no value session.entropy_length => 0 => 0 session.gc_divisor => 100 => 100 session.gc_maxlifetime => 1440 => 1440 session.gc_probability => 1 => 1 session.hash_bits_per_character => 4 => 4 session.hash_function => 0 => 0 session.name => PHPSESSID => PHPSESSID session.referer_check => no value => no value session.save_handler => files => files session.save_path => no value => no value session.serialize_handler => php => php session.use_cookies => On => On session.use_only_cookies => Off => Off session.use_trans_sid => 0 => 0 SimpleXML Simplexml support => enabled Revision => $Revision: 1.148 $ Schema support => enabled SPL SPL support => enabled Interfaces => Countable, Observer, OuterIterator, RecursiveIterator, SeekableIterator, Subject Classes => AppendIterator, ArrayObject, ArrayIterator, BadFunctionCallException, CachingIterator, CachingRecursiveIterator, DirectoryIterator, DomainException, EmptyIterator, FileObject, FilterIterator, InfiniteIterator, InvalidArgumentException, IteratorIterator, LengthException, LimitIterator, LogicException, NoRewindIterator, OutOfRangeException, OutOfBoundsException, OverflowException, ParentIterator, RangeException, RecursiveDirectoryIterator, RecursiveIteratorIterator, RuntimeException, SimpleXMLIterator, UnderflowException SQLite SQLite support => enabled PECL Module version => 2.0-dev $Id: sqlite.c,v 1.165 2005/06/17 16:42:53 sniper Exp $ SQLite Library => 2.8.14 SQLite Encoding => iso8859 Directive => Local Value => Master Value sqlite.assoc_case => 0 => 0 standard Regex Library => Bundled library enabled Dynamic Library Support => enabled Path to sendmail => /usr/sbin/sendmail -t -i Directive => Local Value => Master Value assert.active => 1 => 1 assert.bail => 0 => 0 assert.callback => no value => no value assert.quiet_eval => 0 => 0 assert.warning => 1 => 1 auto_detect_line_endings => 0 => 0 date.default_latitude => 31.7667 => 31.7667 date.default_longitude => 35.2333 => 35.2333 date.sunrise_zenith => 90.83 => 90.83 date.sunset_zenith => 90.83 => 90.83 default_socket_timeout => 60 => 60 safe_mode_allowed_env_vars => PHP_ => PHP_ safe_mode_protected_env_vars => LD_LIBRARY_PATH => LD_LIBRARY_PATH url_rewriter.tags => a=href,area=href,frame=src,form=,fieldset= => a=href,area=href,frame=src,form=,fieldset= user_agent => no value => no value tidy Tidy support => enabled libTidy Release => 1 May 2005 Extension Version => 2.0 ($Id: tidy.c,v 1.65 2005/04/25 20:46:16 john Exp $) Directive => Local Value => Master Value tidy.clean_output => 0 => 0 tidy.default_config => no value => no value tokenizer Tokenizer Support => enabled xml XML Support => active XML Namespace Support => active libxml2 Version => 2.6.17 zlib ZLib Support => enabled Stream Wrapper support => compress.zlib:// Stream Filter support => zlib.inflate, zlib.deflate Compiled Version => 1.2.2 Linked Version => 1.2.2 Directive => Local Value => Master Value zlib.output_compression => Off => Off zlib.output_compression_level => -1 => -1 zlib.output_handler => no value => no value Additional Modules Module Name readline Environment Variable => Value MANPATH => /usr/local/share/man:/usr/share/man:/usr/share/binutils-data/i686-pc-linux-gnu/2.15.92.0.2/man:/usr/share/gcc-data/i686-pc-linux-gnu/3.3.5-20050130/man::/opt/blackdown-jdk-1.4.2.02/man:/usr/qt/3/doc/man KDE_MULTIHEAD => false HOSTNAME => linux TEST_PHP_SRCDIR => /cvs/php-src SHELL => /bin/sh TERM => xterm MAKEFLAGS => SSH_CLIENT => deleted GTK2_RC_FILES => /etc/gtk-2.0/gtkrc:/root/.gtkrc-2.0:/root/.kde3.3/share/config/gtkrc GTK_RC_FILES => /etc/gtk/gtkrc:/root/.gtkrc:/root/.kde3.3/share/config/gtkrc CVSROOT => :pserver:nlopess@cvs.php.net:/repository GS_LIB => /root/.fonts WINDOWID => 29360133 QTDIR => /usr/qt/3 SSH_TTY => deleted ANT_HOME => /usr/share/ant-core KDE_FULL_SESSION => true USER => root XCURSOR_SIZE => SCRIPT_FILENAME => GDK_USE_XFT => 1 SSH_AUTH_SOCK => deleted SESSION_MANAGER => local/linux.mshome.net:/tmp/.ICE-unix/6759 MAKELEVEL => 1 CONFIG_PROTECT_MASK => /etc/terminfo PAGER => /usr/bin/less MFLAGS => XINITRC => /etc/X11/xinit/xinitrc KONSOLE_DCOP => DCOPRef(konsole-6777,konsole) PATH => /usr/kde/3.3/bin:/usr/local/sbin:/usr/local/bin:/usr/sbin:/usr/bin:/sbin:/bin:/opt/bin:/usr/i686-pc-linux-gnu/gcc-bin/3.3.5-20050130:/usr/i386-pc-linux-gnu/gcc-bin/3.3.5:/opt/blackdown-jdk-1.4.2.02/bin:/opt/blackdown-jdk-1.4.2.02/jre/bin:/usr/qt/3/bin:/usr/kde/3.3/sbin:/usr/kde/3.3/bin MAIL => /var/mail/root _ => /cvs/php-src/sapi/cli/php KONSOLE_DCOP_SESSION => DCOPRef(konsole-6777,session-1) PWD => /cvs/php-src JAVA_HOME => /opt/blackdown-jdk-1.4.2.02 EDITOR => /bin/nano JAVAC => /opt/blackdown-jdk-1.4.2.02/bin/javac TEST_PHP_EXECUTABLE => /cvs/php-src/sapi/cli/php REDIRECT_STATUS => QMAKESPEC => linux-g++ KDEDIRS => /usr KDE_MALLOC => 1 PATH_TRANSLATED => JDK_HOME => /opt/blackdown-jdk-1.4.2.02 HOME => /root SHLVL => 6 CONTENT_LENGTH => XCURSOR_THEME => default LOGNAME => root LESS => -R QUERY_STRING => GCC_SPECS => CVS_RSH => ssh SSH_CONNECTION => deleted CLASSPATH => . LESSOPEN => |lesspipe.sh %s INFOPATH => /usr/share/info:/usr/share/binutils-data/i686-pc-linux-gnu/2.15.92.0.2/info:/usr/share/gcc-data/i686-pc-linux-gnu/3.3.5-20050130/info CONTENT_TYPE => DISPLAY => :0.0 CC => gcc OPENGL_PROFILE => nvidia REQUEST_METHOD => G_BROKEN_FILENAMES => 1 CONFIG_PROTECT => /usr/lib/X11/xkb /usr/kde/3.3/share/config /usr/kde/3.3/env /usr/kde/3.3/shutdown /usr/share/config XAUTHORITY => /root/.Xauthority COLORTERM => PHP Variables Variable => Value _SERVER["MANPATH"] => /usr/local/share/man:/usr/share/man:/usr/share/binutils-data/i686-pc-linux-gnu/2.15.92.0.2/man:/usr/share/gcc-data/i686-pc-linux-gnu/3.3.5-20050130/man::/opt/blackdown-jdk-1.4.2.02/man:/usr/qt/3/doc/man _SERVER["KDE_MULTIHEAD"] => false _SERVER["HOSTNAME"] => linux _SERVER["TEST_PHP_SRCDIR"] => /cvs/php-src _SERVER["SHELL"] => /bin/sh _SERVER["TERM"] => xterm _SERVER["MAKEFLAGS"] => _SERVER["SSH_CLIENT"] => deleted _SERVER["GTK2_RC_FILES"] => /etc/gtk-2.0/gtkrc:/root/.gtkrc-2.0:/root/.kde3.3/share/config/gtkrc _SERVER["GTK_RC_FILES"] => /etc/gtk/gtkrc:/root/.gtkrc:/root/.kde3.3/share/config/gtkrc _SERVER["CVSROOT"] => :pserver:nlopess@cvs.php.net:/repository _SERVER["GS_LIB"] => /root/.fonts _SERVER["WINDOWID"] => 29360133 _SERVER["QTDIR"] => /usr/qt/3 _SERVER["SSH_TTY"] => deleted _SERVER["ANT_HOME"] => /usr/share/ant-core _SERVER["KDE_FULL_SESSION"] => true _SERVER["USER"] => root _SERVER["XCURSOR_SIZE"] => _SERVER["SCRIPT_FILENAME"] => _SERVER["GDK_USE_XFT"] => 1 _SERVER["SSH_AUTH_SOCK"] => deleted _SERVER["SESSION_MANAGER"] => local/linux.mshome.net:/tmp/.ICE-unix/6759 _SERVER["MAKELEVEL"] => 1 _SERVER["CONFIG_PROTECT_MASK"] => /etc/terminfo _SERVER["PAGER"] => /usr/bin/less _SERVER["MFLAGS"] => _SERVER["XINITRC"] => /etc/X11/xinit/xinitrc _SERVER["KONSOLE_DCOP"] => DCOPRef(konsole-6777,konsole) _SERVER["PATH"] => /usr/kde/3.3/bin:/usr/local/sbin:/usr/local/bin:/usr/sbin:/usr/bin:/sbin:/bin:/opt/bin:/usr/i686-pc-linux-gnu/gcc-bin/3.3.5-20050130:/usr/i386-pc-linux-gnu/gcc-bin/3.3.5:/opt/blackdown-jdk-1.4.2.02/bin:/opt/blackdown-jdk-1.4.2.02/jre/bin:/usr/qt/3/bin:/usr/kde/3.3/sbin:/usr/kde/3.3/bin _SERVER["MAIL"] => /var/mail/root _SERVER["_"] => /cvs/php-src/sapi/cli/php _SERVER["KONSOLE_DCOP_SESSION"] => DCOPRef(konsole-6777,session-1) _SERVER["PWD"] => /cvs/php-src _SERVER["JAVA_HOME"] => /opt/blackdown-jdk-1.4.2.02 _SERVER["EDITOR"] => /bin/nano _SERVER["JAVAC"] => /opt/blackdown-jdk-1.4.2.02/bin/javac _SERVER["TEST_PHP_EXECUTABLE"] => /cvs/php-src/sapi/cli/php _SERVER["REDIRECT_STATUS"] => _SERVER["QMAKESPEC"] => linux-g++ _SERVER["KDEDIRS"] => /usr _SERVER["KDE_MALLOC"] => 1 _SERVER["PATH_TRANSLATED"] => _SERVER["JDK_HOME"] => /opt/blackdown-jdk-1.4.2.02 _SERVER["HOME"] => /root _SERVER["SHLVL"] => 6 _SERVER["CONTENT_LENGTH"] => _SERVER["XCURSOR_THEME"] => default _SERVER["LOGNAME"] => root _SERVER["LESS"] => -R _SERVER["QUERY_STRING"] => _SERVER["GCC_SPECS"] => _SERVER["CVS_RSH"] => ssh _SERVER["SSH_CONNECTION"] => deleted _SERVER["CLASSPATH"] => . _SERVER["LESSOPEN"] => |lesspipe.sh %s _SERVER["INFOPATH"] => /usr/share/info:/usr/share/binutils-data/i686-pc-linux-gnu/2.15.92.0.2/info:/usr/share/gcc-data/i686-pc-linux-gnu/3.3.5-20050130/info _SERVER["CONTENT_TYPE"] => _SERVER["DISPLAY"] => :0.0 _SERVER["CC"] => gcc _SERVER["OPENGL_PROFILE"] => nvidia _SERVER["REQUEST_METHOD"] => _SERVER["G_BROKEN_FILENAMES"] => 1 _SERVER["CONFIG_PROTECT"] => /usr/lib/X11/xkb /usr/kde/3.3/share/config /usr/kde/3.3/env /usr/kde/3.3/shutdown /usr/share/config _SERVER["XAUTHORITY"] => /root/.Xauthority _SERVER["COLORTERM"] => _SERVER["PHP_SELF"] => _SERVER["SCRIPT_NAME"] => _SERVER["DOCUMENT_ROOT"] => _SERVER["REQUEST_TIME"] => 1119896196 _SERVER["argv"] => Array ( ) _SERVER["argc"] => 0 _ENV["MANPATH"] => /usr/local/share/man:/usr/share/man:/usr/share/binutils-data/i686-pc-linux-gnu/2.15.92.0.2/man:/usr/share/gcc-data/i686-pc-linux-gnu/3.3.5-20050130/man::/opt/blackdown-jdk-1.4.2.02/man:/usr/qt/3/doc/man _ENV["KDE_MULTIHEAD"] => false _ENV["HOSTNAME"] => linux _ENV["TEST_PHP_SRCDIR"] => /cvs/php-src _ENV["SHELL"] => /bin/sh _ENV["TERM"] => xterm _ENV["MAKEFLAGS"] => _ENV["SSH_CLIENT"] => deleted _ENV["GTK2_RC_FILES"] => /etc/gtk-2.0/gtkrc:/root/.gtkrc-2.0:/root/.kde3.3/share/config/gtkrc _ENV["GTK_RC_FILES"] => /etc/gtk/gtkrc:/root/.gtkrc:/root/.kde3.3/share/config/gtkrc _ENV["CVSROOT"] => :pserver:nlopess@cvs.php.net:/repository _ENV["GS_LIB"] => /root/.fonts _ENV["WINDOWID"] => 29360133 _ENV["QTDIR"] => /usr/qt/3 _ENV["SSH_TTY"] => deleted _ENV["ANT_HOME"] => /usr/share/ant-core _ENV["KDE_FULL_SESSION"] => true _ENV["USER"] => root _ENV["XCURSOR_SIZE"] => _ENV["SCRIPT_FILENAME"] => _ENV["GDK_USE_XFT"] => 1 _ENV["SSH_AUTH_SOCK"] => deleted _ENV["SESSION_MANAGER"] => local/linux.mshome.net:/tmp/.ICE-unix/6759 _ENV["MAKELEVEL"] => 1 _ENV["CONFIG_PROTECT_MASK"] => /etc/terminfo _ENV["PAGER"] => /usr/bin/less _ENV["MFLAGS"] => _ENV["XINITRC"] => /etc/X11/xinit/xinitrc _ENV["KONSOLE_DCOP"] => DCOPRef(konsole-6777,konsole) _ENV["PATH"] => /usr/kde/3.3/bin:/usr/local/sbin:/usr/local/bin:/usr/sbin:/usr/bin:/sbin:/bin:/opt/bin:/usr/i686-pc-linux-gnu/gcc-bin/3.3.5-20050130:/usr/i386-pc-linux-gnu/gcc-bin/3.3.5:/opt/blackdown-jdk-1.4.2.02/bin:/opt/blackdown-jdk-1.4.2.02/jre/bin:/usr/qt/3/bin:/usr/kde/3.3/sbin:/usr/kde/3.3/bin _ENV["MAIL"] => /var/mail/root _ENV["_"] => /cvs/php-src/sapi/cli/php _ENV["KONSOLE_DCOP_SESSION"] => DCOPRef(konsole-6777,session-1) _ENV["PWD"] => /cvs/php-src _ENV["JAVA_HOME"] => /opt/blackdown-jdk-1.4.2.02 _ENV["EDITOR"] => /bin/nano _ENV["JAVAC"] => /opt/blackdown-jdk-1.4.2.02/bin/javac _ENV["TEST_PHP_EXECUTABLE"] => /cvs/php-src/sapi/cli/php _ENV["REDIRECT_STATUS"] => _ENV["QMAKESPEC"] => linux-g++ _ENV["KDEDIRS"] => /usr _ENV["KDE_MALLOC"] => 1 _ENV["PATH_TRANSLATED"] => _ENV["JDK_HOME"] => /opt/blackdown-jdk-1.4.2.02 _ENV["HOME"] => /root _ENV["SHLVL"] => 6 _ENV["CONTENT_LENGTH"] => _ENV["XCURSOR_THEME"] => default _ENV["LOGNAME"] => root _ENV["LESS"] => -R _ENV["QUERY_STRING"] => _ENV["GCC_SPECS"] => _ENV["CVS_RSH"] => ssh _ENV["SSH_CONNECTION"] => deleted _ENV["CLASSPATH"] => . _ENV["LESSOPEN"] => |lesspipe.sh %s _ENV["INFOPATH"] => /usr/share/info:/usr/share/binutils-data/i686-pc-linux-gnu/2.15.92.0.2/info:/usr/share/gcc-data/i686-pc-linux-gnu/3.3.5-20050130/info _ENV["CONTENT_TYPE"] => _ENV["DISPLAY"] => :0.0 _ENV["CC"] => gcc _ENV["OPENGL_PROFILE"] => nvidia _ENV["REQUEST_METHOD"] => _ENV["G_BROKEN_FILENAMES"] => 1 _ENV["CONFIG_PROTECT"] => /usr/lib/X11/xkb /usr/kde/3.3/share/config /usr/kde/3.3/env /usr/kde/3.3/shutdown /usr/share/config _ENV["XAUTHORITY"] => /root/.Xauthority _ENV["COLORTERM"] => PHP License This program is free software; you can redistribute it and/or modify it under the terms of the PHP License as published by the PHP Group and included in the distribution in the file: LICENSE This program is distributed in the hope that it will be useful, but WITHOUT ANY WARRANTY; without even the implied warranty of MERCHANTABILITY or FITNESS FOR A PARTICULAR PURPOSE. If you did not receive a copy of the PHP license, or have any questions about PHP licensing, please contact license@php.net.

« previous php.qa (#25227) next »