Test results for 5.0.4 [failed]

From: Date: Thu, 18 Aug 2005 17:15:23 +0000
Subject: Test results for 5.0.4 [failed]
Groups: php.qa 
Request: Send a blank email to php-qa+get-25802@lists.php.net to get a copy of this message
===================================================================== FAILED TEST SUMMARY --------------------------------------------------------------------- Bug #31672 (one-line comment with </script>) [tests/basic/bug31672.phpt] Test for buffering in core functions with implicit flush off [tests/func/008.phpt] Convert warnings to exceptions [tests/lang/038.phpt] Bug #29944 (function defined in switch crashes PHP) [tests/lang/bug29944.phpt] Bug #22836 (returning references to NULL) [Zend/tests/bug22836.phpt] Test 3: Exception Test [ext/dom/tests/dom003.phpt] Bug #16069 [ext/iconv/tests/bug16069.phpt] iconv stream filter [ext/iconv/tests/iconv_stream_filter.phpt] HTML input/output [ext/mbstring/tests/htmlent.phpt] mb_output_handler() (Shift_JIS) [ext/mbstring/tests/mb_output_handler_shift_jis.phpt] mysqli connect [ext/mysqli/tests/001.phpt] mysqli bind_result 1 [ext/mysqli/tests/002.phpt] mysqli connect [ext/mysqli/tests/003.phpt] mysqli fetch char/text [ext/mysqli/tests/004.phpt] mysqli fetch char/text long [ext/mysqli/tests/005.phpt] mysqli fetch long values [ext/mysqli/tests/006.phpt] mysqli fetch short values [ext/mysqli/tests/007.phpt] mysqli fetch tinyint values [ext/mysqli/tests/008.phpt] mysqli fetch bigint values [ext/mysqli/tests/009.phpt] mysqli fetch float values [ext/mysqli/tests/010.phpt] mysqli fetch mixed values [ext/mysqli/tests/011.phpt] mysqli fetch mixed values 2 [ext/mysqli/tests/012.phpt] mysqli fetch mixed / mysql_query [ext/mysqli/tests/013.phpt] mysqli autocommit/commit/rollback [ext/mysqli/tests/014.phpt] mysqli autocommit/commit/rollback with myisam [ext/mysqli/tests/015.phpt] mysqli fetch user variable [ext/mysqli/tests/016.phpt] mysqli fetch functions [ext/mysqli/tests/017.phpt] mysqli fetch system variables [ext/mysqli/tests/018.phpt] mysqli fetch (bind_param + bind_result) [ext/mysqli/tests/019.phpt] mysqli bind_param/bind_result date [ext/mysqli/tests/020.phpt] mysqli bind_param+bind_result char/text [ext/mysqli/tests/021.phpt] mysqli bind_param/bind_result char/text long [ext/mysqli/tests/022.phpt] mysqli bind_param/bind_prepare fetch long values [ext/mysqli/tests/023.phpt] mysqli bind_param/bind_result short values [ext/mysqli/tests/024.phpt] mysqli bind_param/bind_result tinyint values [ext/mysqli/tests/025.phpt] mysqli bind_param/bind_result with send_long_data [ext/mysqli/tests/026.phpt] function test: mysqli_stat [ext/mysqli/tests/027.phpt] function test: mysqli_character_set_name [ext/mysqli/tests/028.phpt] function test: mysqli_affected_rows [ext/mysqli/tests/029.phpt] function test: mysqli_errno [ext/mysqli/tests/030.phpt] function test: mysqli_error [ext/mysqli/tests/031.phpt] function test: mysqli_info [ext/mysqli/tests/032.phpt] function test: mysqli_get_host_info [ext/mysqli/tests/033.phpt] function test: mysqli_get_proto_info [ext/mysqli/tests/034.phpt] function test: mysqli_get_server_info [ext/mysqli/tests/035.phpt] function test: mysqli_insert_id() [ext/mysqli/tests/036.phpt] function test: mysqli_field_count() [ext/mysqli/tests/037.phpt] function test: mysqli_num_fields() [ext/mysqli/tests/038.phpt] function test: mysqli_num_fields() 2 [ext/mysqli/tests/039.phpt] function test: mysqli_num_rows() [ext/mysqli/tests/040.phpt] function test: mysqli_warning_count() [ext/mysqli/tests/041.phpt] mysqli_fetch_object [ext/mysqli/tests/042.phpt] mysqli_bind_param (UPDATE) [ext/mysqli/tests/043.phpt] mysqli_get_server_version [ext/mysqli/tests/044.phpt] mysqli_bind_result (SHOW) [ext/mysqli/tests/045.phpt] mysqli_stmt_affected_rows (delete) [ext/mysqli/tests/046.phpt] mysqli_get_metadata [ext/mysqli/tests/047.phpt] mysqli bind_result (OO-Style) [ext/mysqli/tests/048.phpt] mysql_fetch_row (OO-Style) [ext/mysqli/tests/049.phpt] non freed statement test [ext/mysqli/tests/050.phpt] free statement after close [ext/mysqli/tests/051.phpt] call statement after close [ext/mysqli/tests/052.phpt] not freed resultset [ext/mysqli/tests/053.phpt] free resultset after close [ext/mysqli/tests/054.phpt] free nothing [ext/mysqli/tests/055.phpt] extend mysqli [ext/mysqli/tests/056.phpt] mysqli_get_metadata [ext/mysqli/tests/057.phpt] multiple binds [ext/mysqli/tests/058.phpt] sqlmode + bind [ext/mysqli/tests/059.phpt] mysqli_fetch_object with classes [ext/mysqli/tests/060.phpt] local infile handler [ext/mysqli/tests/061.phpt] constructor test [ext/mysqli/tests/bug29311.phpt] Bug #30967 testcase (properties) [ext/mysqli/tests/bug30967.phpt] Bug #29992 (foreach by reference corrupts the array) [ext/standard/tests/array/bug29992.phpt] Bug #31213 (Sideeffects caused by bug #29493) [ext/standard/tests/array/bug31213.phpt] Bug #22414 (passthru() does not read data correctly) [ext/standard/tests/file/bug22414.phpt] date_sunrise() and date_sunset() functions [ext/standard/tests/general_functions/sunfuncts.phpt] Bug #31402 (unserialize() generates references when it should not) [ext/standard/tests/serialize/bug31402.phpt] Bug #20382 (strtotime ("Monday", $date) produces wrong result on DST changeover) [ext/standard/tests/time/bug20382.phpt] Bug #26614 (CDATA sections skipped on line count) [ext/xml/tests/bug26614.phpt] ===================================================================== ===================================================================== TEST RESULT SUMMARY --------------------------------------------------------------------- Exts skipped : 62 Exts tested : 21 --------------------------------------------------------------------- Number of tests : 1333 772 Tests skipped : 561 ( 42.1%) -------- Tests warned : 0 ( 0.0%) ( 0.0%) Tests failed : 80 ( 6.0%) ( 10.4%) Tests passed : 692 ( 51.9%) ( 89.6%) --------------------------------------------------------------------- Time taken : 98 seconds ===================================================================== ===================================================================== FAILED TEST SUMMARY --------------------------------------------------------------------- Bug #31672 (one-line comment with </script>) [tests/basic/bug31672.phpt] Test for buffering in core functions with implicit flush off [tests/func/008.phpt] Convert warnings to exceptions [tests/lang/038.phpt] Bug #29944 (function defined in switch crashes PHP) [tests/lang/bug29944.phpt] Bug #22836 (returning references to NULL) [Zend/tests/bug22836.phpt] Test 3: Exception Test [ext/dom/tests/dom003.phpt] Bug #16069 [ext/iconv/tests/bug16069.phpt] iconv stream filter [ext/iconv/tests/iconv_stream_filter.phpt] HTML input/output [ext/mbstring/tests/htmlent.phpt] mb_output_handler() (Shift_JIS) [ext/mbstring/tests/mb_output_handler_shift_jis.phpt] mysqli connect [ext/mysqli/tests/001.phpt] mysqli bind_result 1 [ext/mysqli/tests/002.phpt] mysqli connect [ext/mysqli/tests/003.phpt] mysqli fetch char/text [ext/mysqli/tests/004.phpt] mysqli fetch char/text long [ext/mysqli/tests/005.phpt] mysqli fetch long values [ext/mysqli/tests/006.phpt] mysqli fetch short values [ext/mysqli/tests/007.phpt] mysqli fetch tinyint values [ext/mysqli/tests/008.phpt] mysqli fetch bigint values [ext/mysqli/tests/009.phpt] mysqli fetch float values [ext/mysqli/tests/010.phpt] mysqli fetch mixed values [ext/mysqli/tests/011.phpt] mysqli fetch mixed values 2 [ext/mysqli/tests/012.phpt] mysqli fetch mixed / mysql_query [ext/mysqli/tests/013.phpt] mysqli autocommit/commit/rollback [ext/mysqli/tests/014.phpt] mysqli autocommit/commit/rollback with myisam [ext/mysqli/tests/015.phpt] mysqli fetch user variable [ext/mysqli/tests/016.phpt] mysqli fetch functions [ext/mysqli/tests/017.phpt] mysqli fetch system variables [ext/mysqli/tests/018.phpt] mysqli fetch (bind_param + bind_result) [ext/mysqli/tests/019.phpt] mysqli bind_param/bind_result date [ext/mysqli/tests/020.phpt] mysqli bind_param+bind_result char/text [ext/mysqli/tests/021.phpt] mysqli bind_param/bind_result char/text long [ext/mysqli/tests/022.phpt] mysqli bind_param/bind_prepare fetch long values [ext/mysqli/tests/023.phpt] mysqli bind_param/bind_result short values [ext/mysqli/tests/024.phpt] mysqli bind_param/bind_result tinyint values [ext/mysqli/tests/025.phpt] mysqli bind_param/bind_result with send_long_data [ext/mysqli/tests/026.phpt] function test: mysqli_stat [ext/mysqli/tests/027.phpt] function test: mysqli_character_set_name [ext/mysqli/tests/028.phpt] function test: mysqli_affected_rows [ext/mysqli/tests/029.phpt] function test: mysqli_errno [ext/mysqli/tests/030.phpt] function test: mysqli_error [ext/mysqli/tests/031.phpt] function test: mysqli_info [ext/mysqli/tests/032.phpt] function test: mysqli_get_host_info [ext/mysqli/tests/033.phpt] function test: mysqli_get_proto_info [ext/mysqli/tests/034.phpt] function test: mysqli_get_server_info [ext/mysqli/tests/035.phpt] function test: mysqli_insert_id() [ext/mysqli/tests/036.phpt] function test: mysqli_field_count() [ext/mysqli/tests/037.phpt] function test: mysqli_num_fields() [ext/mysqli/tests/038.phpt] function test: mysqli_num_fields() 2 [ext/mysqli/tests/039.phpt] function test: mysqli_num_rows() [ext/mysqli/tests/040.phpt] function test: mysqli_warning_count() [ext/mysqli/tests/041.phpt] mysqli_fetch_object [ext/mysqli/tests/042.phpt] mysqli_bind_param (UPDATE) [ext/mysqli/tests/043.phpt] mysqli_get_server_version [ext/mysqli/tests/044.phpt] mysqli_bind_result (SHOW) [ext/mysqli/tests/045.phpt] mysqli_stmt_affected_rows (delete) [ext/mysqli/tests/046.phpt] mysqli_get_metadata [ext/mysqli/tests/047.phpt] mysqli bind_result (OO-Style) [ext/mysqli/tests/048.phpt] mysql_fetch_row (OO-Style) [ext/mysqli/tests/049.phpt] non freed statement test [ext/mysqli/tests/050.phpt] free statement after close [ext/mysqli/tests/051.phpt] call statement after close [ext/mysqli/tests/052.phpt] not freed resultset [ext/mysqli/tests/053.phpt] free resultset after close [ext/mysqli/tests/054.phpt] free nothing [ext/mysqli/tests/055.phpt] extend mysqli [ext/mysqli/tests/056.phpt] mysqli_get_metadata [ext/mysqli/tests/057.phpt] multiple binds [ext/mysqli/tests/058.phpt] sqlmode + bind [ext/mysqli/tests/059.phpt] mysqli_fetch_object with classes [ext/mysqli/tests/060.phpt] local infile handler [ext/mysqli/tests/061.phpt] constructor test [ext/mysqli/tests/bug29311.phpt] Bug #30967 testcase (properties) [ext/mysqli/tests/bug30967.phpt] Bug #29992 (foreach by reference corrupts the array) [ext/standard/tests/array/bug29992.phpt] Bug #31213 (Sideeffects caused by bug #29493) [ext/standard/tests/array/bug31213.phpt] Bug #22414 (passthru() does not read data correctly) [ext/standard/tests/file/bug22414.phpt] date_sunrise() and date_sunset() functions [ext/standard/tests/general_functions/sunfuncts.phpt] Bug #31402 (unserialize() generates references when it should not) [ext/standard/tests/serialize/bug31402.phpt] Bug #20382 (strtotime ("Monday", $date) produces wrong result on DST changeover) [ext/standard/tests/time/bug20382.phpt] Bug #26614 (CDATA sections skipped on line count) [ext/xml/tests/bug26614.phpt] ===================================================================== ================================================================================ /home/jwm/tmp/php-5.0.4/tests/basic/bug31672.phpt ================================================================================ ---- EXPECTED OUTPUT Foobar Foobar ---- ACTUAL OUTPUT Foobar Foo ---- FAILED ================================================================================ 002+ Foo 002- Foobar ================================================================================ ================================================================================ /home/jwm/tmp/php-5.0.4/tests/func/008.phpt ================================================================================ ---- EXPECTED OUTPUT 'foo1' 'foo2' ---- ACTUAL OUTPUT ---- FAILED ================================================================================ 001- 'foo1' 003- 'foo2' ================================================================================ ================================================================================ /home/jwm/tmp/php-5.0.4/tests/lang/038.phpt ================================================================================ ---- EXPECTED OUTPUT string(15) "Error2Exception" string(5) "fopen" ===DONE=== ---- ACTUAL OUTPUT string(15) "Error2Exception" string(15) "Error2Exception" ===DONE=== ---- FAILED ================================================================================ 002+ string(15) "Error2Exception" 002- string(5) "fopen" ================================================================================ ================================================================================ /home/jwm/tmp/php-5.0.4/tests/lang/bug29944.phpt ================================================================================ ---- EXPECTED OUTPUT 1 ===DONE=== ---- ACTUAL OUTPUT ---- FAILED ================================================================================ 001+ 001- 1 002- ===DONE=== ================================================================================ ================================================================================ /home/jwm/tmp/php-5.0.4/Zend/tests/bug22836.phpt ================================================================================ ---- EXPECTED OUTPUT string(3) "foo" 'foo' Notice: Undefined variable: a in %s on line %d Strict Standards: Only variable references should be returned by reference in %s on line %d string(3) "foo" 'foo' Notice: Undefined variable: a in %s on line %d Strict Standards: Only variable references should be returned by reference in %s on line %d string(3) "foo" 'foo' Notice: Undefined variable: a in %s on line %d Strict Standards: Only variable references should be returned by reference in %s on line %d string(3) "foo" 'foo' Notice: Undefined variable: a in %s on line %d Strict Standards: Only variable references should be returned by reference in %s on line %d string(3) "foo" 'foo' Notice: Undefined variable: a in %s on line %d Strict Standards: Only variable references should be returned by reference in %s on line %d string(3) "foo" 'foo' Notice: Undefined variable: a in %s on line %d Strict Standards: Only variable references should be returned by reference in %s on line %d string(3) "foo" 'foo' Notice: Undefined variable: a in %s on line %d Strict Standards: Only variable references should be returned by reference in %s on line %d string(3) "foo" 'foo' Notice: Undefined variable: a in %s on line %d Strict Standards: Only variable references should be returned by reference in %s on line %d string(3) "foo" 'foo' Notice: Undefined variable: a in %s on line %d Strict Standards: Only variable references should be returned by reference in %s on line %d ---- ACTUAL OUTPUT string(3) "foo" 'foo' Notice: Undefined variable: a in /home/jwm/tmp/php-5.0.4/Zend/tests/bug22836.php on line 7 Strict Standards: Only variable references should be returned by reference in /home/jwm/tmp/php-5.0.4/Zend/tests/bug22836.php on line 7 string(3) "foo" 'foo' Notice: Undefined variable: a in /home/jwm/tmp/php-5.0.4/Zend/tests/bug22836.php on line 7 Strict Standards: Only variable references should be returned by reference in /home/jwm/tmp/php-5.0.4/Zend/tests/bug22836.php on line 7 NULL 'foo' Notice: Undefined variable: a in /home/jwm/tmp/php-5.0.4/Zend/tests/bug22836.php on line 7 NULL 'foo' Notice: Undefined variable: a in /home/jwm/tmp/php-5.0.4/Zend/tests/bug22836.php on line 7 NULL 'foo' Notice: Undefined variable: a in /home/jwm/tmp/php-5.0.4/Zend/tests/bug22836.php on line 7 NULL 'foo' Notice: Undefined variable: a in /home/jwm/tmp/php-5.0.4/Zend/tests/bug22836.php on line 7 NULL 'foo' Notice: Undefined variable: a in /home/jwm/tmp/php-5.0.4/Zend/tests/bug22836.php on line 7 NULL 'foo' Notice: Undefined variable: a in /home/jwm/tmp/php-5.0.4/Zend/tests/bug22836.php on line 7 ---- FAILED ================================================================================ 013+ NULL 013- string(3) "foo" 017+ NULL 018+ 'foo' 018- Strict Standards: Only variable references should be returned by reference in %s on line %d 019- string(3) "foo" 020+ Notice: Undefined variable: a in /home/jwm/tmp/php-5.0.4/Zend/tests/bug22836.php on line 7 021+ NULL 022+ 'foo' 023+ 024+ Notice: Undefined variable: a in /home/jwm/tmp/php-5.0.4/Zend/tests/bug22836.php on line 7 025+ NULL 026+ 'foo' 027+ 028+ Notice: Undefined variable: a in /home/jwm/tmp/php-5.0.4/Zend/tests/bug22836.php on line 7 029+ NULL 030+ 'foo' 031+ 032+ Notice: Undefined variable: a in /home/jwm/tmp/php-5.0.4/Zend/tests/bug22836.php on line 7 033+ NULL 023- 024- Strict Standards: Only variable references should be returned by reference in %s on line %d 025- string(3) "foo" 026- 'foo' 027- 028- Notice: Undefined variable: a in %s on line %d 029- 030- Strict Standards: Only variable references should be returned by reference in %s on line %d 031- string(3) "foo" 032- 'foo' 033- 034- Notice: Undefined variable: a in %s on line %d 035- 036- Strict Standards: Only variable references should be returned by reference in %s on line %d 037- string(3) "foo" 038- 'foo' 039- 040- Notice: Undefined variable: a in %s on line %d 041- 042- Strict Standards: Only variable references should be returned by reference in %s on line %d 043- string(3) "foo" 044- 'foo' 045- 046- Notice: Undefined variable: a in %s on line %d 047- 048- Strict Standards: Only variable references should be returned by reference in %s on line %d 049- string(3) "foo" 050- 'foo' 051- 052- Notice: Undefined variable: a in %s on line %d 053- 054- Strict Standards: Only variable references should be returned by reference in %s on line %d ================================================================================ ================================================================================ /home/jwm/tmp/php-5.0.4/ext/dom/tests/dom003.phpt ================================================================================ ---- EXPECTED OUTPUT --- Catch exception with try/catch object(DOMException)#%d (6) { ["message:protected"]=> string(23) "Hierarchy Request Error" ["string:private"]=> string(0) "" ["file:protected"]=> string(%d) "%s/ext/dom/tests/dom003.php" ["line:protected"]=> int(8) ["trace:private"]=> array(0) { } ["code"]=> int(3) } --- Don't catch exception with try/catch Fatal error: Uncaught exception 'DOMException' with message 'Hierarchy Request Error' in %sdom003.php:%d Stack trace: #0 {main} thrown in %sdom003.php on line %d ---- ACTUAL OUTPUT --- Catch exception with try/catch object(DOMException)#3 (6) { ["message:protected"]=> string(23) "Hierarchy Request Error" ["string:private"]=> string(0) "" ["file:protected"]=> string(48) "/home/jwm/tmp/php-5.0.4/ext/dom/tests/dom003.php" ["line:protected"]=> int(8) ["trace:private"]=> array(1) { [0]=> array(6) { ["file"]=> string(48) "/home/jwm/tmp/php-5.0.4/ext/dom/tests/dom003.php" ["line"]=> int(8) ["function"]=> string(11) "appendChild" ["class"]=> string(10) "DOMElement" ["type"]=> string(2) "->" ["args"]=> array(1) { [0]=> object(DOMElement)#2 (0) { } } } } ["code"]=> int(3) } --- Don't catch exception with try/catch Fatal error: Uncaught exception 'DOMException' with message 'Hierarchy Request Error' in /home/jwm/tmp/php-5.0.4/ext/dom/tests/dom003.php:13 Stack trace: #0 /home/jwm/tmp/php-5.0.4/ext/dom/tests/dom003.php(13): DOMElement->appendChild(Object(DOMElement)) #1 {main} thrown in /home/jwm/tmp/php-5.0.4/ext/dom/tests/dom003.php on line 13 ---- FAILED ================================================================================ 012+ array(1) { 013+ [0]=> 014+ array(6) { 015+ ["file"]=> 016+ string(48) "/home/jwm/tmp/php-5.0.4/ext/dom/tests/dom003.php" 017+ ["line"]=> 018+ int(8) 019+ ["function"]=> 020+ string(11) "appendChild" 021+ ["class"]=> 022+ string(10) "DOMElement" 012- array(0) { 013- } 014- ["code"]=> 015- int(3) 016- } 017- --- Don't catch exception with try/catch 018- 019- Fatal error: Uncaught exception 'DOMException' with message 'Hierarchy Request Error' in %sdom003.php:%d 020- Stack trace: 021- #0 {main} 022- thrown in %sdom003.php on line %d 023+ ["type"]=> 024+ string(2) "->" 025+ ["args"]=> 026+ array(1) { 027+ [0]=> 028+ object(DOMElement)#2 (0) { 029+ } 030+ } 031+ } 032+ } 033+ ["code"]=> 034+ int(3) 035+ } 036+ --- Don't catch exception with try/catch 037+ 038+ Fatal error: Uncaught exception 'DOMException' with message 'Hierarchy Request Error' in /home/jwm/tmp/php-5.0.4/ext/dom/tests/dom003.php:13 039+ Stack trace: 040+ #0 /home/jwm/tmp/php-5.0.4/ext/dom/tests/dom003.php(13): DOMElement->appendChild(Object(DOMElement)) 041+ #1 {main} 042+ thrown in /home/jwm/tmp/php-5.0.4/ext/dom/tests/dom003.php on line 13 ================================================================================ ================================================================================ /home/jwm/tmp/php-5.0.4/ext/iconv/tests/bug16069.phpt ================================================================================ ---- EXPECTED OUTPUT ¥ß¥ê¥Ð¡¼¥ë¥ß¥ê¥Ð¡¼¥ë¥ß¥ê¥Ð¡¼¥ë¥ß¥ê¥Ð¡¼¥ë¥ß¥ê¥Ð¡¼¥ë¥ß¥ê¥Ð¡¼¥ë¥ß¥ê¥Ð¡¼¥ë¥ß¥ê¥Ð¡¼¥ë¥ß¥ê¥Ð¡¼¥ë¥ß¥ê¥Ð¡¼¥ë¥ß¥ê¥Ð¡¼¥ë¥ß¥ê¥Ð¡¼¥ë¥ß¥ê¥Ð¡¼¥ë¥ß¥ê¥Ð¡¼¥ë¥ß¥ê¥Ð¡¼¥ë¥ß¥ê¥Ð¡¼¥ë¥ß¥ê¥Ð¡¼¥ë¥ß¥ê¥Ð¡¼¥ë¥ß¥ê¥Ð¡¼¥ë¥ß¥ê¥Ð¡¼¥ë¥ß¥ê¥Ð¡¼¥ë¥ß¥ê¥Ð¡¼¥ë¥ß¥ê¥Ð¡¼¥ë¥ß¥ê¥Ð¡¼¥ë¥ß¥ê¥Ð¡¼¥ë¥ß¥ê¥Ð¡¼¥ë¥ß¥ê¥Ð¡¼¥ë¥ß¥ê¥Ð¡¼¥ë¥ß¥ê¥Ð¡¼¥ë¥ß¥ê¥Ð¡¼¥ë¥ß¥ê¥Ð¡¼¥ë¥ß¥ê¥Ð¡¼¥ë¥ß¥ê¥Ð¡¼¥ë¥ß¥ê¥Ð¡¼¥ë¥ß¥ê¥Ð¡¼¥ë¥ß¥ê¥Ð¡¼¥ë¥ß¥ê¥Ð¡¼¥ë¥ß¥ê¥Ð¡¼¥ë¥ß¥ê¥Ð¡¼¥ë¥ß¥ê¥Ð¡¼¥ë(¡ë§¥¡ë) ---- ACTUAL OUTPUT ¥ß¥ê¥Ð¡¼¥ë¥ß¥ê¥Ð¡¼¥ë¥ß¥ê¥Ð¡¼¥ë¥ß¥ê¥Ð¡¼¥ë¥ß¥ê¥Ð¡¼¥ë¥ß¥ê¥Ð¡¼¥ë¥ß¥ê¥Ð¡¼¥ë¥ß¥ê¥Ð¡¼¥ë¥ß¥ê¥Ð¡¼¥ë¥ß¥ê¥Ð¡¼¥ë¥ß¥ê¥Ð¡¼¥ë¥ß¥ß¥ê¥Ð¡¼¥ë¥ß¥ê¥Ð¡¼¥ë¥ß¥ê¥Ð¡¼¥ë¥ß¥ê¥Ð¡¼¥ë¥ß¥ê¥Ð¡¼¥ë¥ß¥ê¥Ð¡¼¥ë¥ß¥ê¥Ð¡¼¥ë¥ß¥ê¥Ð¡¼¥ë¥ß¥ê¥Ð¡¼¥ë¥ß¥ê¥Ð¡¼¥ë¥ß¥ê¥Ð¡¼¥ë¥ß¥ê¥Ð¡¼¥ë¥ß¥ê¥Ð¡¼¥ë¥ß¥ê¥Ð¡¼¥ë¥ß¥ê¥Ð¡¼¥ë¥ß¥ê¥Ð¡¼¥ë¥ß¥ê¥Ð¡¼¥ë¥ß¥ê¥Ð¡¼¥ë¥ß¥ê¥Ð¡¼¥ë¥ß¥ê¥Ð¡¼¥ë¥ß¥ê¥Ð¡¼¥ë¥ß¥ê¥Ð¡¼¥ë¥ß¥ê¥Ð¡¼¥ë¥ß¥ê¥Ð¡¼¥ë¥ß¥ê¥Ð¡¼¥ë¥ß¥ê¥Ð¡¼¥ë¥ß¥ê¥Ð¡¼¥ë¥ß¥ê¥Ð¡¼¥ë¥ß¥ê¥Ð¡¼¥ë(¡ë§¥¡ë) ---- FAILED ================================================================================ 001+ ¥ß¥ê¥Ð¡¼¥ë¥ß¥ê¥Ð¡¼¥ë¥ß¥ê¥Ð¡¼¥ë¥ß¥ê¥Ð¡¼¥ë¥ß¥ê¥Ð¡¼¥ë¥ß¥ê¥Ð¡¼¥ë¥ß¥ê¥Ð¡¼¥ë¥ß¥ê¥Ð¡¼¥ë¥ß¥ê¥Ð¡¼¥ë¥ß¥ê¥Ð¡¼¥ë¥ß¥ê¥Ð¡¼¥ë¥ß¥ß¥ê¥Ð¡¼¥ë¥ß¥ê¥Ð¡¼¥ë¥ß¥ê¥Ð¡¼¥ë¥ß¥ê¥Ð¡¼¥ë¥ß¥ê¥Ð¡¼¥ë¥ß¥ê¥Ð¡¼¥ë¥ß¥ê¥Ð¡¼¥ë¥ß¥ê¥Ð¡¼¥ë¥ß¥ê¥Ð¡¼¥ë¥ß¥ê¥Ð¡¼¥ë¥ß¥ê¥Ð¡¼¥ë¥ß¥ê¥Ð¡¼¥ë¥ß¥ê¥Ð¡¼¥ë¥ß¥ê¥Ð¡¼¥ë¥ß¥ê¥Ð¡¼¥ë¥ß¥ê¥Ð¡¼¥ë¥ß¥ê¥Ð¡¼¥ë¥ß¥ê¥Ð¡¼¥ë¥ß¥ê¥Ð¡¼¥ë¥ß¥ê¥Ð¡¼¥ë¥ß¥ê¥Ð¡¼¥ë¥ß¥ê¥Ð¡¼¥ë¥ß¥ê¥Ð¡¼¥ë¥ß¥ê¥Ð¡¼¥ë¥ß¥ê¥Ð¡¼¥ë¥ß¥ê¥Ð¡¼¥ë¥ß¥ê¥Ð¡¼¥ë¥ß¥ê¥Ð¡¼¥ë¥ß¥ê¥Ð¡¼¥ë(¡ë§¥¡ë) 001- ¥ß¥ê¥Ð¡¼¥ë¥ß¥ê¥Ð¡¼¥ë¥ß¥ê¥Ð¡¼¥ë¥ß¥ê¥Ð¡¼¥ë¥ß¥ê¥Ð¡¼¥ë¥ß¥ê¥Ð¡¼¥ë¥ß¥ê¥Ð¡¼¥ë¥ß¥ê¥Ð¡¼¥ë¥ß¥ê¥Ð¡¼¥ë¥ß¥ê¥Ð¡¼¥ë¥ß¥ê¥Ð¡¼¥ë¥ß¥ê¥Ð¡¼¥ë¥ß¥ê¥Ð¡¼¥ë¥ß¥ê¥Ð¡¼¥ë¥ß¥ê¥Ð¡¼¥ë¥ß¥ê¥Ð¡¼¥ë¥ß¥ê¥Ð¡¼¥ë¥ß¥ê¥Ð¡¼¥ë¥ß¥ê¥Ð¡¼¥ë¥ß¥ê¥Ð¡¼¥ë¥ß¥ê¥Ð¡¼¥ë¥ß¥ê¥Ð¡¼¥ë¥ß¥ê¥Ð¡¼¥ë¥ß¥ê¥Ð¡¼¥ë¥ß¥ê¥Ð¡¼¥ë¥ß¥ê¥Ð¡¼¥ë¥ß¥ê¥Ð¡¼¥ë¥ß¥ê¥Ð¡¼¥ë¥ß¥ê¥Ð¡¼¥ë¥ß¥ê¥Ð¡¼¥ë¥ß¥ê¥Ð¡¼¥ë¥ß¥ê¥Ð¡¼¥ë¥ß¥ê¥Ð¡¼¥ë¥ß¥ê¥Ð¡¼¥ë¥ß¥ê¥Ð¡¼¥ë¥ß¥ê¥Ð¡¼¥ë¥ß¥ê¥Ð¡¼¥ë¥ß¥ê¥Ð¡¼¥ë¥ß¥ê¥Ð¡¼¥ë¥ß¥ê¥Ð¡¼¥ë(¡ë§¥¡ë) ================================================================================ ================================================================================ /home/jwm/tmp/php-5.0.4/ext/iconv/tests/iconv_stream_filter.phpt ================================================================================ ---- EXPECTED OUTPUT string(20) "1b244224332473244b24" string(10) "41244f1b28" string(2) "42" string(20) "a4b3a4f3a4cba4c1a4cf" string(10) "69636f6e76" string(2) "0a" Warning: fread(): iconv stream filter ("ISO-2022-JP"=>"EUC-JP"): invalid multibyte sequence in %s on line %d string(0) "" string(0) "" string(0) "" ---- ACTUAL OUTPUT string(20) "1b244224332473244b24" string(10) "41244f1b28" string(2) "42" string(20) "a4b3a4f3a4cba4c1a4cf" string(10) "69636f6e76" string(2) "0a" string(20) "1b244f24332466245824" string(10) "4e24421b28" string(2) "4f" ---- FAILED ================================================================================ 007+ string(20) "1b244f24332466245824" 008+ string(10) "4e24421b28" 009+ string(2) "4f" 007- 008- Warning: fread(): iconv stream filter ("ISO-2022-JP"=>"EUC-JP"): invalid multibyte sequence in %s on line %d 009- string(0) "" 010- string(0) "" 011- string(0) "" ================================================================================ ================================================================================ /home/jwm/tmp/php-5.0.4/ext/mbstring/tests/htmlent.phpt ================================================================================ ---- EXPECTED OUTPUT HTML-ENTITIES>UTF-8>HTML-ENTITIES test='&&;&@AB&#128;&#129;&#130;&auml;&ouml;&uuml;&euro;&lang;&rang;' ---- ACTUAL OUTPUT ---- FAILED ================================================================================ 001+ 001- HTML-ENTITIES>UTF-8>HTML-ENTITIES 002- test='&&;&@AB&#128;&#129;&#130;&auml;&ouml;&uuml;&euro;&lang;&rang;' ================================================================================ ================================================================================ /home/jwm/tmp/php-5.0.4/ext/mbstring/tests/mb_output_handler_shift_jis.phpt ================================================================================ ---- EXPECTED OUTPUT string(73) "¥Æ¥¹¥ÈÍÑÆüËܸìʸ»úÎ󡣤³¤Î¥â¥¸¥å¡¼¥ë¤ÏPHP¤Ë¥Þ¥ë¥Á¥Ð¥¤¥È´Ø¿ô¤òÄ󶡤·¤Þ¤¹¡£" ---- ACTUAL OUTPUT ---- FAILED ================================================================================ 001+ 001- string(73) "¥Æ¥¹¥ÈÍÑÆüËܸìʸ»úÎ󡣤³¤Î¥â¥¸¥å¡¼¥ë¤ÏPHP¤Ë¥Þ¥ë¥Á¥Ð¥¤¥È´Ø¿ô¤òÄ󶡤·¤Þ¤¹¡£" ================================================================================ ================================================================================ /home/jwm/tmp/php-5.0.4/ext/mysqli/tests/001.phpt ================================================================================ ---- EXPECTED OUTPUT string(5) "11111" ---- ACTUAL OUTPUT Warning: mysqli_connect(): Access denied for user 'root'@'localhost' (using password: NO) in /home/jwm/tmp/php-5.0.4/ext/mysqli/tests/001.php on line 8 Warning: mysqli_close() expects parameter 1 to be mysqli, boolean given in /home/jwm/tmp/php-5.0.4/ext/mysqli/tests/001.php on line 10 Warning: mysqli_real_connect(): Access denied for user 'root'@'localhost' (using password: NO) in /home/jwm/tmp/php-5.0.4/ext/mysqli/tests/001.php on line 14 Warning: mysqli_real_connect(): Access denied for user 'root'@'localhost' (using password: NO) in /home/jwm/tmp/php-5.0.4/ext/mysqli/tests/001.php on line 20 Warning: mysqli_real_connect(): Access denied for user 'root'@'localhost' (using password: NO) in /home/jwm/tmp/php-5.0.4/ext/mysqli/tests/001.php on line 26 Warning: mysqli_real_connect(): Access denied for user 'root'@'localhost' (using password: NO) in /home/jwm/tmp/php-5.0.4/ext/mysqli/tests/001.php on line 32 string(5) "00000" ---- FAILED ================================================================================ 001+ Warning: mysqli_connect(): Access denied for user 'root'@'localhost' (using password: NO) in /home/jwm/tmp/php-5.0.4/ext/mysqli/tests/001.php on line 8 001- string(5) "11111" 002+ 003+ Warning: mysqli_close() expects parameter 1 to be mysqli, boolean given in /home/jwm/tmp/php-5.0.4/ext/mysqli/tests/001.php on line 10 004+ 005+ Warning: mysqli_real_connect(): Access denied for user 'root'@'localhost' (using password: NO) in /home/jwm/tmp/php-5.0.4/ext/mysqli/tests/001.php on line 14 006+ 007+ Warning: mysqli_real_connect(): Access denied for user 'root'@'localhost' (using password: NO) in /home/jwm/tmp/php-5.0.4/ext/mysqli/tests/001.php on line 20 008+ 009+ Warning: mysqli_real_connect(): Access denied for user 'root'@'localhost' (using password: NO) in /home/jwm/tmp/php-5.0.4/ext/mysqli/tests/001.php on line 26 010+ 011+ Warning: mysqli_real_connect(): Access denied for user 'root'@'localhost' (using password: NO) in /home/jwm/tmp/php-5.0.4/ext/mysqli/tests/001.php on line 32 012+ string(5) "00000" ================================================================================ ================================================================================ /home/jwm/tmp/php-5.0.4/ext/mysqli/tests/002.phpt ================================================================================ ---- EXPECTED OUTPUT array(11) { [0]=> int(1) [1]=> NULL [2]=> NULL [3]=> NULL [4]=> NULL [5]=> NULL [6]=> NULL [7]=> NULL [8]=> NULL [9]=> string(4) "foo1" [10]=> string(4) "1000" } ---- ACTUAL OUTPUT Warning: mysqli_connect(): Access denied for user 'root'@'localhost' (using password: NO) in /home/jwm/tmp/php-5.0.4/ext/mysqli/tests/002.php on line 5 Warning: mysqli_select_db() expects parameter 1 to be mysqli, boolean given in /home/jwm/tmp/php-5.0.4/ext/mysqli/tests/002.php on line 7 Warning: mysqli_query() expects parameter 1 to be mysqli, boolean given in /home/jwm/tmp/php-5.0.4/ext/mysqli/tests/002.php on line 8 Warning: mysqli_query() expects parameter 1 to be mysqli, boolean given in /home/jwm/tmp/php-5.0.4/ext/mysqli/tests/002.php on line 16 Warning: mysqli_query() expects parameter 1 to be mysqli, boolean given in /home/jwm/tmp/php-5.0.4/ext/mysqli/tests/002.php on line 18 Warning: mysqli_prepare() expects parameter 1 to be mysqli, boolean given in /home/jwm/tmp/php-5.0.4/ext/mysqli/tests/002.php on line 20 Warning: mysqli_bind_result() expects parameter 1 to be mysqli_stmt, null given in /home/jwm/tmp/php-5.0.4/ext/mysqli/tests/002.php on line 21 Warning: mysqli_execute() expects parameter 1 to be mysqli_stmt, null given in /home/jwm/tmp/php-5.0.4/ext/mysqli/tests/002.php on line 22 Warning: mysqli_fetch() expects parameter 1 to be mysqli_stmt, null given in /home/jwm/tmp/php-5.0.4/ext/mysqli/tests/002.php on line 24 array(11) { [0]=> NULL [1]=> NULL [2]=> NULL [3]=> NULL [4]=> NULL [5]=> NULL [6]=> NULL [7]=> NULL [8]=> NULL [9]=> NULL [10]=> NULL } Warning: mysqli_stmt_close() expects parameter 1 to be mysqli_stmt, null given in /home/jwm/tmp/php-5.0.4/ext/mysqli/tests/002.php on line 30 Warning: mysqli_close() expects parameter 1 to be mysqli, boolean given in /home/jwm/tmp/php-5.0.4/ext/mysqli/tests/002.php on line 31 ---- FAILED ================================================================================ 001+ Warning: mysqli_connect(): Access denied for user 'root'@'localhost' (using password: NO) in /home/jwm/tmp/php-5.0.4/ext/mysqli/tests/002.php on line 5 002+ 003+ Warning: mysqli_select_db() expects parameter 1 to be mysqli, boolean given in /home/jwm/tmp/php-5.0.4/ext/mysqli/tests/002.php on line 7 004+ 005+ Warning: mysqli_query() expects parameter 1 to be mysqli, boolean given in /home/jwm/tmp/php-5.0.4/ext/mysqli/tests/002.php on line 8 006+ 007+ Warning: mysqli_query() expects parameter 1 to be mysqli, boolean given in /home/jwm/tmp/php-5.0.4/ext/mysqli/tests/002.php on line 16 008+ 009+ Warning: mysqli_query() expects parameter 1 to be mysqli, boolean given in /home/jwm/tmp/php-5.0.4/ext/mysqli/tests/002.php on line 18 010+ 011+ Warning: mysqli_prepare() expects parameter 1 to be mysqli, boolean given in /home/jwm/tmp/php-5.0.4/ext/mysqli/tests/002.php on line 20 012+ 013+ Warning: mysqli_bind_result() expects parameter 1 to be mysqli_stmt, null given in /home/jwm/tmp/php-5.0.4/ext/mysqli/tests/002.php on line 21 014+ 015+ Warning: mysqli_execute() expects parameter 1 to be mysqli_stmt, null given in /home/jwm/tmp/php-5.0.4/ext/mysqli/tests/002.php on line 22 016+ 017+ Warning: mysqli_fetch() expects parameter 1 to be mysqli_stmt, null given in /home/jwm/tmp/php-5.0.4/ext/mysqli/tests/002.php on line 24 018+ array(11) { 019+ [0]=> 001- array(11) { 002- [0]=> 003- int(1) 004- [1]=> 005- NULL 006- [2]=> 007- NULL 008- [3]=> 009- NULL 010- [4]=> 021+ [1]=> 022+ NULL 023+ [2]=> 024+ NULL 025+ [3]=> 026+ NULL 027+ [4]=> 028+ NULL 021- string(4) "foo1" 023- string(4) "1000" 038+ NULL 040+ NULL 042+ 043+ Warning: mysqli_stmt_close() expects parameter 1 to be mysqli_stmt, null given in /home/jwm/tmp/php-5.0.4/ext/mysqli/tests/002.php on line 30 044+ 045+ Warning: mysqli_close() expects parameter 1 to be mysqli, boolean given in /home/jwm/tmp/php-5.0.4/ext/mysqli/tests/002.php on line 31 ================================================================================ ================================================================================ /home/jwm/tmp/php-5.0.4/ext/mysqli/tests/003.phpt ================================================================================ ---- EXPECTED OUTPUT array(7) { [0]=> string(10) "2002-01-02" [1]=> string(8) "12:49:00" [2]=> string(19) "2002-01-02 17:46:59" [3]=> int(2010) [4]=> string(19) "2010-07-10 00:00:00" [5]=> string(19) "0000-00-00 00:00:00" [6]=> string(19) "1999-12-29 00:00:00" } ---- ACTUAL OUTPUT Warning: mysqli_connect(): Access denied for user 'root'@'localhost' (using password: NO) in /home/jwm/tmp/php-5.0.4/ext/mysqli/tests/003.php on line 5 Warning: mysqli_select_db() expects parameter 1 to be mysqli, boolean given in /home/jwm/tmp/php-5.0.4/ext/mysqli/tests/003.php on line 7 Warning: mysqli_query() expects parameter 1 to be mysqli, boolean given in /home/jwm/tmp/php-5.0.4/ext/mysqli/tests/003.php on line 9 Warning: mysqli_query() expects parameter 1 to be mysqli, boolean given in /home/jwm/tmp/php-5.0.4/ext/mysqli/tests/003.php on line 15 Warning: mysqli_query() expects parameter 1 to be mysqli, boolean given in /home/jwm/tmp/php-5.0.4/ext/mysqli/tests/003.php on line 22 Warning: mysqli_prepare() expects parameter 1 to be mysqli, boolean given in /home/jwm/tmp/php-5.0.4/ext/mysqli/tests/003.php on line 25 Warning: mysqli_bind_result() expects parameter 1 to be mysqli_stmt, null given in /home/jwm/tmp/php-5.0.4/ext/mysqli/tests/003.php on line 26 Warning: mysqli_execute() expects parameter 1 to be mysqli_stmt, null given in /home/jwm/tmp/php-5.0.4/ext/mysqli/tests/003.php on line 27 Warning: mysqli_fetch() expects parameter 1 to be mysqli_stmt, null given in /home/jwm/tmp/php-5.0.4/ext/mysqli/tests/003.php on line 28 array(7) { [0]=> NULL [1]=> NULL [2]=> NULL [3]=> NULL [4]=> NULL [5]=> NULL [6]=> NULL } Warning: mysqli_stmt_close() expects parameter 1 to be mysqli_stmt, null given in /home/jwm/tmp/php-5.0.4/ext/mysqli/tests/003.php on line 34 Warning: mysqli_close() expects parameter 1 to be mysqli, boolean given in /home/jwm/tmp/php-5.0.4/ext/mysqli/tests/003.php on line 35 ---- FAILED ================================================================================ 001+ Warning: mysqli_connect(): Access denied for user 'root'@'localhost' (using password: NO) in /home/jwm/tmp/php-5.0.4/ext/mysqli/tests/003.php on line 5 002+ 003+ Warning: mysqli_select_db() expects parameter 1 to be mysqli, boolean given in /home/jwm/tmp/php-5.0.4/ext/mysqli/tests/003.php on line 7 004+ 005+ Warning: mysqli_query() expects parameter 1 to be mysqli, boolean given in /home/jwm/tmp/php-5.0.4/ext/mysqli/tests/003.php on line 9 006+ 007+ Warning: mysqli_query() expects parameter 1 to be mysqli, boolean given in /home/jwm/tmp/php-5.0.4/ext/mysqli/tests/003.php on line 15 008+ 009+ Warning: mysqli_query() expects parameter 1 to be mysqli, boolean given in /home/jwm/tmp/php-5.0.4/ext/mysqli/tests/003.php on line 22 010+ 011+ Warning: mysqli_prepare() expects parameter 1 to be mysqli, boolean given in /home/jwm/tmp/php-5.0.4/ext/mysqli/tests/003.php on line 25 012+ 013+ Warning: mysqli_bind_result() expects parameter 1 to be mysqli_stmt, null given in /home/jwm/tmp/php-5.0.4/ext/mysqli/tests/003.php on line 26 014+ 015+ Warning: mysqli_execute() expects parameter 1 to be mysqli_stmt, null given in /home/jwm/tmp/php-5.0.4/ext/mysqli/tests/003.php on line 27 016+ 001- array(7) { 002- [0]=> 003- string(10) "2002-01-02" 004- [1]=> 005- string(8) "12:49:00" 006- [2]=> 007- string(19) "2002-01-02 17:46:59" 008- [3]=> 009- int(2010) 010- [4]=> 011- string(19) "2010-07-10 00:00:00" 012- [5]=> 013- string(19) "0000-00-00 00:00:00" 014- [6]=> 015- string(19) "1999-12-29 00:00:00" 016- } 017+ Warning: mysqli_fetch() expects parameter 1 to be mysqli_stmt, null given in /home/jwm/tmp/php-5.0.4/ext/mysqli/tests/003.php on line 28 018+ array(7) { 019+ [0]=> 020+ NULL 021+ [1]=> 022+ NULL 023+ [2]=> 024+ NULL 025+ [3]=> 026+ NULL 027+ [4]=> 028+ NULL 029+ [5]=> 030+ NULL 031+ [6]=> 032+ NULL 033+ } 034+ 035+ Warning: mysqli_stmt_close() expects parameter 1 to be mysqli_stmt, null given in /home/jwm/tmp/php-5.0.4/ext/mysqli/tests/003.php on line 34 036+ 037+ Warning: mysqli_close() expects parameter 1 to be mysqli, boolean given in /home/jwm/tmp/php-5.0.4/ext/mysqli/tests/003.php on line 35 ================================================================================ ================================================================================ /home/jwm/tmp/php-5.0.4/ext/mysqli/tests/004.phpt ================================================================================ ---- EXPECTED OUTPUT array(2) { [0]=> string(10) "1234567890" [1]=> string(14) "this is a test" } ---- ACTUAL OUTPUT Warning: mysqli_connect(): Access denied for user 'root'@'localhost' (using password: NO) in /home/jwm/tmp/php-5.0.4/ext/mysqli/tests/004.php on line 5 Warning: mysqli_select_db() expects parameter 1 to be mysqli, boolean given in /home/jwm/tmp/php-5.0.4/ext/mysqli/tests/004.php on line 7 Warning: mysqli_query() expects parameter 1 to be mysqli, boolean given in /home/jwm/tmp/php-5.0.4/ext/mysqli/tests/004.php on line 9 Warning: mysqli_query() expects parameter 1 to be mysqli, boolean given in /home/jwm/tmp/php-5.0.4/ext/mysqli/tests/004.php on line 10 Warning: mysqli_query() expects parameter 1 to be mysqli, boolean given in /home/jwm/tmp/php-5.0.4/ext/mysqli/tests/004.php on line 12 Warning: mysqli_prepare() expects parameter 1 to be mysqli, boolean given in /home/jwm/tmp/php-5.0.4/ext/mysqli/tests/004.php on line 14 Warning: mysqli_bind_result() expects parameter 1 to be mysqli_stmt, null given in /home/jwm/tmp/php-5.0.4/ext/mysqli/tests/004.php on line 15 Warning: mysqli_execute() expects param

« previous php.qa (#25802) next »