Test results for 5.0.4 [failed]

From: Date: Sun, 21 Aug 2005 14:07:30 +0000
Subject: Test results for 5.0.4 [failed]
Groups: php.qa 
Request: Send a blank email to php-qa+get-25814@lists.php.net to get a copy of this message
===================================================================== FAILED TEST SUMMARY --------------------------------------------------------------------- Bug #31672 (one-line comment with </script>) [tests/basic/bug31672.phpt] Test for buffering in core functions with implicit flush off [tests/func/008.phpt] Convert warnings to exceptions [tests/lang/038.phpt] Bug #29944 (function defined in switch crashes PHP) [tests/lang/bug29944.phpt] Bug #22836 (returning references to NULL) [Zend/tests/bug22836.phpt] Test 3: Exception Test [ext/dom/tests/dom003.phpt] Bug #16069 [ext/iconv/tests/bug16069.phpt] iconv stream filter [ext/iconv/tests/iconv_stream_filter.phpt] HTML input/output [ext/mbstring/tests/htmlent.phpt] mb_output_handler() (Shift_JIS) [ext/mbstring/tests/mb_output_handler_shift_jis.phpt] bug compatibility: unset($c) with enabled register_globals [ext/session/tests/007.phpt] bug compatibility: global is used albeit register_globals=0 [ext/session/tests/008-php4.2.3.phpt] unset($_SESSION["name"]); should work with register_globals=off [ext/session/tests/009.phpt] Bug #29992 (foreach by reference corrupts the array) [ext/standard/tests/array/bug29992.phpt] Bug #31213 (Sideeffects caused by bug #29493) [ext/standard/tests/array/bug31213.phpt] Bug #22414 (passthru() does not read data correctly) [ext/standard/tests/file/bug22414.phpt] date_sunrise() and date_sunset() functions [ext/standard/tests/general_functions/sunfuncts.phpt] Bug #24142 (round() problems) [ext/standard/tests/math/bug24142.phpt] Bug #25694 (round() and number_format() inconsistency) [ext/standard/tests/math/bug25694.phpt] Bug #31402 (unserialize() generates references when it should not) [ext/standard/tests/serialize/bug31402.phpt] Bug #29119 (html_entity_decode() misbehaves with UTF-8) [ext/standard/tests/strings/bug29119.phpt] Bug #20382 (strtotime ("Monday", $date) produces wrong result on DST changeover) [ext/standard/tests/time/bug20382.phpt] Bug #26614 (CDATA sections skipped on line count) [ext/xml/tests/bug26614.phpt] ===================================================================== ===================================================================== TEST RESULT SUMMARY --------------------------------------------------------------------- Exts skipped : 56 Exts tested : 27 --------------------------------------------------------------------- Number of tests : 1333 893 Tests skipped : 440 ( 33.0%) -------- Tests warned : 0 ( 0.0%) ( 0.0%) Tests failed : 23 ( 1.7%) ( 2.6%) Tests passed : 870 ( 65.3%) ( 97.4%) --------------------------------------------------------------------- Time taken : 246 seconds ===================================================================== ===================================================================== FAILED TEST SUMMARY --------------------------------------------------------------------- Bug #31672 (one-line comment with </script>) [tests/basic/bug31672.phpt] Test for buffering in core functions with implicit flush off [tests/func/008.phpt] Convert warnings to exceptions [tests/lang/038.phpt] Bug #29944 (function defined in switch crashes PHP) [tests/lang/bug29944.phpt] Bug #22836 (returning references to NULL) [Zend/tests/bug22836.phpt] Test 3: Exception Test [ext/dom/tests/dom003.phpt] Bug #16069 [ext/iconv/tests/bug16069.phpt] iconv stream filter [ext/iconv/tests/iconv_stream_filter.phpt] HTML input/output [ext/mbstring/tests/htmlent.phpt] mb_output_handler() (Shift_JIS) [ext/mbstring/tests/mb_output_handler_shift_jis.phpt] bug compatibility: unset($c) with enabled register_globals [ext/session/tests/007.phpt] bug compatibility: global is used albeit register_globals=0 [ext/session/tests/008-php4.2.3.phpt] unset($_SESSION["name"]); should work with register_globals=off [ext/session/tests/009.phpt] Bug #29992 (foreach by reference corrupts the array) [ext/standard/tests/array/bug29992.phpt] Bug #31213 (Sideeffects caused by bug #29493) [ext/standard/tests/array/bug31213.phpt] Bug #22414 (passthru() does not read data correctly) [ext/standard/tests/file/bug22414.phpt] date_sunrise() and date_sunset() functions [ext/standard/tests/general_functions/sunfuncts.phpt] Bug #24142 (round() problems) [ext/standard/tests/math/bug24142.phpt] Bug #25694 (round() and number_format() inconsistency) [ext/standard/tests/math/bug25694.phpt] Bug #31402 (unserialize() generates references when it should not) [ext/standard/tests/serialize/bug31402.phpt] Bug #29119 (html_entity_decode() misbehaves with UTF-8) [ext/standard/tests/strings/bug29119.phpt] Bug #20382 (strtotime ("Monday", $date) produces wrong result on DST changeover) [ext/standard/tests/time/bug20382.phpt] Bug #26614 (CDATA sections skipped on line count) [ext/xml/tests/bug26614.phpt] ===================================================================== ================================================================================ /var/tmp/apache/php-5.0.4/tests/basic/bug31672.phpt ================================================================================ ---- EXPECTED OUTPUT Foobar Foobar ---- ACTUAL OUTPUT Foobar Foo ---- FAILED ================================================================================ 002+ Foo 002- Foobar ================================================================================ ================================================================================ /var/tmp/apache/php-5.0.4/tests/func/008.phpt ================================================================================ ---- EXPECTED OUTPUT 'foo1' 'foo2' ---- ACTUAL OUTPUT ---- FAILED ================================================================================ 001- 'foo1' 003- 'foo2' ================================================================================ ================================================================================ /var/tmp/apache/php-5.0.4/tests/lang/038.phpt ================================================================================ ---- EXPECTED OUTPUT string(15) "Error2Exception" string(5) "fopen" ===DONE=== ---- ACTUAL OUTPUT string(15) "Error2Exception" string(15) "Error2Exception" ===DONE=== ---- FAILED ================================================================================ 002+ string(15) "Error2Exception" 002- string(5) "fopen" ================================================================================ ================================================================================ /var/tmp/apache/php-5.0.4/tests/lang/bug29944.phpt ================================================================================ ---- EXPECTED OUTPUT 1 ===DONE=== ---- ACTUAL OUTPUT ---- FAILED ================================================================================ 001+ 001- 1 002- ===DONE=== ================================================================================ ================================================================================ /var/tmp/apache/php-5.0.4/Zend/tests/bug22836.phpt ================================================================================ ---- EXPECTED OUTPUT string(3) "foo" 'foo' Notice: Undefined variable: a in %s on line %d Strict Standards: Only variable references should be returned by reference in %s on line %d string(3) "foo" 'foo' Notice: Undefined variable: a in %s on line %d Strict Standards: Only variable references should be returned by reference in %s on line %d string(3) "foo" 'foo' Notice: Undefined variable: a in %s on line %d Strict Standards: Only variable references should be returned by reference in %s on line %d string(3) "foo" 'foo' Notice: Undefined variable: a in %s on line %d Strict Standards: Only variable references should be returned by reference in %s on line %d string(3) "foo" 'foo' Notice: Undefined variable: a in %s on line %d Strict Standards: Only variable references should be returned by reference in %s on line %d string(3) "foo" 'foo' Notice: Undefined variable: a in %s on line %d Strict Standards: Only variable references should be returned by reference in %s on line %d string(3) "foo" 'foo' Notice: Undefined variable: a in %s on line %d Strict Standards: Only variable references should be returned by reference in %s on line %d string(3) "foo" 'foo' Notice: Undefined variable: a in %s on line %d Strict Standards: Only variable references should be returned by reference in %s on line %d string(3) "foo" 'foo' Notice: Undefined variable: a in %s on line %d Strict Standards: Only variable references should be returned by reference in %s on line %d ---- ACTUAL OUTPUT string(3) "foo" 'foo' Notice: Undefined variable: a in /var/tmp/apache/php-5.0.4/Zend/tests/bug22836.php on line 7 Strict Standards: Only variable references should be returned by reference in /var/tmp/apache/php-5.0.4/Zend/tests/bug22836.php on line 7 string(3) "foo" 'foo' Notice: Undefined variable: a in /var/tmp/apache/php-5.0.4/Zend/tests/bug22836.php on line 7 Strict Standards: Only variable references should be returned by reference in /var/tmp/apache/php-5.0.4/Zend/tests/bug22836.php on line 7 NULL 'foo' Notice: Undefined variable: a in /var/tmp/apache/php-5.0.4/Zend/tests/bug22836.php on line 7 NULL 'foo' Notice: Undefined variable: a in /var/tmp/apache/php-5.0.4/Zend/tests/bug22836.php on line 7 NULL 'foo' Notice: Undefined variable: a in /var/tmp/apache/php-5.0.4/Zend/tests/bug22836.php on line 7 NULL 'foo' Notice: Undefined variable: a in /var/tmp/apache/php-5.0.4/Zend/tests/bug22836.php on line 7 NULL 'foo' Notice: Undefined variable: a in /var/tmp/apache/php-5.0.4/Zend/tests/bug22836.php on line 7 NULL 'foo' Notice: Undefined variable: a in /var/tmp/apache/php-5.0.4/Zend/tests/bug22836.php on line 7 ---- FAILED ================================================================================ 013+ NULL 013- string(3) "foo" 017+ NULL 018+ 'foo' 018- Strict Standards: Only variable references should be returned by reference in %s on line %d 019- string(3) "foo" 020+ Notice: Undefined variable: a in /var/tmp/apache/php-5.0.4/Zend/tests/bug22836.php on line 7 021+ NULL 022+ 'foo' 023+ 024+ Notice: Undefined variable: a in /var/tmp/apache/php-5.0.4/Zend/tests/bug22836.php on line 7 025+ NULL 026+ 'foo' 027+ 028+ Notice: Undefined variable: a in /var/tmp/apache/php-5.0.4/Zend/tests/bug22836.php on line 7 029+ NULL 030+ 'foo' 031+ 032+ Notice: Undefined variable: a in /var/tmp/apache/php-5.0.4/Zend/tests/bug22836.php on line 7 033+ NULL 023- 024- Strict Standards: Only variable references should be returned by reference in %s on line %d 025- string(3) "foo" 026- 'foo' 027- 028- Notice: Undefined variable: a in %s on line %d 029- 030- Strict Standards: Only variable references should be returned by reference in %s on line %d 031- string(3) "foo" 032- 'foo' 033- 034- Notice: Undefined variable: a in %s on line %d 035- 036- Strict Standards: Only variable references should be returned by reference in %s on line %d 037- string(3) "foo" 038- 'foo' 039- 040- Notice: Undefined variable: a in %s on line %d 041- 042- Strict Standards: Only variable references should be returned by reference in %s on line %d 043- string(3) "foo" 044- 'foo' 045- 046- Notice: Undefined variable: a in %s on line %d 047- 048- Strict Standards: Only variable references should be returned by reference in %s on line %d 049- string(3) "foo" 050- 'foo' 051- 052- Notice: Undefined variable: a in %s on line %d 053- 054- Strict Standards: Only variable references should be returned by reference in %s on line %d ================================================================================ ================================================================================ /var/tmp/apache/php-5.0.4/ext/dom/tests/dom003.phpt ================================================================================ ---- EXPECTED OUTPUT --- Catch exception with try/catch object(DOMException)#%d (6) { ["message:protected"]=> string(23) "Hierarchy Request Error" ["string:private"]=> string(0) "" ["file:protected"]=> string(%d) "%s/ext/dom/tests/dom003.php" ["line:protected"]=> int(8) ["trace:private"]=> array(0) { } ["code"]=> int(3) } --- Don't catch exception with try/catch Fatal error: Uncaught exception 'DOMException' with message 'Hierarchy Request Error' in %sdom003.php:%d Stack trace: #0 {main} thrown in %sdom003.php on line %d ---- ACTUAL OUTPUT --- Catch exception with try/catch object(DOMException)#3 (6) { ["message:protected"]=> string(23) "Hierarchy Request Error" ["string:private"]=> string(0) "" ["file:protected"]=> string(50) "/var/tmp/apache/php-5.0.4/ext/dom/tests/dom003.php" ["line:protected"]=> int(8) ["trace:private"]=> array(1) { [0]=> array(6) { ["file"]=> string(50) "/var/tmp/apache/php-5.0.4/ext/dom/tests/dom003.php" ["line"]=> int(8) ["function"]=> string(11) "appendChild" ["class"]=> string(10) "DOMElement" ["type"]=> string(2) "->" ["args"]=> array(1) { [0]=> object(DOMElement)#2 (0) { } } } } ["code"]=> int(3) } --- Don't catch exception with try/catch Fatal error: Uncaught exception 'DOMException' with message 'Hierarchy Request Error' in /var/tmp/apache/php-5.0.4/ext/dom/tests/dom003.php:13 Stack trace: #0 /var/tmp/apache/php-5.0.4/ext/dom/tests/dom003.php(13): DOMElement->appendChild(Object(DOMElement)) #1 {main} thrown in /var/tmp/apache/php-5.0.4/ext/dom/tests/dom003.php on line 13 ---- FAILED ================================================================================ 012+ array(1) { 013+ [0]=> 014+ array(6) { 015+ ["file"]=> 016+ string(50) "/var/tmp/apache/php-5.0.4/ext/dom/tests/dom003.php" 017+ ["line"]=> 018+ int(8) 019+ ["function"]=> 020+ string(11) "appendChild" 021+ ["class"]=> 022+ string(10) "DOMElement" 012- array(0) { 013- } 014- ["code"]=> 015- int(3) 016- } 017- --- Don't catch exception with try/catch 018- 019- Fatal error: Uncaught exception 'DOMException' with message 'Hierarchy Request Error' in %sdom003.php:%d 020- Stack trace: 021- #0 {main} 022- thrown in %sdom003.php on line %d 023+ ["type"]=> 024+ string(2) "->" 025+ ["args"]=> 026+ array(1) { 027+ [0]=> 028+ object(DOMElement)#2 (0) { 029+ } 030+ } 031+ } 032+ } 033+ ["code"]=> 034+ int(3) 035+ } 036+ --- Don't catch exception with try/catch 037+ 038+ Fatal error: Uncaught exception 'DOMException' with message 'Hierarchy Request Error' in /var/tmp/apache/php-5.0.4/ext/dom/tests/dom003.php:13 039+ Stack trace: 040+ #0 /var/tmp/apache/php-5.0.4/ext/dom/tests/dom003.php(13): DOMElement->appendChild(Object(DOMElement)) 041+ #1 {main} 042+ thrown in /var/tmp/apache/php-5.0.4/ext/dom/tests/dom003.php on line 13 ================================================================================ ================================================================================ /var/tmp/apache/php-5.0.4/ext/iconv/tests/bug16069.phpt ================================================================================ ---- EXPECTED OUTPUT ¥ß¥ê¥Ð¡¼¥ë¥ß¥ê¥Ð¡¼¥ë¥ß¥ê¥Ð¡¼¥ë¥ß¥ê¥Ð¡¼¥ë¥ß¥ê¥Ð¡¼¥ë¥ß¥ê¥Ð¡¼¥ë¥ß¥ê¥Ð¡¼¥ë¥ß¥ê¥Ð¡¼¥ë¥ß¥ê¥Ð¡¼¥ë¥ß¥ê¥Ð¡¼¥ë¥ß¥ê¥Ð¡¼¥ë¥ß¥ê¥Ð¡¼¥ë¥ß¥ê¥Ð¡¼¥ë¥ß¥ê¥Ð¡¼¥ë¥ß¥ê¥Ð¡¼¥ë¥ß¥ê¥Ð¡¼¥ë¥ß¥ê¥Ð¡¼¥ë¥ß¥ê¥Ð¡¼¥ë¥ß¥ê¥Ð¡¼¥ë¥ß¥ê¥Ð¡¼¥ë¥ß¥ê¥Ð¡¼¥ë¥ß¥ê¥Ð¡¼¥ë¥ß¥ê¥Ð¡¼¥ë¥ß¥ê¥Ð¡¼¥ë¥ß¥ê¥Ð¡¼¥ë¥ß¥ê¥Ð¡¼¥ë¥ß¥ê¥Ð¡¼¥ë¥ß¥ê¥Ð¡¼¥ë¥ß¥ê¥Ð¡¼¥ë¥ß¥ê¥Ð¡¼¥ë¥ß¥ê¥Ð¡¼¥ë¥ß¥ê¥Ð¡¼¥ë¥ß¥ê¥Ð¡¼¥ë¥ß¥ê¥Ð¡¼¥ë¥ß¥ê¥Ð¡¼¥ë¥ß¥ê¥Ð¡¼¥ë¥ß¥ê¥Ð¡¼¥ë¥ß¥ê¥Ð¡¼¥ë¥ß¥ê¥Ð¡¼¥ë¥ß¥ê¥Ð¡¼¥ë(¡ë§¥¡ë) ---- ACTUAL OUTPUT ¥ß¥ê¥Ð¡¼¥ë¥ß¥ê¥Ð¡¼¥ë¥ß¥ê¥Ð¡¼¥ë¥ß¥ê¥Ð¡¼¥ë¥ß¥ê¥Ð¡¼¥ë¥ß¥ê¥Ð¡¼¥ë¥ß¥ê¥Ð¡¼¥ë¥ß¥ê¥Ð¡¼¥ë¥ß¥ê¥Ð¡¼¥ë¥ß¥ê¥Ð¡¼¥ë¥ß¥ê¥Ð¡¼¥ë¥ß¥ß¥ê¥Ð¡¼¥ë¥ß¥ê¥Ð¡¼¥ë¥ß¥ê¥Ð¡¼¥ë¥ß¥ê¥Ð¡¼¥ë¥ß¥ê¥Ð¡¼¥ë¥ß¥ê¥Ð¡¼¥ë¥ß¥ê¥Ð¡¼¥ë¥ß¥ê¥Ð¡¼¥ë¥ß¥ê¥Ð¡¼¥ë¥ß¥ê¥Ð¡¼¥ë¥ß¥ê¥Ð¡¼¥ë¥ß¥ê¥Ð¡¼¥ë¥ß¥ê¥Ð¡¼¥ë¥ß¥ê¥Ð¡¼¥ë¥ß¥ê¥Ð¡¼¥ë¥ß¥ê¥Ð¡¼¥ë¥ß¥ê¥Ð¡¼¥ë¥ß¥ê¥Ð¡¼¥ë¥ß¥ê¥Ð¡¼¥ë¥ß¥ê¥Ð¡¼¥ë¥ß¥ê¥Ð¡¼¥ë¥ß¥ê¥Ð¡¼¥ë¥ß¥ê¥Ð¡¼¥ë¥ß¥ê¥Ð¡¼¥ë¥ß¥ê¥Ð¡¼¥ë¥ß¥ê¥Ð¡¼¥ë¥ß¥ê¥Ð¡¼¥ë¥ß¥ê¥Ð¡¼¥ë¥ß¥ê¥Ð¡¼¥ë(¡ë§¥¡ë) ---- FAILED ================================================================================ 001+ ¥ß¥ê¥Ð¡¼¥ë¥ß¥ê¥Ð¡¼¥ë¥ß¥ê¥Ð¡¼¥ë¥ß¥ê¥Ð¡¼¥ë¥ß¥ê¥Ð¡¼¥ë¥ß¥ê¥Ð¡¼¥ë¥ß¥ê¥Ð¡¼¥ë¥ß¥ê¥Ð¡¼¥ë¥ß¥ê¥Ð¡¼¥ë¥ß¥ê¥Ð¡¼¥ë¥ß¥ê¥Ð¡¼¥ë¥ß¥ß¥ê¥Ð¡¼¥ë¥ß¥ê¥Ð¡¼¥ë¥ß¥ê¥Ð¡¼¥ë¥ß¥ê¥Ð¡¼¥ë¥ß¥ê¥Ð¡¼¥ë¥ß¥ê¥Ð¡¼¥ë¥ß¥ê¥Ð¡¼¥ë¥ß¥ê¥Ð¡¼¥ë¥ß¥ê¥Ð¡¼¥ë¥ß¥ê¥Ð¡¼¥ë¥ß¥ê¥Ð¡¼¥ë¥ß¥ê¥Ð¡¼¥ë¥ß¥ê¥Ð¡¼¥ë¥ß¥ê¥Ð¡¼¥ë¥ß¥ê¥Ð¡¼¥ë¥ß¥ê¥Ð¡¼¥ë¥ß¥ê¥Ð¡¼¥ë¥ß¥ê¥Ð¡¼¥ë¥ß¥ê¥Ð¡¼¥ë¥ß¥ê¥Ð¡¼¥ë¥ß¥ê¥Ð¡¼¥ë¥ß¥ê¥Ð¡¼¥ë¥ß¥ê¥Ð¡¼¥ë¥ß¥ê¥Ð¡¼¥ë¥ß¥ê¥Ð¡¼¥ë¥ß¥ê¥Ð¡¼¥ë¥ß¥ê¥Ð¡¼¥ë¥ß¥ê¥Ð¡¼¥ë¥ß¥ê¥Ð¡¼¥ë(¡ë§¥¡ë) 001- ¥ß¥ê¥Ð¡¼¥ë¥ß¥ê¥Ð¡¼¥ë¥ß¥ê¥Ð¡¼¥ë¥ß¥ê¥Ð¡¼¥ë¥ß¥ê¥Ð¡¼¥ë¥ß¥ê¥Ð¡¼¥ë¥ß¥ê¥Ð¡¼¥ë¥ß¥ê¥Ð¡¼¥ë¥ß¥ê¥Ð¡¼¥ë¥ß¥ê¥Ð¡¼¥ë¥ß¥ê¥Ð¡¼¥ë¥ß¥ê¥Ð¡¼¥ë¥ß¥ê¥Ð¡¼¥ë¥ß¥ê¥Ð¡¼¥ë¥ß¥ê¥Ð¡¼¥ë¥ß¥ê¥Ð¡¼¥ë¥ß¥ê¥Ð¡¼¥ë¥ß¥ê¥Ð¡¼¥ë¥ß¥ê¥Ð¡¼¥ë¥ß¥ê¥Ð¡¼¥ë¥ß¥ê¥Ð¡¼¥ë¥ß¥ê¥Ð¡¼¥ë¥ß¥ê¥Ð¡¼¥ë¥ß¥ê¥Ð¡¼¥ë¥ß¥ê¥Ð¡¼¥ë¥ß¥ê¥Ð¡¼¥ë¥ß¥ê¥Ð¡¼¥ë¥ß¥ê¥Ð¡¼¥ë¥ß¥ê¥Ð¡¼¥ë¥ß¥ê¥Ð¡¼¥ë¥ß¥ê¥Ð¡¼¥ë¥ß¥ê¥Ð¡¼¥ë¥ß¥ê¥Ð¡¼¥ë¥ß¥ê¥Ð¡¼¥ë¥ß¥ê¥Ð¡¼¥ë¥ß¥ê¥Ð¡¼¥ë¥ß¥ê¥Ð¡¼¥ë¥ß¥ê¥Ð¡¼¥ë¥ß¥ê¥Ð¡¼¥ë¥ß¥ê¥Ð¡¼¥ë(¡ë§¥¡ë) ================================================================================ ================================================================================ /var/tmp/apache/php-5.0.4/ext/iconv/tests/iconv_stream_filter.phpt ================================================================================ ---- EXPECTED OUTPUT string(20) "1b244224332473244b24" string(10) "41244f1b28" string(2) "42" string(20) "a4b3a4f3a4cba4c1a4cf" string(10) "69636f6e76" string(2) "0a" Warning: fread(): iconv stream filter ("ISO-2022-JP"=>"EUC-JP"): invalid multibyte sequence in %s on line %d string(0) "" string(0) "" string(0) "" ---- ACTUAL OUTPUT string(20) "1b244224332473244b24" string(10) "41244f1b28" string(2) "42" string(20) "a4b3a4f3a4cba4c1a4cf" string(10) "69636f6e76" string(2) "0a" string(20) "1b244f24332466245824" string(10) "4e24421b28" string(2) "4f" ---- FAILED ================================================================================ 007+ string(20) "1b244f24332466245824" 008+ string(10) "4e24421b28" 009+ string(2) "4f" 007- 008- Warning: fread(): iconv stream filter ("ISO-2022-JP"=>"EUC-JP"): invalid multibyte sequence in %s on line %d 009- string(0) "" 010- string(0) "" 011- string(0) "" ================================================================================ ================================================================================ /var/tmp/apache/php-5.0.4/ext/mbstring/tests/htmlent.phpt ================================================================================ ---- EXPECTED OUTPUT HTML-ENTITIES>UTF-8>HTML-ENTITIES test='&&;&@AB&#128;&#129;&#130;&auml;&ouml;&uuml;&euro;&lang;&rang;' ---- ACTUAL OUTPUT ---- FAILED ================================================================================ 001+ 001- HTML-ENTITIES>UTF-8>HTML-ENTITIES 002- test='&&;&@AB&#128;&#129;&#130;&auml;&ouml;&uuml;&euro;&lang;&rang;' ================================================================================ ================================================================================ /var/tmp/apache/php-5.0.4/ext/mbstring/tests/mb_output_handler_shift_jis.phpt ================================================================================ ---- EXPECTED OUTPUT string(73) "¥Æ¥¹¥ÈÍÑÆüËܸìʸ»úÎ󡣤³¤Î¥â¥¸¥å¡¼¥ë¤ÏPHP¤Ë¥Þ¥ë¥Á¥Ð¥¤¥È´Ø¿ô¤òÄ󶡤·¤Þ¤¹¡£" ---- ACTUAL OUTPUT ---- FAILED ================================================================================ 001+ 001- string(73) "¥Æ¥¹¥ÈÍÑÆüËܸìʸ»úÎ󡣤³¤Î¥â¥¸¥å¡¼¥ë¤ÏPHP¤Ë¥Þ¥ë¥Á¥Ð¥¤¥È´Ø¿ô¤òÄ󶡤·¤Þ¤¹¡£" ================================================================================ ================================================================================ /var/tmp/apache/php-5.0.4/ext/session/tests/007.phpt ================================================================================ ---- EXPECTED OUTPUT float(3.14) array(1) { ["c"]=> &float(3.14) } float(3.14) array(1) { ["c"]=> &float(3.14) } ---- ACTUAL OUTPUT float(3.14) Notice: Undefined variable: HTTP_SESSION_VARS in /var/tmp/apache/php-5.0.4/ext/session/tests/007.php on line 22 NULL float(3.14) Notice: Undefined variable: HTTP_SESSION_VARS in /var/tmp/apache/php-5.0.4/ext/session/tests/007.php on line 34 NULL ---- FAILED ================================================================================ 002+ 003+ Notice: Undefined variable: HTTP_SESSION_VARS in /var/tmp/apache/php-5.0.4/ext/session/tests/007.php on line 22 004+ NULL 002- array(1) { 003- ["c"]=> 004- &float(3.14) 005- } 006+ 007+ Notice: Undefined variable: HTTP_SESSION_VARS in /var/tmp/apache/php-5.0.4/ext/session/tests/007.php on line 34 008+ NULL 007- array(1) { 008- ["c"]=> 009- &float(3.14) 010- } ================================================================================ ================================================================================ /var/tmp/apache/php-5.0.4/ext/session/tests/008-php4.2.3.phpt ================================================================================ ---- EXPECTED OUTPUT NULL Your script possibly relies on a session side-effect which existed until PHP 4.2.3. Please be advised that the session extension does not consider global variables as a source of data, unless register_globals is enabled. You can disable this functionality and this warning by setting session.bug_compat_42 or session.bug_compat_warn to off, respectively. array(1) { ["c"]=> float(3.14) } NULL array(1) { ["c"]=> float(3.14) } ---- ACTUAL OUTPUT NULL Your script possibly relies on a session side-effect which existed until PHP 4.2.3. Please be advised that the session extension does not consider global variables as a source of data, unless register_globals is enabled. You can disable this functionality and this warning by setting session.bug_compat_42 or session.bug_compat_warn to off, respectively. NULL NULL NULL ---- FAILED ================================================================================ 003+ NULL 004+ NULL 003- array(1) { 004- ["c"]=> 005- float(3.14) 006- } 008- array(1) { 009- ["c"]=> 010- float(3.14) 011- } ================================================================================ ================================================================================ /var/tmp/apache/php-5.0.4/ext/session/tests/009.phpt ================================================================================ ---- EXPECTED OUTPUT array(0) { } array(1) { ["name"]=> string(3) "foo" } array(1) { ["name"]=> string(3) "foo" } array(0) { } array(0) { } ---- ACTUAL OUTPUT Notice: Undefined variable: HTTP_SESSION_VARS in /var/tmp/apache/php-5.0.4/ext/session/tests/009.php on line 13 NULL array(1) { ["name"]=> string(3) "foo" } Notice: Undefined variable: HTTP_SESSION_VARS in /var/tmp/apache/php-5.0.4/ext/session/tests/009.php on line 20 NULL Notice: Undefined variable: HTTP_SESSION_VARS in /var/tmp/apache/php-5.0.4/ext/session/tests/009.php on line 21 Notice: Undefined variable: HTTP_SESSION_VARS in /var/tmp/apache/php-5.0.4/ext/session/tests/009.php on line 22 NULL Notice: Undefined variable: HTTP_SESSION_VARS in /var/tmp/apache/php-5.0.4/ext/session/tests/009.php on line 28 NULL ---- FAILED ================================================================================ 001+ Notice: Undefined variable: HTTP_SESSION_VARS in /var/tmp/apache/php-5.0.4/ext/session/tests/009.php on line 13 002+ NULL 001- array(0) { 002- } 007+ 008+ Notice: Undefined variable: HTTP_SESSION_VARS in /var/tmp/apache/php-5.0.4/ext/session/tests/009.php on line 20 009+ NULL 010+ 011+ Notice: Undefined variable: HTTP_SESSION_VARS in /var/tmp/apache/php-5.0.4/ext/session/tests/009.php on line 21 012+ 013+ Notice: Undefined variable: HTTP_SESSION_VARS in /var/tmp/apache/php-5.0.4/ext/session/tests/009.php on line 22 014+ NULL 007- array(1) { 008- ["name"]=> 009- string(3) "foo" 010- } 011- array(0) { 012- } 013- array(0) { 014- } 015+ 016+ Notice: Undefined variable: HTTP_SESSION_VARS in /var/tmp/apache/php-5.0.4/ext/session/tests/009.php on line 28 017+ NULL ================================================================================ ================================================================================ /var/tmp/apache/php-5.0.4/ext/standard/tests/array/bug29992.phpt ================================================================================ ---- EXPECTED OUTPUT Array ( [0] => 1 [1] => 2 [2] => 3 ) int(1) int(2) int(3) int(1) int(2) int(3) int(1) int(2) int(3) int(1) int(2) int(3) Array ( [0] => 1 [1] => 2 [2] => 3 ) ===DONE=== ---- ACTUAL OUTPUT Array ( [0] => 1 [1] => 2 [2] => 3 ) int(1) int(2) int(3) int(1) int(2) int(3) int(1) int(2) int(3) int(1) int(2) int(2) Array ( [0] => 1 [1] => 2 [2] => 2 ) ===DONE=== ---- FAILED ================================================================================ 018+ int(2) 018- int(3) 023+ [2] => 2 023- [2] => 3 ================================================================================ ================================================================================ /var/tmp/apache/php-5.0.4/ext/standard/tests/array/bug31213.phpt ================================================================================ ---- EXPECTED OUTPUT int(1) int(1) int(1) int(2) int(2) int(2) array(2) { ["_a"]=> &int(2) ["_b"]=> &int(2) } int(1) int(1) int(1) int(2) int(2) int(2) array(2) { ["_a"]=> &int(2) ["_b"]=> &int(2) } ---- ACTUAL OUTPUT int(1) int(1) int(1) int(2) int(2) int(2) array(2) { ["_a"]=> &int(2) ["_b"]=> &int(2) } int(1) int(1) int(2) int(2) int(2) int(2) array(2) { ["_a"]=> &int(2) ["_b"]=> &int(2) } ---- FAILED ================================================================================ 015+ int(2) 015- int(1) ================================================================================ ================================================================================ /var/tmp/apache/php-5.0.4/ext/standard/tests/file/bug22414.phpt ================================================================================ ---- EXPECTED OUTPUT HELLO Works ---- ACTUAL OUTPUT HELLO Does not work ---- FAILED ================================================================================ 002+ Does not work 002- Works ================================================================================ ================================================================================ /var/tmp/apache/php-5.0.4/ext/standard/tests/general_functions/sunfuncts.phpt ================================================================================ ---- EXPECTED OUTPUT 1041293199 06:39 6.652455761896 1041293806 16:46 16.76937486746 1043971592 06:32 6.54537029266 1043972233 17:13 17.21752470874 1046390766 06:06 6.115652675685 1046391456 17:36 17.6108549623 1049069128 05:28 5.472742029069 1049069878 17:58 17.97255258437 1051661094 04:54 4.901229982859 1051661898 18:18 18.31368876948 1054339474 04:34 4.57442928945 1054340319 18:39 18.65640094324 1056931476 04:36 4.616120450519 1056932328 18:48 18.80887165777 1059609894 04:54 4.906882509836 1059610715 18:35 18.59928600203 1062288314 05:14 5.236889557074 1062289083 18:03 18.06054178788 1064880332 05:32 5.542366581139 1064881044 17:24 17.41150561492 1067558754 05:54 5.916208842058 1067559410 16:50 16.83369857063 1070150780 06:20 6.34622155207 1070151395 16:35 16.58358905554 ---- ACTUAL OUTPUT 1041316748 06:39 6.652455761896 1041353169 16:46 16.76937486746 1043994763 06:32 6.54537029266 1044033183 17:13 17.21752470874 1046412416 06:06 6.115652675685 1046453799 17:36 17.6108549623 1049088501 05:28 5.472742029069 1049133501 17:58 17.97255258437 1051678444 04:54 4.901229982859 1051726729 18:18 18.31368876948 1054355667 04:34 4.57442928945 1054406363 18:39 18.65640094324 1056947818 04:36 4.616120450519 1056998911 18:48 18.80887165777 1059627264 04:54 4.906882509836 1059676557 18:35 18.59928600203 1062306852 05:14 5.236889557074 1062353017 18:03 18.06054178788 1064899952 05:32 5.542366581139 1064942681 17:24 17.41150561492 1067579698 05:54 5.916208842058 1067619001 16:50 16.83369857063 1070173246 06:20 6.34622155207 1070210100 16:35 16.58358905554 ---- FAILED ================================================================================ 001+ 1041316748 06:39 6.652455761896 002+ 1041353169 16:46 16.76937486746 003+ 1043994763 06:32 6.54537029266 004+ 1044033183 17:13 17.21752470874 005+ 1046412416 06:06 6.115652675685 006+ 1046453799 17:36 17.6108549623 007+ 1049088501 05:28 5.472742029069 008+ 1049133501 17:58 17.97255258437 009+ 1051678444 04:54 4.901229982859 010+ 1051726729 18:18 18.31368876948 011+ 1054355667 04:34 4.57442928945 012+ 1054406363 18:39 18.65640094324 013+ 1056947818 04:36 4.616120450519 014+ 1056998911 18:48 18.80887165777 015+ 1059627264 04:54 4.906882509836 016+ 1059676557 18:35 18.59928600203 017+ 1062306852 05:14 5.236889557074 018+ 1062353017 18:03 18.06054178788 019+ 1064899952 05:32 5.542366581139 020+ 1064942681 17:24 17.41150561492 021+ 1067579698 05:54 5.916208842058 022+ 1067619001 16:50 16.83369857063 023+ 1070173246 06:20 6.34622155207 024+ 1070210100 16:35 16.58358905554 001- 1041293199 06:39 6.652455761896 002- 1041293806 16:46 16.76937486746 003- 1043971592 06:32 6.54537029266 004- 1043972233 17:13 17.21752470874 005- 1046390766 06:06 6.115652675685 006- 1046391456 17:36 17.6108549623 007- 1049069128 05:28 5.472742029069 008- 1049069878 17:58 17.97255258437 009- 1051661094 04:54 4.901229982859 010- 1051661898 18:18 18.31368876948 011- 1054339474 04:34 4.57442928945 012- 1054340319 18:39 18.65640094324 013- 1056931476 04:36 4.616120450519 014- 1056932328 18:48 18.80887165777 015- 1059609894 04:54 4.906882509836 016- 1059610715 18:35 18.59928600203 017- 1062288314 05:14 5.236889557074 018- 1062289083 18:03 18.06054178788 019- 1064880332 05:32 5.542366581139 020- 1064881044 17:24 17.41150561492 021- 1067558754 05:54 5.916208842058 022- 1067559410 16:50 16.83369857063 023- 1070150780 06:20 6.34622155207 024- 1070151395 16:35 16.58358905554 ================================================================================ ================================================================================ /var/tmp/apache/php-5.0.4/ext/standard/tests/math/bug24142.phpt ================================================================================ ---- EXPECTED OUTPUT round(0.005, 2) -> 0.01 round(0.015, 2) -> 0.02 round(0.025, 2) -> 0.03 round(0.035, 2) -> 0.04 round(0.045, 2) -> 0.05 round(0.055, 2) -> 0.06 round(0.065, 2) -> 0.07 round(0.075, 2) -> 0.08 round(0.085, 2) -> 0.09 ---- ACTUAL OUTPUT round(0.005, 2) -> 0.01 round(0.015, 2) -> 0.01 round(0.025, 2) -> 0.03 round(0.035, 2) -> 0.04 round(0.045, 2) -> 0.05 round(0.055, 2) -> 0.06 round(0.065, 2) -> 0.07 round(0.075, 2) -> 0.07 round(0.085, 2) -> 0.08 ---- FAILED ================================================================================ 002+ round(0.015, 2) -> 0.01 002- round(0.015, 2) -> 0.02 008+ round(0.075, 2) -> 0.07 009+ round(0.085, 2) -> 0.08 008- round(0.075, 2) -> 0.08 009- round(0.085, 2) -> 0.09 ================================================================================ ================================================================================ /var/tmp/apache/php-5.0.4/ext/standard/tests/math/bug25694.phpt ================================================================================ ---- EXPECTED OUTPUT round 0.045 = 0.05 number format 0.045 = 0.05 round 0.055 = 0.06 number format 0.055 = 0.06 round 5.045 = 5.05 number format 5.045 = 5.05 round 5.055 = 5.06 number format 5.055 = 5.06 round 3.025 = 3.03 number format 3.025 = 3.03 round 4.025 = 4.03 number format 4.025 = 4.03 ---- ACTUAL OUTPUT round 0.045 = 0.04 number format 0.045 = 0.04 round 0.055 = 0.06 number format 0.055 = 0.06 round 5.045 = 5.04 number format 5.045 = 5.04 round 5.055 = 5.05 number format 5.055 = 5.05 round 3.025 = 3.02 number format 3.025 = 3.02 round 4.025 = 4.03 number format 4.025 = 4.03 ---- FAILED ================================================================================ 001+ round 0.045 = 0.04 002+ number format 0.045 = 0.04 001- round 0.045 = 0.05 002- number format 0.045 = 0.05 007+ round 5.045 = 5.04 008+ number format 5.045 = 5.04 009+ 010+ round 5.055 = 5.05 011+ number format 5.055 = 5.05 012+ 013+ round 3.025 = 3.02 014+ number format 3.025 = 3.02 007- round 5.045 = 5.05 008- number format 5.045 = 5.05 010- round 5.055 = 5.06 011- number format 5.055 = 5.06 012- 013- round 3.025 = 3.03 014- number format 3.025 = 3.03 015- ================================================================================ ================================================================================ /var/tmp/apache/php-5.0.4/ext/standard/tests/serialize/bug31402.phpt ================================================================================ ---- EXPECTED OUTPUT object(y)(2) { ["A"]=> array(2) { [1]=> object(x)(1) { ["i"]=> int(1) } [2]=> object(x)(1) { ["i"]=> int(2) } } ["B"]=> object(x)(1) { ["i"]=> int(1) } } object(y)(2) { ["A"]=> array(2) { [1]=> &object(x)(1) { ["i"]=> int(1) } [2]=> object(x)(1) { ["i"]=> int(2) } } ["B"]=> &object(x)(1) { ["i"]=> int(1) } } ---- ACTUAL OUTPUT Strict Standards: var: Deprecated. Please use the public/private/protected modifiers in /var/tmp/apache/php-5.0.4/ext/standard/tests/serialize/bug31402.php on line 4 Strict Standards: var: Deprecated. Please use the public/private/protected modifiers in /var/tmp/apache/php-5.0.4/ext/standard/tests/serialize/bug31402.php on line 12 Strict Standards: var: Deprecated. Please use the public/private/protected modifiers in /var/tmp/apache/php-5.0.4/ext/standard/tests/serialize/bug31402.php on line 13 object(Y)#1 (2) { ["A"]=> array(2) { [1]=> object(X)#2 (1) { ["i"]=> int(1) } [2]=> object(X)#3 (1) { ["i"]=> int(2) } } ["B"]=> object(X)#2 (1) { ["i"]=> int(1) } } object(Y)#4 (2) { ["A"]=> array(2) { [1]=> object(X)#5 (1) { ["i"]=> int(1) } [2]=> object(X)#6 (1) { ["i"]=> int(2) } } ["B"]=> object(X)#5 (1) { ["i"]=> int(1) } } ---- FAILED ================================================================================ 001+ Strict Standards: var: Deprecated. Please use the public/private/protected modifiers in /var/tmp/apache/php-5.0.4/ext/standard/tests/serialize/bug31402.php on line 4 002+ 003+ Strict Standards: var: Deprecated. Please use the public/private/protected modifiers in /var/tmp/apache/php-5.0.4/ext/standard/tests/serialize/bug31402.php on line 12 004+ 005+ Strict Standards: var: Deprecated. Please use the public/private/protected modifiers in /var/tmp/apache/php-5.0.4/ext/standard/tests/serialize/bug31402.php on line 13 006+ object(Y)#1 (2) { 001- object(y)(2) { 005- object(x)(1) { 010+ object(X)#2 (1) { 010- object(x)(1) { 015+ object(X)#3 (1) { 016- object(x)(1) { 021+ object(X)#2 (1) { 021- object(y)(2) { 025- &object(x)(1) { 026+ object(Y)#4 (2) { 030+ object(X)#5 (1) { 030- object(x)(1) { 035+ object(X)#6 (1) { 036- &object(x)(1) { 041+ object(X)#5 (1) { ================================================================================ ================================================================================ /var/tmp/apache/php-5.0.4/ext/standard/tests/strings/bug29119.phpt ================================================================================ ---- EXPECTED OUTPUT string(42) "e28082e28089e28098e280a0e280b2e28184e282ac" ---- ACTUAL OUTPUT string(40) "e28082e28089e28098e280a0e280b2e28184c686" ---- FAILED ================================================================================ 001+ string(40) "e28082e28089e28098e280a0e280b2e28184c686" 001- string(42) "e28082e28089e28098e280a0e280b2e28184e282ac" ================================================================================ ================================================================================ /var/tmp/apache/php-5.0.4/ext/standard/tests/time/bug20382.phpt ================================================================================ ---- EXPECTED OUTPUT tStamp=Wednesday 2004-10-27 17:17:17 CEST result=Monday 2004-11-01 00:00:00 CET wanted=Monday 2004-11-01 00:00:00 CET ---- ACTUAL OUTPUT tStamp=Wednesday 2004-10-27 17:17:17 CEST result=Sunday 2004-10-31 23:00:00 CET wanted=Monday 2004-11-01 00:00:00 CET ---- FAILED ================================================================================ 002+ result=Sunday 2004-10-31 23:00:00 CET 002- result=Monday 2004-11-01 00:00:00 CET ================================================================================ ================================================================================ /var/tmp/apache/php-5.0.4/ext/xml/tests/bug26614.phpt ================================================================================ ---- EXPECTED OUTPUT CDATA <DATA> at line 2, col 0 (byte 45) </DATA> at line 9, col 0 (byte 90) Comment <DATA> at line 2, col 0 (byte 45) </DATA> at line 9, col 0 (byte 90) Text <DATA> at line 2, col 0 (byte 45) </DATA> at line 9, col 0 (byte 90) ---- ACTUAL OUTPUT CDATA <DATA> at line 2, col 6 (byte 9) </DATA> at line 9, col 8 (byte 56) Comment <DATA> at line 2, col 6 (byte 9) </DATA> at line 9, col 8 (byte 56) Text <DATA> at line 2, col 6 (byte 9) </DATA> at line 9, col 8 (byte 56) ---- FAILED ================================================================================ 002+ <DATA> at line 2, col 6 (byte 9) 003+ </DATA> at line 9, col 8 (byte 56) 002- <DATA> at line 2, col 0 (byte 45) 003- </DATA> at line 9, col 0 (byte 90) 005+ <DATA> at line 2, col 6 (byte 9) 006+ </DATA> at line 9, col 8 (byte 56) 005- <DATA> at line 2, col 0 (byte 45) 006- </DATA> at line 9, col 0 (byte 90) 008+ <DATA> at line 2, col 6 (byte 9) 009+ </DATA> at line 9, col 8 (byte 56) 008- <DATA> at line 2, col 0 (byte 45) 009- </DATA> at line 9, col 0 (byte 90) ================================================================================ ================================================================================ BUILD ENVIRONMENT ================================================================================ OS: Linux - Linux kaede.kashiwagi 2.6.11-1.1369_FC4 #1 Thu Jun 2 22:55:56 EDT 2005 i686 Automake: automake (GNU automake) 1.9.5 Written by Tom Tromey <tromey@redhat.com>. Copyright 2005 Free Software Foundation, Inc. This is free software; see the source for copying conditions. There is NO warranty; not even for MERCHANTABILITY or FITNESS FOR A PARTICULAR PURPOSE. Autoconf: autoconf (GNU Autoconf) 2.59 Written by David J. MacKenzie and Akim Demaille. Copyright (C) 2003 Free Software Foundation, Inc. This is free software; see the source for copying conditions. There is NO warranty; not even for MERCHANTABILITY or FITNESS FOR A PARTICULAR PURPOSE. Bundled Libtool: ltmain.sh (GNU libtool) 1.4.3 (1.922.2.111 2002/10/23 02:54:36) System Libtool: ltmain.sh (GNU libtool) 1.5.16 (1.1220.2.235 2005/04/25 18:13:26) Copyright (C) 2005 Free Software Foundation, Inc. This is free software; see the source for copying conditions. There is NO warranty; not even for MERCHANTABILITY or FITNESS FOR A PARTICULAR PURPOSE. Compiler: Using built-in specs. Target: i386-redhat-linux コンフィグオプション: ../configure --prefix=/usr --mandir=/usr/share/man --infodir=/usr/share/info --enable-shared --enable-threads=posix --enable-checking=release --with-system-zlib --enable-__cxa_atexit --disable-libunwind-exceptions --enable-libgcj-multifile --enable-languages=c,c++,objc,java,f95,ada --enable-java-awt=gtk --with-java-home=/usr/lib/jvm/java-1.4.2-gcj-1.4.2.0/jre --host=i386-redhat-linux スレッドモデル: posix gcc バージョン 4.0.0 20050519 (Red Hat 4.0.0-8) Bison: bison (GNU Bison) 2.0 Written by Robert Corbett and Richard Stallman. Copyright (C) 2004 Free Software Foundation, Inc. This is free software; see the source for copying conditions. There is NO warranty; not even for MERCHANTABILITY or FITNESS FOR A PARTICULAR PURPOSE. [参考訳 -- 法的効力は英文が適用されます] これはフリーソフトウェアです -- 複製についての条件はソースを見ましょう。 一切の保証はありません -- 商業性や目的適合性についての保証すらありません。 Libraries: linux-gate.so.1 => (0x00131000) libcrypt.so.1 => /lib/libcrypt.so.1 (0x0567c000) libnsl.so.1 => /lib/libnsl.so.1 (0x0072a000) libbz2.so.1 => /usr/lib/libbz2.so.1 (0x057ab000) libz.so.1 => /usr/lib/libz.so.1 (0x0091f000) libresolv.so.2 => /lib/libresolv.so.2 (0x00ae1000) libm.so.6 => /lib/libm.so.6 (0x008f3000) libdl.so.2 => /lib/libdl.so.2 (0x00919000) libxml2.so.2 => /usr/lib/libxml2.so.2 (0x05567000) libgssapi_krb5.so.2 => /usr/lib/libgssapi_krb5.so.2 (0x00210000) libkrb5.so.3 => /usr/lib/libkrb5.so.3 (0x00d5c000) libk5crypto.so.3 => /usr/lib/libk5crypto.so.3 (0x00dd5000) libcom_err.so.2 => /lib/libcom_err.so.2 (0x00d57000) libssl.so.5 => /lib/libssl.so.5 (0x00241000) libcrypto.so.5 => /lib/libcrypto.so.5 (0x00279000) libpthread.so.0 => /lib/libpthread.so.0 (0x00a0a000) libc.so.6 => /lib/libc.so.6 (0x007c7000) /lib/ld-linux.so.2 (0x007a5000) libkrb5support.so.0 => /usr/lib/libkrb5support.so.0 (0x00dd0000) User's E-mail: ================================================================================ PHPINFO ================================================================================ phpinfo() PHP Version => 5.0.4 System => Linux kaede.kashiwagi 2.6.11-1.1369_FC4 #1 Thu Jun 2 22:55:56 EDT 2005 i686 Build Date => Aug 18 2005 22:03:13 Configure Command => './configure' '--prefix=/usr' '--sysconfdir=/etc' '--with-mod_charset' '--with-apxs2' '--with-layout=PHP' '--with-config-file-path=/etc' '--enable-sigcchild' '--enable-magic-quotes' '--enable-libgcc' '--enable-fd-setsize' '--with-openssl' '--with-libxml-dir' '--with-kerberos' '--with-zlib' '--enable-bcmath' '--with-bz2' '--enable-calendar' '--with-jpeg-dir' '--with-tiff-dir' '--with-curlwrappers' '--with--qdbm' '--with--gdbm' '--with--ndbm' '--with--db4' '--with--db3' '--with--db2' '--with--dbm' '--with--cdb' '--with--libxml-dir' '--with--fbsql' '--with--fdftk' '--enable-filepro' '--enable-ftp' '--with--gd' '--with--jpeg-dir' '--with--png-dir' '--with--zlib-dir' '--with--xpm-dir' '--with--ttf' '--with--freetype-dir' '--with--t1lib' '--enable-gd-native-ttf' '--enable-gd-jis-conv' '--with--gettext' '--with--gmp' '--with--hwapi' '--with-out-iconv' '--with--imap' '--with--kerberos' '--with--imap-ssl' '--with--informix' '--with--ingres' '--with--interbase' '! --with--ldap' '--with--ldap-sasl' '--enable-mbstring' '--disable-mbregex' '--with--libmbfl' '--with--mcrypt' '--with--mcve' '--with--openssl-dir' '--with--mhash' '--with--mime-magic' '--with--ming' '--with--mnogosearch' '--with--msession' '--with--msql' '--with--mssql' '--with--mysql' '--with--mysql-sock' '--with--zlib-dir' '--with--mysqli' '--enable-embedded-mysqli' '--with--ncurses' '--with-pcre' '--with--pgsql' '--with--libedit' '--with--readline' '--with--recode' '--with--mm' '--with--snmp' '--with--openssl-dir' '--enable-soap' '--enable-sockets' '--enable-sysvmsg' '--enable-sysvsem' '--enable-sysvshm' '--with--xmlrpc' '--with--xsl' '--enable-yp' '--enable-shared=yes' '--enable-fast-install=yes' '--with--gnu-ld' '--with--pic' Server API => Command Line Interface Virtual Directory Support => enabled Configuration File (php.ini) Path => /etc/php.ini PHP API => 20031224 PHP Extension => 20041030 Zend Extension => 220040412 Debug Build => no Thread Safety => enabled IPv6 Support => enabled Registered PHP Streams => php, file, http, ftp, compress.bzip2, compress.zlib, https, ftps Registered Stream Socket Transports => tcp, udp, unix, udg, ssl, sslv3, sslv2, tls This program makes use of the Zend Scripting Language Engine: Zend Engine v2.0.4-dev, Copyright (c) 1998-2004 Zend Technologies _______________________________________________________________________ Configuration PHP Core Directive => Local Value => Master Value allow_call_time_pass_reference => Off => Off allow_url_fopen => On => On always_populate_raw_post_data => Off => Off arg_separator.input => & => & arg_separator.output => & => & asp_tags => Off => Off auto_append_file => no value => no value auto_globals_jit => On => On auto_prepend_file => no value => no value browscap => no value => no value default_charset => no value => no value default_mimetype => text/html => text/html define_syslog_variables => Off => Off disable_classes => no value => no value disable_functions => no value => no value display_errors => Off => Off display_startup_errors => Off => Off doc_root => no value => no value docref_ext => no value => no value docref_root => no value => no value enable_dl => On => On error_append_string => no value => no value error_log => no value => no value error_prepend_string => no value => no value error_reporting => 2047 => 2047 expose_php => On => On extension_dir => /usr/lib/php/modules => /usr/lib/php/modules file_uploads => On => On highlight.bg => #FFFFFF => #FFFFFF highlight.comment => #FF8000 => #FF8000 highlight.default => #0000BB => #0000BB highlight.html => #000000 => #000000 highlight.keyword => #007700 => #007700 highlight.string => #DD0000 => #DD0000 html_errors => Off => On ignore_repeated_errors => Off => Off ignore_repeated_source => Off => Off ignore_user_abort => Off => Off implicit_flush => On => Off include_path => .:/usr/lib/php => .:/usr/lib/php log_errors => On => On log_errors_max_len => 1024 => 1024 magic_quotes_gpc => Off => Off magic_quotes_runtime => Off => Off magic_quotes_sybase => Off => Off mail.force_extra_parameters => no value => no value max_execution_time => 0 => 30 max_input_time => 60 => 60 open_basedir => no value => no value output_buffering => 0 => 4096 output_handler => no value => no value post_max_size => 8M => 8M precision => 14 => 14 register_argc_argv => On => On register_globals => Off => Off register_long_arrays => Off => Off report_memleaks => On => On report_zend_debug => Off => Off safe_mode => Off => Off safe_mode_exec_dir => no value => no value safe_mode_gid => Off => Off safe_mode_include_dir => no value => no value sendmail_from => no value => no value sendmail_path => /usr/sbin/sendmail -t -i => /usr/sbin/sendmail -t -i serialize_precision => 100 => 100 short_open_tag => On => On SMTP => localhost => localhost smtp_port => 25 => 25 sql.safe_mode => Off => Off track_errors => Off => Off unserialize_callback_func => no value => no value upload_max_filesize => 2M => 2M upload_tmp_dir => no value => no value user_dir => no value => no value variables_order => EGPCS => EGPCS xmlrpc_error_number => 0 => 0 xmlrpc_errors => Off => Off y2k_compliance => On => On zend.ze1_compatibility_mode => Off => Off bcmath BCMath support => enabled bz2 BZip2 Support => Enabled BZip2 Version => 1.0.2, 30-Dec-2001 calendar Calendar support => enabled ctype ctype functions => enabled dom DOM/XML => enabled DOM/XML API Version => 20031129 libxml Version => 2.6.19 HTML Support => enabled XPath Support => enabled XPointer Support => enabled Schema Support => enabled RelaxNG Support => enabled ftp FTP support => enabled iconv iconv support => enabled iconv implementation => glibc iconv library version => 2.3.5 Directive => Local Value => Master Value iconv.input_encoding => ISO-8859-1 => ISO-8859-1 iconv.internal_encoding => ISO-8859-1 => ISO-8859-1 iconv.output_encoding => ISO-8859-1 => ISO-8859-1 libxml libXML support => active libXML Version => 2.6.19 libXML streams => enabled mbstring Multibyte Support => enabled Multibyte string engine => libmbfl mbstring extension makes use of "streamable kanji code filter and converter", which is distributed under the GNU Lesser General Public License version 2.1. Directive => Local Value => Master Value mbstring.detect_order => auto => auto mbstring.encoding_translation => Off => Off mbstring.func_overload => 0 => 0 mbstring.http_input => auto => auto mbstring.http_output => SJIS => SJIS mbstring.internal_encoding => EUC-JP => EUC-JP mbstring.language => Japanese => Japanese mbstring.substitute_character => no value => no value openssl OpenSSL support => enabled OpenSSL Version => OpenSSL 0.9.7f 22 Mar 2005 pcre PCRE (Perl Compatible Regular Expressions) Support => enabled PCRE Library Version => 4.5 01-December-2003 posix Revision => $Revision: 1.60.2.2 $ session Session Support => enabled Registered save handlers => files user sqlite Registered serializer handlers => php php_binary Directive => Local Value => Master Value session.auto_start => Off => Off session.bug_compat_42 => Off => Off session.bug_compat_warn => On => On session.cache_expire => 180 => 180 session.cache_limiter => nocache => nocache session.cookie_domain => no value => no value session.cookie_lifetime => 0 => 0 session.cookie_path => / => / session.cookie_secure => Off => Off session.entropy_file => no value => no value session.entropy_length => 0 => 0 session.gc_divisor => 1000 => 1000 session.gc_maxlifetime => 1440 => 1440 session.gc_probability => 1 => 1 session.hash_bits_per_character => 5 => 5 session.hash_function => 0 => 0 session.name => PHPSESSID => PHPSESSID session.referer_check => no value => no value session.save_handler => files => files session.save_path => /var/lib/php/session => /var/lib/php/session session.serialize_handler => php => php session.use_cookies => On => On session.use_only_cookies => Off => Off session.use_trans_sid => 0 => 0 SimpleXML Simplexml support => enabled Revision => $Revision: 1.139.2.4 $ Schema support => enabled soap Soap Client => enabled Soap Server => enabled Directive => Local Value => Master Value soap.wsdl_cache_dir => /tmp => /tmp soap.wsdl_cache_enabled => 1 => 1 soap.wsdl_cache_ttl => 86400 => 86400 sockets Sockets Support => enabled SPL SPL support => enabled Interfaces => RecursiveIterator, SeekableIterator Classes => ArrayObject, ArrayIterator, CachingIterator, CachingRecursiveIterator, DirectoryIterator, FilterIterator, LimitIterator, ParentIterator, RecursiveDirectoryIterator, RecursiveIteratorIterator, SimpleXMLIterator SQLite SQLite support => enabled PECL Module version => 2.0-dev $Id: sqlite.c,v 1.146.2.3 2004/09/26 01:41:40 wez Exp $ SQLite Library => 2.8.14 SQLite Encoding => iso8859 Directive => Local Value => Master Value sqlite.assoc_case => 0 => 0 standard Regex Library => Bundled library enabled Dynamic Library Support => enabled Path to sendmail => /usr/sbin/sendmail -t -i Directive => Local Value => Master Value assert.active => 1 => 1 assert.bail => 0 => 0 assert.callback => no value => no value assert.quiet_eval => 0 => 0 assert.warning => 1 => 1 auto_detect_line_endings => 0 => 0 date.default_latitude => 31.7667 => 31.7667 date.default_longitude => 35.2333 => 35.2333 date.sunrise_zenith => 90.83 => 90.83 date.sunset_zenith => 90.83 => 90.83 default_socket_timeout => 60 => 60 safe_mode_allowed_env_vars => PHP_ => PHP_ safe_mode_protected_env_vars => LD_LIBRARY_PATH => LD_LIBRARY_PATH url_rewriter.tags => a=href,area=href,frame=src,input=src,form=fakeentry => a=href,area=href,frame=src,input=src,form=fakeentry user_agent => no value => no value sysvmsg sysvmsg support => enabled Revision => $Revision: 1.16.2.3 $ tokenizer Tokenizer Support => enabled xml XML Support => active XML Namespace Support => active libxml2 Version => 2.6.19 yp YP Support => enabled zlib ZLib Support => enabled Compiled Version => 1.2.2.2 Linked Version => 1.2.2.2 Directive => Local Value => Master Value zlib.output_compression => On => On zlib.output_compression_level => -1 => -1 zlib.output_handler => no value => no value Additional Modules Module Name filepro sysvsem sysvshm Environment Variable => Value SUPPORTED => ja_JP.UTF-8:ja_JP:ja SSH_AGENT_PID => 4997 HOSTNAME => kaede.kashiwagi TEST_PHP_SRCDIR => /usr/tmp/apache/php-5.0.4 SHELL => /bin/sh TERM => xterm HOST => kaede.kashiwagi MAKEFLAGS => HISTSIZE => 1000 SSH_CLIENT => deleted GTK_RC_FILES => /etc/gtk/gtkrc:/root/.gtkrc-1.2-gnome2 WINDOWID => 27263079 OLDPWD => /usr/tmp/apache/php-5.0.4 QTDIR => /usr/lib/qt-3.3 SSH_TTY => deleted USER => root GROUP => root LS_COLORS => no=00:fi=00:di=00;34:ln=00;36:pi=40;33:so=00;35:bd=40;33;01:cd=40;33;01:or=01;05;37;41:mi=01;05;37;41:ex=00;32:*.cmd=00;32:*.exe=00;32:*.com=00;32:*.btm=00;32:*.bat=00;32:*.sh=00;32:*.csh=00;32:*.tar=00;31:*.tgz=00;31:*.arj=00;31:*.taz=00;31:*.lzh=00;31:*.zip=00;31:*.z=00;31:*.Z=00;31:*.gz=00;31:*.bz2=00;31:*.bz=00;31:*.tz=00;31:*.rpm=00;31:*.cpio=00;31:*.jpg=00;35:*.gif=00;35:*.bmp=00;35:*.xbm=00;35:*.xpm=00;35:*.png=00;35:*.tif=00;35: SCRIPT_FILENAME => GNOME_KEYRING_SOCKET => /tmp/keyring-svqYKw/socket SSH_AUTH_SOCK => deleted HOSTTYPE => i386-linux KDEDIR => /usr SESSION_MANAGER => local/kaede.kashiwagi:/tmp/.ICE-unix/4946 MAKELEVEL => 1 MFLAGS => DESKTOP_SESSION => default PATH => /sbin:/usr/local/sbin/:/usr/sbin/:/usr/kerberos/sbin:/usr/kerberos/bin:/usr/local/sbin:/usr/local/bin:/sbin:/bin:/usr/sbin:/usr/bin:/usr/X11R6/bin:/root/bin MAIL => /var/spool/mail/root GDM_XSERVER_LOCATION => local PWD => /var/tmp/apache/php-5.0.4 INPUTRC => /etc/inputrc XMODIFIERS => @im=iiimx LANG => ja_JP.UTF-8 TEST_PHP_EXECUTABLE => /usr/tmp/apache/php-5.0.4/sapi/cli/php REDIRECT_STATUS => PATH_TRANSLATED => GDMSESSION => default SSH_ASKPASS => /usr/libexec/openssh/gnome-ssh-askpass HOME => /root SHLVL => 3 CONTENT_LENGTH => OSTYPE => linux GNOME_DESKTOP_SESSION_ID => Default VENDOR => intel MACHTYPE => i386 LOGNAME => root QUERY_STRING => DBUS_SESSION_BUS_ADDRESS => unix:abstract=/tmp/dbus-Fs2NEEDpvb,guid=6f7f084388be3f6e6deca61cefb6da00 LESSOPEN => |/usr/bin/lesspipe.sh %s CONTENT_TYPE => DISPLAY => :0.0 CC => /usr/tmp/apache/php-5.0.4/meta_ccld GTK_IM_MODULE => iiim REQUEST_METHOD => G_BROKEN_FILENAMES => 1 XAUTHORITY => /root/.Xauthority COLORTERM => gnome-terminal _ => /usr/tmp/apache/php-5.0.4/sapi/cli/php PHP Variables Variable => Value _SERVER["SUPPORTED"] => ja_JP.UTF-8:ja_JP:ja _SERVER["SSH_AGENT_PID"] => 4997 _SERVER["HOSTNAME"] => kaede.kashiwagi _SERVER["TEST_PHP_SRCDIR"] => /usr/tmp/apache/php-5.0.4 _SERVER["SHELL"] => /bin/sh _SERVER["TERM"] => xterm _SERVER["HOST"] => kaede.kashiwagi _SERVER["MAKEFLAGS"] => _SERVER["HISTSIZE"] => 1000 _SERVER["SSH_CLIENT"] => deleted _SERVER["GTK_RC_FILES"] => /etc/gtk/gtkrc:/root/.gtkrc-1.2-gnome2 _SERVER["WINDOWID"] => 27263079 _SERVER["OLDPWD"] => /usr/tmp/apache/php-5.0.4 _SERVER["QTDIR"] => /usr/lib/qt-3.3 _SERVER["SSH_TTY"] => deleted _SERVER["USER"] => root _SERVER["GROUP"] => root _SERVER["LS_COLORS"] => no=00:fi=00:di=00;34:ln=00;36:pi=40;33:so=00;35:bd=40;33;01:cd=40;33;01:or=01;05;37;41:mi=01;05;37;41:ex=00;32:*.cmd=00;32:*.exe=00;32:*.com=00;32:*.btm=00;32:*.bat=00;32:*.sh=00;32:*.csh=00;32:*.tar=00;31:*.tgz=00;31:*.arj=00;31:*.taz=00;31:*.lzh=00;31:*.zip=00;31:*.z=00;31:*.Z=00;31:*.gz=00;31:*.bz2=00;31:*.bz=00;31:*.tz=00;31:*.rpm=00;31:*.cpio=00;31:*.jpg=00;35:*.gif=00;35:*.bmp=00;35:*.xbm=00;35:*.xpm=00;35:*.png=00;35:*.tif=00;35: _SERVER["SCRIPT_FILENAME"] => _SERVER["GNOME_KEYRING_SOCKET"] => /tmp/keyring-svqYKw/socket _SERVER["SSH_AUTH_SOCK"] => deleted _SERVER["HOSTTYPE"] => i386-linux _SERVER["KDEDIR"] => /usr _SERVER["SESSION_MANAGER"] => local/kaede.kashiwagi:/tmp/.ICE-unix/4946 _SERVER["MAKELEVEL"] => 1 _SERVER["MFLAGS"] => _SERVER["DESKTOP_SESSION"] => default _SERVER["PATH"] => /sbin:/usr/local/sbin/:/usr/sbin/:/usr/kerberos/sbin:/usr/kerberos/bin:/usr/local/sbin:/usr/local/bin:/sbin:/bin:/usr/sbin:/usr/bin:/usr/X11R6/bin:/root/bin _SERVER["MAIL"] => /var/spool/mail/root _SERVER["GDM_XSERVER_LOCATION"] => local _SERVER["PWD"] => /var/tmp/apache/php-5.0.4 _SERVER["INPUTRC"] => /etc/inputrc _SERVER["XMODIFIERS"] => @im=iiimx _SERVER["LANG"] => ja_JP.UTF-8 _SERVER["TEST_PHP_EXECUTABLE"] => /usr/tmp/apache/php-5.0.4/sapi/cli/php _SERVER["REDIRECT_STATUS"] => _SERVER["PATH_TRANSLATED"] => _SERVER["GDMSESSION"] => default _SERVER["SSH_ASKPASS"] => /usr/libexec/openssh/gnome-ssh-askpass _SERVER["HOME"] => /root _SERVER["SHLVL"] => 3 _SERVER["CONTENT_LENGTH"] => _SERVER["OSTYPE"] => linux _SERVER["GNOME_DESKTOP_SESSION_ID"] => Default _SERVER["VENDOR"] => intel _SERVER["MACHTYPE"] => i386 _SERVER["LOGNAME"] => root _SERVER["QUERY_STRING"] => _SERVER["DBUS_SESSION_BUS_ADDRESS"] => unix:abstract=/tmp/dbus-Fs2NEEDpvb,guid=6f7f084388be3f6e6deca61cefb6da00 _SERVER["LESSOPEN"] => |/usr/bin/lesspipe.sh %s _SERVER["CONTENT_TYPE"] => _SERVER["DISPLAY"] => :0.0 _SERVER["CC"] => /usr/tmp/apache/php-5.0.4/meta_ccld _SERVER["GTK_IM_MODULE"] => iiim _SERVER["REQUEST_METHOD"] => _SERVER["G_BROKEN_FILENAMES"] => 1 _SERVER["XAUTHORITY"] => /root/.Xauthority _SERVER["COLORTERM"] => gnome-terminal _SERVER["_"] => /usr/tmp/apache/php-5.0.4/sapi/cli/php _SERVER["PHP_SELF"] => _SERVER["SCRIPT_NAME"] => _SERVER["DOCUMENT_ROOT"] => _SERVER["argv"] => Array ( ) _SERVER["argc"] => 0 _ENV["SUPPORTED"] => ja_JP.UTF-8:ja_JP:ja _ENV["SSH_AGENT_PID"] => 4997 _ENV["HOSTNAME"] => kaede.kashiwagi _ENV["TEST_PHP_SRCDIR"] => /usr/tmp/apache/php-5.0.4 _ENV["SHELL"] => /bin/sh _ENV["TERM"] => xterm _ENV["HOST"] => kaede.kashiwagi _ENV["MAKEFLAGS"] => _ENV["HISTSIZE"] => 1000 _ENV["SSH_CLIENT"] => deleted _ENV["GTK_RC_FILES"] => /etc/gtk/gtkrc:/root/.gtkrc-1.2-gnome2 _ENV["WINDOWID"] => 27263079 _ENV["OLDPWD"] => /usr/tmp/apache/php-5.0.4 _ENV["QTDIR"] => /usr/lib/qt-3.3 _ENV["SSH_TTY"] => deleted _ENV["USER"] => root _ENV["GROUP"] => root _ENV["LS_COLORS"] => no=00:fi=00:di=00;34:ln=00;36:pi=40;33:so=00;35:bd=40;33;01:cd=40;33;01:or=01;05;37;41:mi=01;05;37;41:ex=00;32:*.cmd=00;32:*.exe=00;32:*.com=00;32:*.btm=00;32:*.bat=00;32:*.sh=00;32:*.csh=00;32:*.tar=00;31:*.tgz=00;31:*.arj=00;31:*.taz=00;31:*.lzh=00;31:*.zip=00;31:*.z=00;31:*.Z=00;31:*.gz=00;31:*.bz2=00;31:*.bz=00;31:*.tz=00;31:*.rpm=00;31:*.cpio=00;31:*.jpg=00;35:*.gif=00;35:*.bmp=00;35:*.xbm=00;35:*.xpm=00;35:*.png=00;35:*.tif=00;35: _ENV["SCRIPT_FILENAME"] => _ENV["GNOME_KEYRING_SOCKET"] => /tmp/keyring-svqYKw/socket _ENV["SSH_AUTH_SOCK"] => deleted _ENV["HOSTTYPE"] => i386-linux _ENV["KDEDIR"] => /usr _ENV["SESSION_MANAGER"] => local/kaede.kashiwagi:/tmp/.ICE-unix/4946 _ENV["MAKELEVEL"] => 1 _ENV["MFLAGS"] => _ENV["DESKTOP_SESSION"] => default _ENV["PATH"] => /sbin:/usr/local/sbin/:/usr/sbin/:/usr/kerberos/sbin:/usr/kerberos/bin:/usr/local/sbin:/usr/local/bin:/sbin:/bin:/usr/sbin:/usr/bin:/usr/X11R6/bin:/root/bin _ENV["MAIL"] => /var/spool/mail/root _ENV["GDM_XSERVER_LOCATION"] => local _ENV["PWD"] => /var/tmp/apache/php-5.0.4 _ENV["INPUTRC"] => /etc/inputrc _ENV["XMODIFIERS"] => @im=iiimx _ENV["LANG"] => ja_JP.UTF-8 _ENV["TEST_PHP_EXECUTABLE"] => /usr/tmp/apache/php-5.0.4/sapi/cli/php _ENV["REDIRECT_STATUS"] => _ENV["PATH_TRANSLATED"] => _ENV["GDMSESSION"] => default _ENV["SSH_ASKPASS"] => /usr/libexec/openssh/gnome-ssh-askpass _ENV["HOME"] => /root _ENV["SHLVL"] => 3 _ENV["CONTENT_LENGTH"] => _ENV["OSTYPE"] => linux _ENV["GNOME_DESKTOP_SESSION_ID"] => Default _ENV["VENDOR"] => intel _ENV["MACHTYPE"] => i386 _ENV["LOGNAME"] => root _ENV["QUERY_STRING"] => _ENV["DBUS_SESSION_BUS_ADDRESS"] => unix:abstract=/tmp/dbus-Fs2NEEDpvb,guid=6f7f084388be3f6e6deca61cefb6da00 _ENV["LESSOPEN"] => |/usr/bin/lesspipe.sh %s _ENV["CONTENT_TYPE"] => _ENV["DISPLAY"] => :0.0 _ENV["CC"] => /usr/tmp/apache/php-5.0.4/meta_ccld _ENV["GTK_IM_MODULE"] => iiim _ENV["REQUEST_METHOD"] => _ENV["G_BROKEN_FILENAMES"] => 1 _ENV["XAUTHORITY"] => /root/.Xauthority _ENV["COLORTERM"] => gnome-terminal _ENV["_"] => /usr/tmp/apache/php-5.0.4/sapi/cli/php PHP License This program is free software; you can redistribute it and/or modify it under the terms of the PHP License as published by the PHP Group and included in the distribution in the file: LICENSE This program is distributed in the hope that it will be useful, but WITHOUT ANY WARRANTY; without even the implied warranty of MERCHANTABILITY or FITNESS FOR A PARTICULAR PURPOSE. If you did not receive a copy of the PHP license, or have any questions about PHP licensing, please contact license@php.net.

« previous php.qa (#25814) next »