Test results for 5.0.4 [failed]

From: Date: Mon, 22 Aug 2005 14:18:06 +0000
Subject: Test results for 5.0.4 [failed]
Groups: php.qa 
Request: Send a blank email to php-qa+get-25825@lists.php.net to get a copy of this message
===================================================================== FAILED TEST SUMMARY --------------------------------------------------------------------- Bug #31672 (one-line comment with </script>) [tests/basic/bug31672.phpt] Test for buffering in core functions with implicit flush off [tests/func/008.phpt] Convert warnings to exceptions [tests/lang/038.phpt] Bug #22836 (returning references to NULL) [Zend/tests/bug22836.phpt] Test 3: Exception Test [ext/dom/tests/dom003.phpt] Bug #16069 [ext/iconv/tests/bug16069.phpt] iconv stream filter [ext/iconv/tests/iconv_stream_filter.phpt] mysql connect [ext/mysql/tests/001.phpt] Bug #29992 (foreach by reference corrupts the array) [ext/standard/tests/array/bug29992.phpt] Bug #31213 (Sideeffects caused by bug #29493) [ext/standard/tests/array/bug31213.phpt] Bug #22414 (passthru() does not read data correctly) [ext/standard/tests/file/bug22414.phpt] date_sunrise() and date_sunset() functions [ext/standard/tests/general_functions/sunfuncts.phpt] Bug #31402 (unserialize() generates references when it should not) [ext/standard/tests/serialize/bug31402.phpt] Bug #29119 (html_entity_decode() misbehaves with UTF-8) [ext/standard/tests/strings/bug29119.phpt] Bug #20382 (strtotime ("Monday", $date) produces wrong result on DST changeover) [ext/standard/tests/time/bug20382.phpt] Bug #26614 (CDATA sections skipped on line count) [ext/xml/tests/bug26614.phpt] ===================================================================== ===================================================================== TEST RESULT SUMMARY --------------------------------------------------------------------- Exts skipped : 65 Exts tested : 20 --------------------------------------------------------------------- Number of tests : 1333 858 Tests skipped : 475 ( 35.6%) -------- Tests warned : 0 ( 0.0%) ( 0.0%) Tests failed : 16 ( 1.2%) ( 1.9%) Tests passed : 842 ( 63.2%) ( 98.1%) --------------------------------------------------------------------- Time taken : 60 seconds ===================================================================== ===================================================================== FAILED TEST SUMMARY --------------------------------------------------------------------- Bug #31672 (one-line comment with </script>) [tests/basic/bug31672.phpt] Test for buffering in core functions with implicit flush off [tests/func/008.phpt] Convert warnings to exceptions [tests/lang/038.phpt] Bug #22836 (returning references to NULL) [Zend/tests/bug22836.phpt] Test 3: Exception Test [ext/dom/tests/dom003.phpt] Bug #16069 [ext/iconv/tests/bug16069.phpt] iconv stream filter [ext/iconv/tests/iconv_stream_filter.phpt] mysql connect [ext/mysql/tests/001.phpt] Bug #29992 (foreach by reference corrupts the array) [ext/standard/tests/array/bug29992.phpt] Bug #31213 (Sideeffects caused by bug #29493) [ext/standard/tests/array/bug31213.phpt] Bug #22414 (passthru() does not read data correctly) [ext/standard/tests/file/bug22414.phpt] date_sunrise() and date_sunset() functions [ext/standard/tests/general_functions/sunfuncts.phpt] Bug #31402 (unserialize() generates references when it should not) [ext/standard/tests/serialize/bug31402.phpt] Bug #29119 (html_entity_decode() misbehaves with UTF-8) [ext/standard/tests/strings/bug29119.phpt] Bug #20382 (strtotime ("Monday", $date) produces wrong result on DST changeover) [ext/standard/tests/time/bug20382.phpt] Bug #26614 (CDATA sections skipped on line count) [ext/xml/tests/bug26614.phpt] ===================================================================== ================================================================================ /usr/local/src/php-5.0.4/tests/basic/bug31672.phpt ================================================================================ ---- EXPECTED OUTPUT Foobar Foobar ---- ACTUAL OUTPUT Foobar Foo ---- FAILED ================================================================================ 002+ Foo 002- Foobar ================================================================================ ================================================================================ /usr/local/src/php-5.0.4/tests/func/008.phpt ================================================================================ ---- EXPECTED OUTPUT 'foo1' 'foo2' ---- ACTUAL OUTPUT ---- FAILED ================================================================================ 001- 'foo1' 003- 'foo2' ================================================================================ ================================================================================ /usr/local/src/php-5.0.4/tests/lang/038.phpt ================================================================================ ---- EXPECTED OUTPUT string(15) "Error2Exception" string(5) "fopen" ===DONE=== ---- ACTUAL OUTPUT string(15) "Error2Exception" string(15) "Error2Exception" ===DONE=== ---- FAILED ================================================================================ 002+ string(15) "Error2Exception" 002- string(5) "fopen" ================================================================================ ================================================================================ /usr/local/src/php-5.0.4/Zend/tests/bug22836.phpt ================================================================================ ---- EXPECTED OUTPUT string(3) "foo" 'foo' Notice: Undefined variable: a in %s on line %d Strict Standards: Only variable references should be returned by reference in %s on line %d string(3) "foo" 'foo' Notice: Undefined variable: a in %s on line %d Strict Standards: Only variable references should be returned by reference in %s on line %d string(3) "foo" 'foo' Notice: Undefined variable: a in %s on line %d Strict Standards: Only variable references should be returned by reference in %s on line %d string(3) "foo" 'foo' Notice: Undefined variable: a in %s on line %d Strict Standards: Only variable references should be returned by reference in %s on line %d string(3) "foo" 'foo' Notice: Undefined variable: a in %s on line %d Strict Standards: Only variable references should be returned by reference in %s on line %d string(3) "foo" 'foo' Notice: Undefined variable: a in %s on line %d Strict Standards: Only variable references should be returned by reference in %s on line %d string(3) "foo" 'foo' Notice: Undefined variable: a in %s on line %d Strict Standards: Only variable references should be returned by reference in %s on line %d string(3) "foo" 'foo' Notice: Undefined variable: a in %s on line %d Strict Standards: Only variable references should be returned by reference in %s on line %d string(3) "foo" 'foo' Notice: Undefined variable: a in %s on line %d Strict Standards: Only variable references should be returned by reference in %s on line %d ---- ACTUAL OUTPUT string(3) "foo" 'foo' Notice: Undefined variable: a in /usr/local/src/php-5.0.4/Zend/tests/bug22836.php on line 7 Strict Standards: Only variable references should be returned by reference in /usr/local/src/php-5.0.4/Zend/tests/bug22836.php on line 7 string(3) "foo" 'foo' Notice: Undefined variable: a in /usr/local/src/php-5.0.4/Zend/tests/bug22836.php on line 7 Strict Standards: Only variable references should be returned by reference in /usr/local/src/php-5.0.4/Zend/tests/bug22836.php on line 7 NULL 'foo' Notice: Undefined variable: a in /usr/local/src/php-5.0.4/Zend/tests/bug22836.php on line 7 NULL 'foo' Notice: Undefined variable: a in /usr/local/src/php-5.0.4/Zend/tests/bug22836.php on line 7 NULL 'foo' Notice: Undefined variable: a in /usr/local/src/php-5.0.4/Zend/tests/bug22836.php on line 7 NULL 'foo' Notice: Undefined variable: a in /usr/local/src/php-5.0.4/Zend/tests/bug22836.php on line 7 NULL 'foo' Notice: Undefined variable: a in /usr/local/src/php-5.0.4/Zend/tests/bug22836.php on line 7 NULL 'foo' Notice: Undefined variable: a in /usr/local/src/php-5.0.4/Zend/tests/bug22836.php on line 7 ---- FAILED ================================================================================ 013+ NULL 013- string(3) "foo" 017+ NULL 018+ 'foo' 018- Strict Standards: Only variable references should be returned by reference in %s on line %d 019- string(3) "foo" 020+ Notice: Undefined variable: a in /usr/local/src/php-5.0.4/Zend/tests/bug22836.php on line 7 021+ NULL 022+ 'foo' 023+ 024+ Notice: Undefined variable: a in /usr/local/src/php-5.0.4/Zend/tests/bug22836.php on line 7 025+ NULL 026+ 'foo' 027+ 028+ Notice: Undefined variable: a in /usr/local/src/php-5.0.4/Zend/tests/bug22836.php on line 7 029+ NULL 030+ 'foo' 031+ 032+ Notice: Undefined variable: a in /usr/local/src/php-5.0.4/Zend/tests/bug22836.php on line 7 033+ NULL 023- 024- Strict Standards: Only variable references should be returned by reference in %s on line %d 025- string(3) "foo" 026- 'foo' 027- 028- Notice: Undefined variable: a in %s on line %d 029- 030- Strict Standards: Only variable references should be returned by reference in %s on line %d 031- string(3) "foo" 032- 'foo' 033- 034- Notice: Undefined variable: a in %s on line %d 035- 036- Strict Standards: Only variable references should be returned by reference in %s on line %d 037- string(3) "foo" 038- 'foo' 039- 040- Notice: Undefined variable: a in %s on line %d 041- 042- Strict Standards: Only variable references should be returned by reference in %s on line %d 043- string(3) "foo" 044- 'foo' 045- 046- Notice: Undefined variable: a in %s on line %d 047- 048- Strict Standards: Only variable references should be returned by reference in %s on line %d 049- string(3) "foo" 050- 'foo' 051- 052- Notice: Undefined variable: a in %s on line %d 053- 054- Strict Standards: Only variable references should be returned by reference in %s on line %d ================================================================================ ================================================================================ /usr/local/src/php-5.0.4/ext/dom/tests/dom003.phpt ================================================================================ ---- EXPECTED OUTPUT --- Catch exception with try/catch object(DOMException)#%d (6) { ["message:protected"]=> string(23) "Hierarchy Request Error" ["string:private"]=> string(0) "" ["file:protected"]=> string(%d) "%s/ext/dom/tests/dom003.php" ["line:protected"]=> int(8) ["trace:private"]=> array(0) { } ["code"]=> int(3) } --- Don't catch exception with try/catch Fatal error: Uncaught exception 'DOMException' with message 'Hierarchy Request Error' in %sdom003.php:%d Stack trace: #0 {main} thrown in %sdom003.php on line %d ---- ACTUAL OUTPUT --- Catch exception with try/catch object(DOMException)#3 (6) { ["message:protected"]=> string(23) "Hierarchy Request Error" ["string:private"]=> string(0) "" ["file:protected"]=> string(49) "/usr/local/src/php-5.0.4/ext/dom/tests/dom003.php" ["line:protected"]=> int(8) ["trace:private"]=> array(1) { [0]=> array(6) { ["file"]=> string(49) "/usr/local/src/php-5.0.4/ext/dom/tests/dom003.php" ["line"]=> int(8) ["function"]=> string(11) "appendChild" ["class"]=> string(10) "DOMElement" ["type"]=> string(2) "->" ["args"]=> array(1) { [0]=> object(DOMElement)#2 (0) { } } } } ["code"]=> int(3) } --- Don't catch exception with try/catch Fatal error: Uncaught exception 'DOMException' with message 'Hierarchy Request Error' in /usr/local/src/php-5.0.4/ext/dom/tests/dom003.php:13 Stack trace: #0 /usr/local/src/php-5.0.4/ext/dom/tests/dom003.php(13): DOMElement->appendChild(Object(DOMElement)) #1 {main} thrown in /usr/local/src/php-5.0.4/ext/dom/tests/dom003.php on line 13 ---- FAILED ================================================================================ 012+ array(1) { 013+ [0]=> 014+ array(6) { 015+ ["file"]=> 016+ string(49) "/usr/local/src/php-5.0.4/ext/dom/tests/dom003.php" 017+ ["line"]=> 018+ int(8) 019+ ["function"]=> 020+ string(11) "appendChild" 021+ ["class"]=> 022+ string(10) "DOMElement" 012- array(0) { 013- } 014- ["code"]=> 015- int(3) 016- } 017- --- Don't catch exception with try/catch 018- 019- Fatal error: Uncaught exception 'DOMException' with message 'Hierarchy Request Error' in %sdom003.php:%d 020- Stack trace: 021- #0 {main} 022- thrown in %sdom003.php on line %d 023+ ["type"]=> 024+ string(2) "->" 025+ ["args"]=> 026+ array(1) { 027+ [0]=> 028+ object(DOMElement)#2 (0) { 029+ } 030+ } 031+ } 032+ } 033+ ["code"]=> 034+ int(3) 035+ } 036+ --- Don't catch exception with try/catch 037+ 038+ Fatal error: Uncaught exception 'DOMException' with message 'Hierarchy Request Error' in /usr/local/src/php-5.0.4/ext/dom/tests/dom003.php:13 039+ Stack trace: 040+ #0 /usr/local/src/php-5.0.4/ext/dom/tests/dom003.php(13): DOMElement->appendChild(Object(DOMElement)) 041+ #1 {main} 042+ thrown in /usr/local/src/php-5.0.4/ext/dom/tests/dom003.php on line 13 ================================================================================ ================================================================================ /usr/local/src/php-5.0.4/ext/iconv/tests/bug16069.phpt ================================================================================ ---- EXPECTED OUTPUT ¥ß¥ê¥Ð¡¼¥ë¥ß¥ê¥Ð¡¼¥ë¥ß¥ê¥Ð¡¼¥ë¥ß¥ê¥Ð¡¼¥ë¥ß¥ê¥Ð¡¼¥ë¥ß¥ê¥Ð¡¼¥ë¥ß¥ê¥Ð¡¼¥ë¥ß¥ê¥Ð¡¼¥ë¥ß¥ê¥Ð¡¼¥ë¥ß¥ê¥Ð¡¼¥ë¥ß¥ê¥Ð¡¼¥ë¥ß¥ê¥Ð¡¼¥ë¥ß¥ê¥Ð¡¼¥ë¥ß¥ê¥Ð¡¼¥ë¥ß¥ê¥Ð¡¼¥ë¥ß¥ê¥Ð¡¼¥ë¥ß¥ê¥Ð¡¼¥ë¥ß¥ê¥Ð¡¼¥ë¥ß¥ê¥Ð¡¼¥ë¥ß¥ê¥Ð¡¼¥ë¥ß¥ê¥Ð¡¼¥ë¥ß¥ê¥Ð¡¼¥ë¥ß¥ê¥Ð¡¼¥ë¥ß¥ê¥Ð¡¼¥ë¥ß¥ê¥Ð¡¼¥ë¥ß¥ê¥Ð¡¼¥ë¥ß¥ê¥Ð¡¼¥ë¥ß¥ê¥Ð¡¼¥ë¥ß¥ê¥Ð¡¼¥ë¥ß¥ê¥Ð¡¼¥ë¥ß¥ê¥Ð¡¼¥ë¥ß¥ê¥Ð¡¼¥ë¥ß¥ê¥Ð¡¼¥ë¥ß¥ê¥Ð¡¼¥ë¥ß¥ê¥Ð¡¼¥ë¥ß¥ê¥Ð¡¼¥ë¥ß¥ê¥Ð¡¼¥ë¥ß¥ê¥Ð¡¼¥ë¥ß¥ê¥Ð¡¼¥ë¥ß¥ê¥Ð¡¼¥ë(¡ë§¥¡ë) ---- ACTUAL OUTPUT ¥ß¥ê¥Ð¡¼¥ë¥ß¥ê¥Ð¡¼¥ë¥ß¥ê¥Ð¡¼¥ë¥ß¥ê¥Ð¡¼¥ë¥ß¥ê¥Ð¡¼¥ë¥ß¥ê¥Ð¡¼¥ë¥ß¥ê¥Ð¡¼¥ë¥ß¥ê¥Ð¡¼¥ë¥ß¥ê¥Ð¡¼¥ë¥ß¥ê¥Ð¡¼¥ë¥ß¥ê¥Ð¡¼¥ë¥ß¥ß¥ê¥Ð¡¼¥ë¥ß¥ê¥Ð¡¼¥ë¥ß¥ê¥Ð¡¼¥ë¥ß¥ê¥Ð¡¼¥ë¥ß¥ê¥Ð¡¼¥ë¥ß¥ê¥Ð¡¼¥ë¥ß¥ê¥Ð¡¼¥ë¥ß¥ê¥Ð¡¼¥ë¥ß¥ê¥Ð¡¼¥ë¥ß¥ê¥Ð¡¼¥ë¥ß¥ê¥Ð¡¼¥ë¥ß¥ê¥Ð¡¼¥ë¥ß¥ê¥Ð¡¼¥ë¥ß¥ê¥Ð¡¼¥ë¥ß¥ê¥Ð¡¼¥ë¥ß¥ê¥Ð¡¼¥ë¥ß¥ê¥Ð¡¼¥ë¥ß¥ê¥Ð¡¼¥ë¥ß¥ê¥Ð¡¼¥ë¥ß¥ê¥Ð¡¼¥ë¥ß¥ê¥Ð¡¼¥ë¥ß¥ê¥Ð¡¼¥ë¥ß¥ê¥Ð¡¼¥ë¥ß¥ê¥Ð¡¼¥ë¥ß¥ê¥Ð¡¼¥ë¥ß¥ê¥Ð¡¼¥ë¥ß¥ê¥Ð¡¼¥ë¥ß¥ê¥Ð¡¼¥ë¥ß¥ê¥Ð¡¼¥ë(¡ë§¥¡ë) ---- FAILED ================================================================================ 001+ ¥ß¥ê¥Ð¡¼¥ë¥ß¥ê¥Ð¡¼¥ë¥ß¥ê¥Ð¡¼¥ë¥ß¥ê¥Ð¡¼¥ë¥ß¥ê¥Ð¡¼¥ë¥ß¥ê¥Ð¡¼¥ë¥ß¥ê¥Ð¡¼¥ë¥ß¥ê¥Ð¡¼¥ë¥ß¥ê¥Ð¡¼¥ë¥ß¥ê¥Ð¡¼¥ë¥ß¥ê¥Ð¡¼¥ë¥ß¥ß¥ê¥Ð¡¼¥ë¥ß¥ê¥Ð¡¼¥ë¥ß¥ê¥Ð¡¼¥ë¥ß¥ê¥Ð¡¼¥ë¥ß¥ê¥Ð¡¼¥ë¥ß¥ê¥Ð¡¼¥ë¥ß¥ê¥Ð¡¼¥ë¥ß¥ê¥Ð¡¼¥ë¥ß¥ê¥Ð¡¼¥ë¥ß¥ê¥Ð¡¼¥ë¥ß¥ê¥Ð¡¼¥ë¥ß¥ê¥Ð¡¼¥ë¥ß¥ê¥Ð¡¼¥ë¥ß¥ê¥Ð¡¼¥ë¥ß¥ê¥Ð¡¼¥ë¥ß¥ê¥Ð¡¼¥ë¥ß¥ê¥Ð¡¼¥ë¥ß¥ê¥Ð¡¼¥ë¥ß¥ê¥Ð¡¼¥ë¥ß¥ê¥Ð¡¼¥ë¥ß¥ê¥Ð¡¼¥ë¥ß¥ê¥Ð¡¼¥ë¥ß¥ê¥Ð¡¼¥ë¥ß¥ê¥Ð¡¼¥ë¥ß¥ê¥Ð¡¼¥ë¥ß¥ê¥Ð¡¼¥ë¥ß¥ê¥Ð¡¼¥ë¥ß¥ê¥Ð¡¼¥ë¥ß¥ê¥Ð¡¼¥ë(¡ë§¥¡ë) 001- ¥ß¥ê¥Ð¡¼¥ë¥ß¥ê¥Ð¡¼¥ë¥ß¥ê¥Ð¡¼¥ë¥ß¥ê¥Ð¡¼¥ë¥ß¥ê¥Ð¡¼¥ë¥ß¥ê¥Ð¡¼¥ë¥ß¥ê¥Ð¡¼¥ë¥ß¥ê¥Ð¡¼¥ë¥ß¥ê¥Ð¡¼¥ë¥ß¥ê¥Ð¡¼¥ë¥ß¥ê¥Ð¡¼¥ë¥ß¥ê¥Ð¡¼¥ë¥ß¥ê¥Ð¡¼¥ë¥ß¥ê¥Ð¡¼¥ë¥ß¥ê¥Ð¡¼¥ë¥ß¥ê¥Ð¡¼¥ë¥ß¥ê¥Ð¡¼¥ë¥ß¥ê¥Ð¡¼¥ë¥ß¥ê¥Ð¡¼¥ë¥ß¥ê¥Ð¡¼¥ë¥ß¥ê¥Ð¡¼¥ë¥ß¥ê¥Ð¡¼¥ë¥ß¥ê¥Ð¡¼¥ë¥ß¥ê¥Ð¡¼¥ë¥ß¥ê¥Ð¡¼¥ë¥ß¥ê¥Ð¡¼¥ë¥ß¥ê¥Ð¡¼¥ë¥ß¥ê¥Ð¡¼¥ë¥ß¥ê¥Ð¡¼¥ë¥ß¥ê¥Ð¡¼¥ë¥ß¥ê¥Ð¡¼¥ë¥ß¥ê¥Ð¡¼¥ë¥ß¥ê¥Ð¡¼¥ë¥ß¥ê¥Ð¡¼¥ë¥ß¥ê¥Ð¡¼¥ë¥ß¥ê¥Ð¡¼¥ë¥ß¥ê¥Ð¡¼¥ë¥ß¥ê¥Ð¡¼¥ë¥ß¥ê¥Ð¡¼¥ë¥ß¥ê¥Ð¡¼¥ë(¡ë§¥¡ë) ================================================================================ ================================================================================ /usr/local/src/php-5.0.4/ext/iconv/tests/iconv_stream_filter.phpt ================================================================================ ---- EXPECTED OUTPUT string(20) "1b244224332473244b24" string(10) "41244f1b28" string(2) "42" string(20) "a4b3a4f3a4cba4c1a4cf" string(10) "69636f6e76" string(2) "0a" Warning: fread(): iconv stream filter ("ISO-2022-JP"=>"EUC-JP"): invalid multibyte sequence in %s on line %d string(0) "" string(0) "" string(0) "" ---- ACTUAL OUTPUT string(20) "1b244224332473244b24" string(10) "41244f1b28" string(2) "42" string(20) "a4b3a4f3a4cba4c1a4cf" string(10) "69636f6e76" string(2) "0a" string(20) "1b244f24332466245824" string(10) "4e24421b28" string(2) "4f" ---- FAILED ================================================================================ 007+ string(20) "1b244f24332466245824" 008+ string(10) "4e24421b28" 009+ string(2) "4f" 007- 008- Warning: fread(): iconv stream filter ("ISO-2022-JP"=>"EUC-JP"): invalid multibyte sequence in %s on line %d 009- string(0) "" 010- string(0) "" 011- string(0) "" ================================================================================ ================================================================================ /usr/local/src/php-5.0.4/ext/mysql/tests/001.phpt ================================================================================ ---- EXPECTED OUTPUT string(3) "111" ---- ACTUAL OUTPUT Warning: mysql_connect(): Unknown database '-Max' in /usr/local/src/php-5.0.4/ext/mysql/tests/001.php on line 17 Warning: mysql_close(): supplied argument is not a valid MySQL-Link resource in /usr/local/src/php-5.0.4/ext/mysql/tests/001.php on line 19 string(3) "110" ---- FAILED ================================================================================ 001+ Warning: mysql_connect(): Unknown database '-Max' in /usr/local/src/php-5.0.4/ext/mysql/tests/001.php on line 17 001- string(3) "111" 002+ 003+ Warning: mysql_close(): supplied argument is not a valid MySQL-Link resource in /usr/local/src/php-5.0.4/ext/mysql/tests/001.php on line 19 004+ string(3) "110" ================================================================================ ================================================================================ /usr/local/src/php-5.0.4/ext/standard/tests/array/bug29992.phpt ================================================================================ ---- EXPECTED OUTPUT Array ( [0] => 1 [1] => 2 [2] => 3 ) int(1) int(2) int(3) int(1) int(2) int(3) int(1) int(2) int(3) int(1) int(2) int(3) Array ( [0] => 1 [1] => 2 [2] => 3 ) ===DONE=== ---- ACTUAL OUTPUT Array ( [0] => 1 [1] => 2 [2] => 3 ) int(1) int(2) int(3) int(1) int(2) int(3) int(1) int(2) int(3) int(1) int(2) int(2) Array ( [0] => 1 [1] => 2 [2] => 2 ) ===DONE=== ---- FAILED ================================================================================ 018+ int(2) 018- int(3) 023+ [2] => 2 023- [2] => 3 ================================================================================ ================================================================================ /usr/local/src/php-5.0.4/ext/standard/tests/array/bug31213.phpt ================================================================================ ---- EXPECTED OUTPUT int(1) int(1) int(1) int(2) int(2) int(2) array(2) { ["_a"]=> &int(2) ["_b"]=> &int(2) } int(1) int(1) int(1) int(2) int(2) int(2) array(2) { ["_a"]=> &int(2) ["_b"]=> &int(2) } ---- ACTUAL OUTPUT int(1) int(1) int(1) int(2) int(2) int(2) array(2) { ["_a"]=> &int(2) ["_b"]=> &int(2) } int(1) int(1) int(2) int(2) int(2) int(2) array(2) { ["_a"]=> &int(2) ["_b"]=> &int(2) } ---- FAILED ================================================================================ 015+ int(2) 015- int(1) ================================================================================ ================================================================================ /usr/local/src/php-5.0.4/ext/standard/tests/file/bug22414.phpt ================================================================================ ---- EXPECTED OUTPUT HELLO Works ---- ACTUAL OUTPUT HELLO Does not work ---- FAILED ================================================================================ 002+ Does not work 002- Works ================================================================================ ================================================================================ /usr/local/src/php-5.0.4/ext/standard/tests/general_functions/sunfuncts.phpt ================================================================================ ---- EXPECTED OUTPUT 1041293199 06:39 6.652455761896 1041293806 16:46 16.76937486746 1043971592 06:32 6.54537029266 1043972233 17:13 17.21752470874 1046390766 06:06 6.115652675685 1046391456 17:36 17.6108549623 1049069128 05:28 5.472742029069 1049069878 17:58 17.97255258437 1051661094 04:54 4.901229982859 1051661898 18:18 18.31368876948 1054339474 04:34 4.57442928945 1054340319 18:39 18.65640094324 1056931476 04:36 4.616120450519 1056932328 18:48 18.80887165777 1059609894 04:54 4.906882509836 1059610715 18:35 18.59928600203 1062288314 05:14 5.236889557074 1062289083 18:03 18.06054178788 1064880332 05:32 5.542366581139 1064881044 17:24 17.41150561492 1067558754 05:54 5.916208842058 1067559410 16:50 16.83369857063 1070150780 06:20 6.34622155207 1070151395 16:35 16.58358905554 ---- ACTUAL OUTPUT 1041316748 06:39 6.652455761896 1041353169 16:46 16.76937486746 1043994763 06:32 6.54537029266 1044033183 17:13 17.21752470874 1046412416 06:06 6.115652675685 1046453799 17:36 17.6108549623 1049088501 05:28 5.472742029069 1049133501 17:58 17.97255258437 1051678444 04:54 4.901229982859 1051726729 18:18 18.31368876948 1054355667 04:34 4.57442928945 1054406363 18:39 18.65640094324 1056947818 04:36 4.616120450519 1056998911 18:48 18.80887165777 1059627264 04:54 4.906882509836 1059676557 18:35 18.59928600203 1062306852 05:14 5.236889557074 1062353017 18:03 18.06054178788 1064899952 05:32 5.542366581139 1064942681 17:24 17.41150561492 1067579698 05:54 5.916208842058 1067619001 16:50 16.83369857063 1070173246 06:20 6.34622155207 1070210100 16:35 16.58358905554 ---- FAILED ================================================================================ 001+ 1041316748 06:39 6.652455761896 002+ 1041353169 16:46 16.76937486746 003+ 1043994763 06:32 6.54537029266 004+ 1044033183 17:13 17.21752470874 005+ 1046412416 06:06 6.115652675685 006+ 1046453799 17:36 17.6108549623 007+ 1049088501 05:28 5.472742029069 008+ 1049133501 17:58 17.97255258437 009+ 1051678444 04:54 4.901229982859 010+ 1051726729 18:18 18.31368876948 011+ 1054355667 04:34 4.57442928945 012+ 1054406363 18:39 18.65640094324 013+ 1056947818 04:36 4.616120450519 014+ 1056998911 18:48 18.80887165777 015+ 1059627264 04:54 4.906882509836 016+ 1059676557 18:35 18.59928600203 017+ 1062306852 05:14 5.236889557074 018+ 1062353017 18:03 18.06054178788 019+ 1064899952 05:32 5.542366581139 020+ 1064942681 17:24 17.41150561492 021+ 1067579698 05:54 5.916208842058 022+ 1067619001 16:50 16.83369857063 023+ 1070173246 06:20 6.34622155207 024+ 1070210100 16:35 16.58358905554 001- 1041293199 06:39 6.652455761896 002- 1041293806 16:46 16.76937486746 003- 1043971592 06:32 6.54537029266 004- 1043972233 17:13 17.21752470874 005- 1046390766 06:06 6.115652675685 006- 1046391456 17:36 17.6108549623 007- 1049069128 05:28 5.472742029069 008- 1049069878 17:58 17.97255258437 009- 1051661094 04:54 4.901229982859 010- 1051661898 18:18 18.31368876948 011- 1054339474 04:34 4.57442928945 012- 1054340319 18:39 18.65640094324 013- 1056931476 04:36 4.616120450519 014- 1056932328 18:48 18.80887165777 015- 1059609894 04:54 4.906882509836 016- 1059610715 18:35 18.59928600203 017- 1062288314 05:14 5.236889557074 018- 1062289083 18:03 18.06054178788 019- 1064880332 05:32 5.542366581139 020- 1064881044 17:24 17.41150561492 021- 1067558754 05:54 5.916208842058 022- 1067559410 16:50 16.83369857063 023- 1070150780 06:20 6.34622155207 024- 1070151395 16:35 16.58358905554 ================================================================================ ================================================================================ /usr/local/src/php-5.0.4/ext/standard/tests/serialize/bug31402.phpt ================================================================================ ---- EXPECTED OUTPUT object(y)(2) { ["A"]=> array(2) { [1]=> object(x)(1) { ["i"]=> int(1) } [2]=> object(x)(1) { ["i"]=> int(2) } } ["B"]=> object(x)(1) { ["i"]=> int(1) } } object(y)(2) { ["A"]=> array(2) { [1]=> &object(x)(1) { ["i"]=> int(1) } [2]=> object(x)(1) { ["i"]=> int(2) } } ["B"]=> &object(x)(1) { ["i"]=> int(1) } } ---- ACTUAL OUTPUT Strict Standards: var: Deprecated. Please use the public/private/protected modifiers in /usr/local/src/php-5.0.4/ext/standard/tests/serialize/bug31402.php on line 4 Strict Standards: var: Deprecated. Please use the public/private/protected modifiers in /usr/local/src/php-5.0.4/ext/standard/tests/serialize/bug31402.php on line 12 Strict Standards: var: Deprecated. Please use the public/private/protected modifiers in /usr/local/src/php-5.0.4/ext/standard/tests/serialize/bug31402.php on line 13 object(Y)#1 (2) { ["A"]=> array(2) { [1]=> object(X)#2 (1) { ["i"]=> int(1) } [2]=> object(X)#3 (1) { ["i"]=> int(2) } } ["B"]=> object(X)#2 (1) { ["i"]=> int(1) } } object(Y)#4 (2) { ["A"]=> array(2) { [1]=> object(X)#5 (1) { ["i"]=> int(1) } [2]=> object(X)#6 (1) { ["i"]=> int(2) } } ["B"]=> object(X)#5 (1) { ["i"]=> int(1) } } ---- FAILED ================================================================================ 001+ Strict Standards: var: Deprecated. Please use the public/private/protected modifiers in /usr/local/src/php-5.0.4/ext/standard/tests/serialize/bug31402.php on line 4 002+ 003+ Strict Standards: var: Deprecated. Please use the public/private/protected modifiers in /usr/local/src/php-5.0.4/ext/standard/tests/serialize/bug31402.php on line 12 004+ 005+ Strict Standards: var: Deprecated. Please use the public/private/protected modifiers in /usr/local/src/php-5.0.4/ext/standard/tests/serialize/bug31402.php on line 13 006+ object(Y)#1 (2) { 001- object(y)(2) { 005- object(x)(1) { 010+ object(X)#2 (1) { 010- object(x)(1) { 015+ object(X)#3 (1) { 016- object(x)(1) { 021+ object(X)#2 (1) { 021- object(y)(2) { 025- &object(x)(1) { 026+ object(Y)#4 (2) { 030+ object(X)#5 (1) { 030- object(x)(1) { 035+ object(X)#6 (1) { 036- &object(x)(1) { 041+ object(X)#5 (1) { ================================================================================ ================================================================================ /usr/local/src/php-5.0.4/ext/standard/tests/strings/bug29119.phpt ================================================================================ ---- EXPECTED OUTPUT string(42) "e28082e28089e28098e280a0e280b2e28184e282ac" ---- ACTUAL OUTPUT string(40) "e28082e28089e28098e280a0e280b2e28184c686" ---- FAILED ================================================================================ 001+ string(40) "e28082e28089e28098e280a0e280b2e28184c686" 001- string(42) "e28082e28089e28098e280a0e280b2e28184e282ac" ================================================================================ ================================================================================ /usr/local/src/php-5.0.4/ext/standard/tests/time/bug20382.phpt ================================================================================ ---- EXPECTED OUTPUT tStamp=Wednesday 2004-10-27 17:17:17 CEST result=Monday 2004-11-01 00:00:00 CET wanted=Monday 2004-11-01 00:00:00 CET ---- ACTUAL OUTPUT tStamp=Wednesday 2004-10-27 17:17:17 CEST result=Sunday 2004-10-31 23:00:00 CET wanted=Monday 2004-11-01 00:00:00 CET ---- FAILED ================================================================================ 002+ result=Sunday 2004-10-31 23:00:00 CET 002- result=Monday 2004-11-01 00:00:00 CET ================================================================================ ================================================================================ /usr/local/src/php-5.0.4/ext/xml/tests/bug26614.phpt ================================================================================ ---- EXPECTED OUTPUT CDATA <DATA> at line 2, col 0 (byte 45) </DATA> at line 9, col 0 (byte 90) Comment <DATA> at line 2, col 0 (byte 45) </DATA> at line 9, col 0 (byte 90) Text <DATA> at line 2, col 0 (byte 45) </DATA> at line 9, col 0 (byte 90) ---- ACTUAL OUTPUT CDATA <DATA> at line 2, col 6 (byte 9) </DATA> at line 9, col 7 (byte 56) Comment <DATA> at line 2, col 6 (byte 9) </DATA> at line 9, col 7 (byte 56) Text <DATA> at line 2, col 6 (byte 9) </DATA> at line 9, col 10 (byte 56) ---- FAILED ================================================================================ 002+ <DATA> at line 2, col 6 (byte 9) 003+ </DATA> at line 9, col 7 (byte 56) 002- <DATA> at line 2, col 0 (byte 45) 003- </DATA> at line 9, col 0 (byte 90) 005+ <DATA> at line 2, col 6 (byte 9) 006+ </DATA> at line 9, col 7 (byte 56) 005- <DATA> at line 2, col 0 (byte 45) 006- </DATA> at line 9, col 0 (byte 90) 008+ <DATA> at line 2, col 6 (byte 9) 009+ </DATA> at line 9, col 10 (byte 56) 008- <DATA> at line 2, col 0 (byte 45) 009- </DATA> at line 9, col 0 (byte 90) ================================================================================ ================================================================================ BUILD ENVIRONMENT ================================================================================ OS: Linux - Linux linux 2.6.8-24.16-default #1 Thu Jun 2 12:09:57 UTC 2005 i686 Automake: automake (GNU automake) 1.9.1 Written by Tom Tromey <tromey@redhat.com>. Copyright 2004 Free Software Foundation, Inc. This is free software; see the source for copying conditions. There is NO warranty; not even for MERCHANTABILITY or FITNESS FOR A PARTICULAR PURPOSE. Autoconf: autoconf (GNU Autoconf) 2.59 Written by David J. MacKenzie and Akim Demaille. Copyright (C) 2003 Free Software Foundation, Inc. This is free software; see the source for copying conditions. There is NO warranty; not even for MERCHANTABILITY or FITNESS FOR A PARTICULAR PURPOSE. Bundled Libtool: ltmain.sh (GNU libtool) 1.4.3 (1.922.2.111 2002/10/23 02:54:36) System Libtool: ltmain.sh (GNU libtool) 1.5.8 (1.1220.2.118 2004/08/07 12:24:38) Copyright (C) 2003 Free Software Foundation, Inc. This is free software; see the source for copying conditions. There is NO warranty; not even for MERCHANTABILITY or FITNESS FOR A PARTICULAR PURPOSE. Compiler: Reading specs from /usr/lib/gcc-lib/i586-suse-linux/3.3.4/specs Configured with: ../configure --enable-threads=posix --prefix=/usr --with-local-prefix=/usr/local --infodir=/usr/share/info --mandir=/usr/share/man --enable-languages=c,c++,f77,objc,java,ada --disable-checking --libdir=/usr/lib --enable-libgcj --with-gxx-include-dir=/usr/include/g++ --with-slibdir=/lib --with-system-zlib --enable-shared --enable-__cxa_atexit i586-suse-linux Thread model: posix gcc version 3.3.4 (pre 3.3.5 20040809) Bison: bison (GNU Bison) 1.875 Written by Robert Corbett and Richard Stallman. Copyright (C) 2002 Free Software Foundation, Inc. This is free software; see the source for copying conditions. There is NO warranty; not even for MERCHANTABILITY or FITNESS FOR A PARTICULAR PURPOSE. Libraries: linux-gate.so.1 => (0xffffe000) libcrypt.so.1 => /lib/libcrypt.so.1 (0x40033000) libmysqlclient.so.12 => /usr/lib/libmysqlclient.so.12 (0x40066000) libming.so => /usr/lib/libming.so (0x4009d000) libm.so.6 => /lib/tls/libm.so.6 (0x400d3000) libz.so.1 => /lib/libz.so.1 (0x400f6000) libresolv.so.2 => /lib/libresolv.so.2 (0x40107000) libdl.so.2 => /lib/libdl.so.2 (0x4011a000) libnsl.so.1 => /lib/libnsl.so.1 (0x4011e000) libxml2.so.2 => /usr/lib/libxml2.so.2 (0x40135000) libpthread.so.0 => /lib/tls/libpthread.so.0 (0x4023c000) libc.so.6 => /lib/tls/libc.so.6 (0x4024e000) /lib/ld-linux.so.2 => /lib/ld-linux.so.2 (0x40000000) User's E-mail: andre at symacopee dot org ================================================================================ PHPINFO ================================================================================ phpinfo() PHP Version => 5.0.4 System => Linux linux 2.6.8-24.16-default #1 Thu Jun 2 12:09:57 UTC 2005 i686 Build Date => Aug 16 2005 18:52:55 Configure Command => './configure' '--with-apxs2=/usr/local/reseau/apache/bin/apxs' '--with-ming' '--with-mysql' '--with-ftp' '--with-pdf' '--with-soap' '--with-zlib' '--with-bcmath' '--with-gd2' '--with-jpeg-dir' '--with-png-dir' Server API => Command Line Interface Virtual Directory Support => disabled Configuration File (php.ini) Path => /usr/local/lib/php.ini PHP API => 20031224 PHP Extension => 20041030 Zend Extension => 220040412 Debug Build => no Thread Safety => disabled IPv6 Support => enabled Registered PHP Streams => php, file, http, ftp, compress.zlib, compress.bzip2 Registered Stream Socket Transports => tcp, udp, unix, udg This program makes use of the Zend Scripting Language Engine: Zend Engine v2.0.4-dev, Copyright (c) 1998-2004 Zend Technologies _______________________________________________________________________ Configuration PHP Core Directive => Local Value => Master Value allow_call_time_pass_reference => On => On allow_url_fopen => On => On always_populate_raw_post_data => Off => Off arg_separator.input => & => & arg_separator.output => & => & asp_tags => Off => Off auto_append_file => no value => no value auto_globals_jit => On => On auto_prepend_file => no value => no value browscap => no value => no value default_charset => no value => no value default_mimetype => text/html => text/html define_syslog_variables => Off => Off disable_classes => no value => no value disable_functions => no value => no value display_errors => On => On display_startup_errors => On => On doc_root => no value => no value docref_ext => no value => no value docref_root => no value => no value enable_dl => On => On error_append_string => no value => no value error_log => no value => no value error_prepend_string => no value => no value error_reporting => 2047 => 2047 expose_php => On => On extension_dir => /usr/local/lib/php/extensions/no-debug-non-zts-20041030/ => /usr/local/lib/php/extensions/no-debug-non-zts-20041030/ file_uploads => On => On highlight.bg => #FFFFFF => #FFFFFF highlight.comment => #FF8000 => #FF8000 highlight.default => #0000BB => #0000BB highlight.html => #000000 => #000000 highlight.keyword => #007700 => #007700 highlight.string => #DD0000 => #DD0000 html_errors => Off => On ignore_repeated_errors => Off => Off ignore_repeated_source => Off => Off ignore_user_abort => Off => Off implicit_flush => On => Off include_path => .:/home/www/include/classes:/usr/local/lib/php => .:/home/www/include/classes:/usr/local/lib/php log_errors => On => On log_errors_max_len => 1024 => 1024 magic_quotes_gpc => On => On magic_quotes_runtime => Off => Off magic_quotes_sybase => Off => Off mail.force_extra_parameters => no value => no value max_execution_time => 0 => 30 max_input_time => 60 => 60 open_basedir => no value => no value output_buffering => 0 => no value output_handler => no value => no value post_max_size => 16M => 16M precision => 12 => 12 register_argc_argv => On => On register_globals => Off => Off register_long_arrays => On => On report_memleaks => On => On report_zend_debug => Off => Off safe_mode => Off => Off safe_mode_exec_dir => no value => no value safe_mode_gid => Off => Off safe_mode_include_dir => no value => no value sendmail_from => no value => no value sendmail_path => sendmail -t -i => sendmail -t -i serialize_precision => 100 => 100 short_open_tag => On => On SMTP => mail.symacopee.org => mail.symacopee.org smtp_port => 25 => 25 sql.safe_mode => Off => Off track_errors => Off => Off unserialize_callback_func => no value => no value upload_max_filesize => 16M => 16M upload_tmp_dir => /tmp/php/upload => /tmp/php/upload user_dir => no value => no value variables_order => EGPCS => EGPCS xmlrpc_error_number => 0 => 0 xmlrpc_errors => Off => Off y2k_compliance => On => On zend.ze1_compatibility_mode => Off => Off bcmath BCMath support => enabled bz2 BZip2 Support => Enabled BZip2 Version => 1.0.2, 30-Dec-2001 ctype ctype functions => enabled dom DOM/XML => enabled DOM/XML API Version => 20031129 libxml Version => 2.6.12 HTML Support => enabled XPath Support => enabled XPointer Support => enabled Schema Support => enabled RelaxNG Support => enabled iconv iconv support => enabled iconv implementation => glibc iconv library version => 2.3.3 Directive => Local Value => Master Value iconv.input_encoding => ISO-8859-1 => ISO-8859-1 iconv.internal_encoding => ISO-8859-1 => ISO-8859-1 iconv.output_encoding => ISO-8859-1 => ISO-8859-1 libxml libXML support => active libXML Version => 2.6.12 libXML streams => enabled ming Ming SWF output library => enabled Version => 0.2a mysql MySQL Support => enabled Active Persistent Links => 0 Active Links => 0 Client API version => 4.0.21 MYSQL_MODULE_TYPE => external MYSQL_SOCKET => /var/lib/mysql/mysql.sock MYSQL_INCLUDE => -I/usr/include/mysql MYSQL_LIBS => -L/usr/lib -lmysqlclient Directive => Local Value => Master Value mysql.allow_persistent => On => On mysql.connect_timeout => 60 => 60 mysql.default_host => no value => no value mysql.default_password => no value => no value mysql.default_port => no value => no value mysql.default_socket => no value => no value mysql.default_user => no value => no value mysql.max_links => Unlimited => Unlimited mysql.max_persistent => Unlimited => Unlimited mysql.trace_mode => Off => Off pcre PCRE (Perl Compatible Regular Expressions) Support => enabled PCRE Library Version => 4.5 01-December-2003 posix Revision => $Revision: 1.60.2.2 $ session Session Support => enabled Registered save handlers => files user sqlite Registered serializer handlers => php php_binary Directive => Local Value => Master Value session.auto_start => Off => Off session.bug_compat_42 => On => On session.bug_compat_warn => On => On session.cache_expire => 180 => 180 session.cache_limiter => nocache => nocache session.cookie_domain => no value => no value session.cookie_lifetime => 0 => 0 session.cookie_path => / => / session.cookie_secure => Off => Off session.entropy_file => no value => no value session.entropy_length => 0 => 0 session.gc_divisor => 100 => 100 session.gc_maxlifetime => 1440 => 1440 session.gc_probability => 1 => 1 session.hash_bits_per_character => 4 => 4 session.hash_function => 0 => 0 session.name => PHPSESSID => PHPSESSID session.referer_check => no value => no value session.save_handler => files => files session.save_path => /tmp/php/session => /tmp/php/session session.serialize_handler => php => php session.use_cookies => On => On session.use_only_cookies => Off => Off session.use_trans_sid => 0 => 0 SimpleXML Simplexml support => enabled Revision => $Revision: 1.139.2.4 $ Schema support => enabled soap Soap Client => enabled Soap Server => enabled Directive => Local Value => Master Value soap.wsdl_cache_dir => /tmp => /tmp soap.wsdl_cache_enabled => 1 => 1 soap.wsdl_cache_ttl => 86400 => 86400 SPL SPL support => enabled Interfaces => RecursiveIterator, SeekableIterator Classes => ArrayObject, ArrayIterator, CachingIterator, CachingRecursiveIterator, DirectoryIterator, FilterIterator, LimitIterator, ParentIterator, RecursiveDirectoryIterator, RecursiveIteratorIterator, SimpleXMLIterator SQLite SQLite support => enabled PECL Module version => 2.0-dev $Id: sqlite.c,v 1.146.2.3 2004/09/26 01:41:40 wez Exp $ SQLite Library => 2.8.14 SQLite Encoding => iso8859 Directive => Local Value => Master Value sqlite.assoc_case => 0 => 0 standard Regex Library => Bundled library enabled Dynamic Library Support => enabled Path to sendmail => sendmail -t -i Directive => Local Value => Master Value assert.active => 1 => 1 assert.bail => 0 => 0 assert.callback => no value => no value assert.quiet_eval => 0 => 0 assert.warning => 1 => 1 auto_detect_line_endings => 0 => 0 date.default_latitude => 31.7667 => 31.7667 date.default_longitude => 35.2333 => 35.2333 date.sunrise_zenith => 90.83 => 90.83 date.sunset_zenith => 90.83 => 90.83 default_socket_timeout => 60 => 60 safe_mode_allowed_env_vars => PHP_ => PHP_ safe_mode_protected_env_vars => LD_LIBRARY_PATH => LD_LIBRARY_PATH url_rewriter.tags => a=href,area=href,frame=src,input=src,form=,fieldset= => a=href,area=href,frame=src,input=src,form=,fieldset= user_agent => no value => no value tokenizer Tokenizer Support => enabled xml XML Support => active XML Namespace Support => active libxml2 Version => 2.6.12 xsl XSL => enabled libxslt Version => 1.1.9 libxslt compiled against libxml Version => 2.6.12 EXSLT => enabled libexslt Version => 1.1.9 zlib ZLib Support => enabled Compiled Version => 1.2.1 Linked Version => 1.2.1 Directive => Local Value => Master Value zlib.output_compression => Off => Off zlib.output_compression_level => -1 => -1 zlib.output_handler => no value => no value Additional Modules Module Name Environment Variable => Value LESSKEY => /etc/lesskey.bin MANPATH => /usr/share/man:/usr/local/man:/usr/X11R6/man:/opt/gnome/share/man INFODIR => /usr/local/info:/usr/share/info:/usr/info NNTPSERVER => news KDE_MULTIHEAD => false DM_CONTROL => /var/run/xdmctl HOSTNAME => linux TEST_PHP_SRCDIR => /usr/local/src/php-5.0.4 GNOME2_PATH => /usr/local:/opt/gnome:/usr XKEYSYMDB => /usr/X11R6/lib/X11/XKeysymDB GPG_AGENT_INFO => /tmp/gpg-RJeKha/S.gpg-agent:5119:1 SHELL => /bin/sh TERM => xterm HOST => linux XDM_MANAGED => /var/run/xdmctl/xdmctl-:0,maysd,mayfn,sched,rsvd,method=classic PROFILEREAD => true MAKEFLAGS => STYLE => keramik HISTSIZE => 1000 SSH_CLIENT => deleted KDE_NO_IPV6 => 1 GTK2_RC_FILES => /etc/opt/gnome/gtk-2.0/gtkrc:/opt/gnome/share/themes/Qt/gtk-2.0/gtkrc:/root/.gtkrc-2.0-keramik:/root/.kde/share/config/gtkrc GTK_RC_FILES => /etc/opt/gnome/gtk/gtkrc:/opt/gnome/share/themes/Geramik/gtk/gtkrc:/root/.gtkrc-keramik:/root/.kde/share/config/gtkrc GNOME_PATH => :/opt/gnome:/usr KDEHOME => /root/.kde WINDOWID => 48234503 QTDIR => /usr/lib/qt3 XSESSION_IS_UP => yes SSH_TTY => deleted KDE_FULL_SESSION => true GROFF_NO_SGR => yes JRE_HOME => /usr/lib/jvm/java/jre USER => root XCURSOR_SIZE => LS_COLORS => no=00:fi=00:di=01;34:ln=00;36:pi=40;33:so=01;35:do=01;35:bd=40;33;01:cd=40;33;01:or=40;31:ex=00;32:*.cmd=00;32:*.exe=01;32:*.com=01;32:*.bat=01;32:*.btm=01;32:*.dll=01;32:*.tar=00;31:*.tbz=00;31:*.tgz=00;31:*.rpm=00;31:*.deb=00;31:*.arj=00;31:*.taz=00;31:*.lzh=00;31:*.zip=00;31:*.zoo=00;31:*.z=00;31:*.Z=00;31:*.gz=00;31:*.bz2=00;31:*.tb2=00;31:*.tz2=00;31:*.tbz2=00;31:*.avi=01;35:*.bmp=01;35:*.fli=01;35:*.gif=01;35:*.jpg=01;35:*.jpeg=01;35:*.mng=01;35:*.mov=01;35:*.mpg=01;35:*.pcx=01;35:*.pbm=01;35:*.pgm=01;35:*.png=01;35:*.ppm=01;35:*.tga=01;35:*.tif=01;35:*.xbm=01;35:*.xpm=01;35:*.dl=01;35:*.gl=01;35:*.aiff=00;32:*.au=00;32:*.mid=00;32:*.mp3=00;32:*.ogg=00;32:*.voc=00;32:*.wav=00;32: DESKTOP_LAUNCH => kde-open SCRIPT_FILENAME => OPENWINHOME => /usr/openwin XNLSPATH => /usr/X11R6/lib/X11/nls SSH_AUTH_SOCK => deleted HOSTTYPE => i386 KDEROOTHOME => /root/.kde SESSION_MANAGER => local/linux:/tmp/.ICE-unix/5292 MAKELEVEL => 1 PAGER => less MFLAGS => LD_HWCAP_MASK => 0x20000000 MINICOM => -c on KONSOLE_DCOP => DCOPRef(konsole-5404,konsole) DESKTOP_SESSION => default PATH => /sbin:/usr/sbin:/usr/local/sbin:/usr/local/bin:/usr/bin:/usr/X11R6/bin:/bin:/usr/games:/opt/gnome/bin:/opt/kde3/bin GNOMEDIR => /opt/gnome CPU => i686 _ => /usr/local/src/php-5.0.4/sapi/cli/php JAVA_BINDIR => /usr/lib/jvm/java/bin KONSOLE_DCOP_SESSION => DCOPRef(konsole-5404,session-2) PWD => /usr/local/src/php-5.0.4 INPUTRC => /etc/inputrc XMODIFIERS => @im=local JAVA_HOME => /usr/lib/jvm/java TEST_PHP_EXECUTABLE => /usr/local/src/php-5.0.4/sapi/cli/php REDIRECT_STATUS => PYTHONSTARTUP => /etc/pythonstart SDK_HOME => /usr/lib/jvm/java PATH_TRANSLATED => TEXINPUTS => ::/root/.TeX:/usr/share/doc/.TeX:/usr/doc/.TeX:/root/.TeX:/usr/share/doc/.TeX:/usr/doc/.TeX JDK_HOME => /usr/lib/jvm/java HOME => /root SHLVL => 4 CONTENT_LENGTH => OSTYPE => linux LESS_ADVANCED_PREPROCESSOR => no XCURSOR_THEME => crystalwhite LS_OPTIONS => -a -N --color=tty -T 0 WINDOWMANAGER => /usr/X11R6/bin/kde GTK_PATH => /usr/local/lib/gtk-2.0:/opt/gnome/lib/gtk-2.0:/usr/lib/gtk-2.0 MACHTYPE => i686-suse-linux LOGNAME => root G_FILENAME_ENCODING => @locale,UTF-8,ISO-8859-15,CP1252 LESS => -M -I QUERY_STRING => CVS_RSH => ssh LC_CTYPE => fr_FR.UTF-8 ACLOCAL_FLAGS => -I /opt/gnome/share/aclocal LESSOPEN => lessopen.sh %s PKG_CONFIG_PATH => /usr/local/lib/pkgconfig:/usr/lib/pkgconfig:/opt/gnome/lib/pkgconfig USE_FAM => INFOPATH => /usr/local/info:/usr/share/info:/usr/info CONTENT_TYPE => DISPLAY => :0 CC => gcc REQUEST_METHOD => LESSCLOSE => lessclose.sh %s %s G_BROKEN_FILENAMES => 1 JAVA_ROOT => /usr/lib/jvm/java COLORTERM => PHP Variables Variable => Value _SERVER["LESSKEY"] => /etc/lesskey.bin _SERVER["MANPATH"] => /usr/share/man:/usr/local/man:/usr/X11R6/man:/opt/gnome/share/man _SERVER["INFODIR"] => /usr/local/info:/usr/share/info:/usr/info _SERVER["NNTPSERVER"] => news _SERVER["KDE_MULTIHEAD"] => false _SERVER["DM_CONTROL"] => /var/run/xdmctl _SERVER["HOSTNAME"] => linux _SERVER["TEST_PHP_SRCDIR"] => /usr/local/src/php-5.0.4 _SERVER["GNOME2_PATH"] => /usr/local:/opt/gnome:/usr _SERVER["XKEYSYMDB"] => /usr/X11R6/lib/X11/XKeysymDB _SERVER["GPG_AGENT_INFO"] => /tmp/gpg-RJeKha/S.gpg-agent:5119:1 _SERVER["SHELL"] => /bin/sh _SERVER["TERM"] => xterm _SERVER["HOST"] => linux _SERVER["XDM_MANAGED"] => /var/run/xdmctl/xdmctl-:0,maysd,mayfn,sched,rsvd,method=classic _SERVER["PROFILEREAD"] => true _SERVER["MAKEFLAGS"] => _SERVER["STYLE"] => keramik _SERVER["HISTSIZE"] => 1000 _SERVER["SSH_CLIENT"] => deleted _SERVER["KDE_NO_IPV6"] => 1 _SERVER["GTK2_RC_FILES"] => /etc/opt/gnome/gtk-2.0/gtkrc:/opt/gnome/share/themes/Qt/gtk-2.0/gtkrc:/root/.gtkrc-2.0-keramik:/root/.kde/share/config/gtkrc _SERVER["GTK_RC_FILES"] => /etc/opt/gnome/gtk/gtkrc:/opt/gnome/share/themes/Geramik/gtk/gtkrc:/root/.gtkrc-keramik:/root/.kde/share/config/gtkrc _SERVER["GNOME_PATH"] => :/opt/gnome:/usr _SERVER["KDEHOME"] => /root/.kde _SERVER["WINDOWID"] => 48234503 _SERVER["QTDIR"] => /usr/lib/qt3 _SERVER["XSESSION_IS_UP"] => yes _SERVER["SSH_TTY"] => deleted _SERVER["KDE_FULL_SESSION"] => true _SERVER["GROFF_NO_SGR"] => yes _SERVER["JRE_HOME"] => /usr/lib/jvm/java/jre _SERVER["USER"] => root _SERVER["XCURSOR_SIZE"] => _SERVER["LS_COLORS"] => no=00:fi=00:di=01;34:ln=00;36:pi=40;33:so=01;35:do=01;35:bd=40;33;01:cd=40;33;01:or=40;31:ex=00;32:*.cmd=00;32:*.exe=01;32:*.com=01;32:*.bat=01;32:*.btm=01;32:*.dll=01;32:*.tar=00;31:*.tbz=00;31:*.tgz=00;31:*.rpm=00;31:*.deb=00;31:*.arj=00;31:*.taz=00;31:*.lzh=00;31:*.zip=00;31:*.zoo=00;31:*.z=00;31:*.Z=00;31:*.gz=00;31:*.bz2=00;31:*.tb2=00;31:*.tz2=00;31:*.tbz2=00;31:*.avi=01;35:*.bmp=01;35:*.fli=01;35:*.gif=01;35:*.jpg=01;35:*.jpeg=01;35:*.mng=01;35:*.mov=01;35:*.mpg=01;35:*.pcx=01;35:*.pbm=01;35:*.pgm=01;35:*.png=01;35:*.ppm=01;35:*.tga=01;35:*.tif=01;35:*.xbm=01;35:*.xpm=01;35:*.dl=01;35:*.gl=01;35:*.aiff=00;32:*.au=00;32:*.mid=00;32:*.mp3=00;32:*.ogg=00;32:*.voc=00;32:*.wav=00;32: _SERVER["DESKTOP_LAUNCH"] => kde-open _SERVER["SCRIPT_FILENAME"] => _SERVER["OPENWINHOME"] => /usr/openwin _SERVER["XNLSPATH"] => /usr/X11R6/lib/X11/nls _SERVER["SSH_AUTH_SOCK"] => deleted _SERVER["HOSTTYPE"] => i386 _SERVER["KDEROOTHOME"] => /root/.kde _SERVER["SESSION_MANAGER"] => local/linux:/tmp/.ICE-unix/5292 _SERVER["MAKELEVEL"] => 1 _SERVER["PAGER"] => less _SERVER["MFLAGS"] => _SERVER["LD_HWCAP_MASK"] => 0x20000000 _SERVER["MINICOM"] => -c on _SERVER["KONSOLE_DCOP"] => DCOPRef(konsole-5404,konsole) _SERVER["DESKTOP_SESSION"] => default _SERVER["PATH"] => /sbin:/usr/sbin:/usr/local/sbin:/usr/local/bin:/usr/bin:/usr/X11R6/bin:/bin:/usr/games:/opt/gnome/bin:/opt/kde3/bin _SERVER["GNOMEDIR"] => /opt/gnome _SERVER["CPU"] => i686 _SERVER["_"] => /usr/local/src/php-5.0.4/sapi/cli/php _SERVER["JAVA_BINDIR"] => /usr/lib/jvm/java/bin _SERVER["KONSOLE_DCOP_SESSION"] => DCOPRef(konsole-5404,session-2) _SERVER["PWD"] => /usr/local/src/php-5.0.4 _SERVER["INPUTRC"] => /etc/inputrc _SERVER["XMODIFIERS"] => @im=local _SERVER["JAVA_HOME"] => /usr/lib/jvm/java _SERVER["TEST_PHP_EXECUTABLE"] => /usr/local/src/php-5.0.4/sapi/cli/php _SERVER["REDIRECT_STATUS"] => _SERVER["PYTHONSTARTUP"] => /etc/pythonstart _SERVER["SDK_HOME"] => /usr/lib/jvm/java _SERVER["PATH_TRANSLATED"] => _SERVER["TEXINPUTS"] => ::/root/.TeX:/usr/share/doc/.TeX:/usr/doc/.TeX:/root/.TeX:/usr/share/doc/.TeX:/usr/doc/.TeX _SERVER["JDK_HOME"] => /usr/lib/jvm/java _SERVER["HOME"] => /root _SERVER["SHLVL"] => 4 _SERVER["CONTENT_LENGTH"] => _SERVER["OSTYPE"] => linux _SERVER["LESS_ADVANCED_PREPROCESSOR"] => no _SERVER["XCURSOR_THEME"] => crystalwhite _SERVER["LS_OPTIONS"] => -a -N --color=tty -T 0 _SERVER["WINDOWMANAGER"] => /usr/X11R6/bin/kde _SERVER["GTK_PATH"] => /usr/local/lib/gtk-2.0:/opt/gnome/lib/gtk-2.0:/usr/lib/gtk-2.0 _SERVER["MACHTYPE"] => i686-suse-linux _SERVER["LOGNAME"] => root _SERVER["G_FILENAME_ENCODING"] => @locale,UTF-8,ISO-8859-15,CP1252 _SERVER["LESS"] => -M -I _SERVER["QUERY_STRING"] => _SERVER["CVS_RSH"] => ssh _SERVER["LC_CTYPE"] => fr_FR.UTF-8 _SERVER["ACLOCAL_FLAGS"] => -I /opt/gnome/share/aclocal _SERVER["LESSOPEN"] => lessopen.sh %s _SERVER["PKG_CONFIG_PATH"] => /usr/local/lib/pkgconfig:/usr/lib/pkgconfig:/opt/gnome/lib/pkgconfig _SERVER["USE_FAM"] => _SERVER["INFOPATH"] => /usr/local/info:/usr/share/info:/usr/info _SERVER["CONTENT_TYPE"] => _SERVER["DISPLAY"] => :0 _SERVER["CC"] => gcc _SERVER["REQUEST_METHOD"] => _SERVER["LESSCLOSE"] => lessclose.sh %s %s _SERVER["G_BROKEN_FILENAMES"] => 1 _SERVER["JAVA_ROOT"] => /usr/lib/jvm/java _SERVER["COLORTERM"] => _SERVER["PHP_SELF"] => _SERVER["SCRIPT_NAME"] => _SERVER["DOCUMENT_ROOT"] => _SERVER["argv"] => Array ( ) _SERVER["argc"] => 0 _ENV["LESSKEY"] => /etc/lesskey.bin _ENV["MANPATH"] => /usr/share/man:/usr/local/man:/usr/X11R6/man:/opt/gnome/share/man _ENV["INFODIR"] => /usr/local/info:/usr/share/info:/usr/info _ENV["NNTPSERVER"] => news _ENV["KDE_MULTIHEAD"] => false _ENV["DM_CONTROL"] => /var/run/xdmctl _ENV["HOSTNAME"] => linux _ENV["TEST_PHP_SRCDIR"] => /usr/local/src/php-5.0.4 _ENV["GNOME2_PATH"] => /usr/local:/opt/gnome:/usr _ENV["XKEYSYMDB"] => /usr/X11R6/lib/X11/XKeysymDB _ENV["GPG_AGENT_INFO"] => /tmp/gpg-RJeKha/S.gpg-agent:5119:1 _ENV["SHELL"] => /bin/sh _ENV["TERM"] => xterm _ENV["HOST"] => linux _ENV["XDM_MANAGED"] => /var/run/xdmctl/xdmctl-:0,maysd,mayfn,sched,rsvd,method=classic _ENV["PROFILEREAD"] => true _ENV["MAKEFLAGS"] => _ENV["STYLE"] => keramik _ENV["HISTSIZE"] => 1000 _ENV["SSH_CLIENT"] => deleted _ENV["KDE_NO_IPV6"] => 1 _ENV["GTK2_RC_FILES"] => /etc/opt/gnome/gtk-2.0/gtkrc:/opt/gnome/share/themes/Qt/gtk-2.0/gtkrc:/root/.gtkrc-2.0-keramik:/root/.kde/share/config/gtkrc _ENV["GTK_RC_FILES"] => /etc/opt/gnome/gtk/gtkrc:/opt/gnome/share/themes/Geramik/gtk/gtkrc:/root/.gtkrc-keramik:/root/.kde/share/config/gtkrc _ENV["GNOME_PATH"] => :/opt/gnome:/usr _ENV["KDEHOME"] => /root/.kde _ENV["WINDOWID"] => 48234503 _ENV["QTDIR"] => /usr/lib/qt3 _ENV["XSESSION_IS_UP"] => yes _ENV["SSH_TTY"] => deleted _ENV["KDE_FULL_SESSION"] => true _ENV["GROFF_NO_SGR"] => yes _ENV["JRE_HOME"] => /usr/lib/jvm/java/jre _ENV["USER"] => root _ENV["XCURSOR_SIZE"] => _ENV["LS_COLORS"] => no=00:fi=00:di=01;34:ln=00;36:pi=40;33:so=01;35:do=01;35:bd=40;33;01:cd=40;33;01:or=40;31:ex=00;32:*.cmd=00;32:*.exe=01;32:*.com=01;32:*.bat=01;32:*.btm=01;32:*.dll=01;32:*.tar=00;31:*.tbz=00;31:*.tgz=00;31:*.rpm=00;31:*.deb=00;31:*.arj=00;31:*.taz=00;31:*.lzh=00;31:*.zip=00;31:*.zoo=00;31:*.z=00;31:*.Z=00;31:*.gz=00;31:*.bz2=00;31:*.tb2=00;31:*.tz2=00;31:*.tbz2=00;31:*.avi=01;35:*.bmp=01;35:*.fli=01;35:*.gif=01;35:*.jpg=01;35:*.jpeg=01;35:*.mng=01;35:*.mov=01;35:*.mpg=01;35:*.pcx=01;35:*.pbm=01;35:*.pgm=01;35:*.png=01;35:*.ppm=01;35:*.tga=01;35:*.tif=01;35:*.xbm=01;35:*.xpm=01;35:*.dl=01;35:*.gl=01;35:*.aiff=00;32:*.au=00;32:*.mid=00;32:*.mp3=00;32:*.ogg=00;32:*.voc=00;32:*.wav=00;32: _ENV["DESKTOP_LAUNCH"] => kde-open _ENV["SCRIPT_FILENAME"] => _ENV["OPENWINHOME"] => /usr/openwin _ENV["XNLSPATH"] => /usr/X11R6/lib/X11/nls _ENV["SSH_AUTH_SOCK"] => deleted _ENV["HOSTTYPE"] => i386 _ENV["KDEROOTHOME"] => /root/.kde _ENV["SESSION_MANAGER"] => local/linux:/tmp/.ICE-unix/5292 _ENV["MAKELEVEL"] => 1 _ENV["PAGER"] => less _ENV["MFLAGS"] => _ENV["LD_HWCAP_MASK"] => 0x20000000 _ENV["MINICOM"] => -c on _ENV["KONSOLE_DCOP"] => DCOPRef(konsole-5404,konsole) _ENV["DESKTOP_SESSION"] => default _ENV["PATH"] => /sbin:/usr/sbin:/usr/local/sbin:/usr/local/bin:/usr/bin:/usr/X11R6/bin:/bin:/usr/games:/opt/gnome/bin:/opt/kde3/bin _ENV["GNOMEDIR"] => /opt/gnome _ENV["CPU"] => i686 _ENV["_"] => /usr/local/src/php-5.0.4/sapi/cli/php _ENV["JAVA_BINDIR"] => /usr/lib/jvm/java/bin _ENV["KONSOLE_DCOP_SESSION"] => DCOPRef(konsole-5404,session-2) _ENV["PWD"] => /usr/local/src/php-5.0.4 _ENV["INPUTRC"] => /etc/inputrc _ENV["XMODIFIERS"] => @im=local _ENV["JAVA_HOME"] => /usr/lib/jvm/java _ENV["TEST_PHP_EXECUTABLE"] => /usr/local/src/php-5.0.4/sapi/cli/php _ENV["REDIRECT_STATUS"] => _ENV["PYTHONSTARTUP"] => /etc/pythonstart _ENV["SDK_HOME"] => /usr/lib/jvm/java _ENV["PATH_TRANSLATED"] => _ENV["TEXINPUTS"] => ::/root/.TeX:/usr/share/doc/.TeX:/usr/doc/.TeX:/root/.TeX:/usr/share/doc/.TeX:/usr/doc/.TeX _ENV["JDK_HOME"] => /usr/lib/jvm/java _ENV["HOME"] => /root _ENV["SHLVL"] => 4 _ENV["CONTENT_LENGTH"] => _ENV["OSTYPE"] => linux _ENV["LESS_ADVANCED_PREPROCESSOR"] => no _ENV["XCURSOR_THEME"] => crystalwhite _ENV["LS_OPTIONS"] => -a -N --color=tty -T 0 _ENV["WINDOWMANAGER"] => /usr/X11R6/bin/kde _ENV["GTK_PATH"] => /usr/local/lib/gtk-2.0:/opt/gnome/lib/gtk-2.0:/usr/lib/gtk-2.0 _ENV["MACHTYPE"] => i686-suse-linux _ENV["LOGNAME"] => root _ENV["G_FILENAME_ENCODING"] => @locale,UTF-8,ISO-8859-15,CP1252 _ENV["LESS"] => -M -I _ENV["QUERY_STRING"] => _ENV["CVS_RSH"] => ssh _ENV["LC_CTYPE"] => fr_FR.UTF-8 _ENV["ACLOCAL_FLAGS"] => -I /opt/gnome/share/aclocal _ENV["LESSOPEN"] => lessopen.sh %s _ENV["PKG_CONFIG_PATH"] => /usr/local/lib/pkgconfig:/usr/lib/pkgconfig:/opt/gnome/lib/pkgconfig _ENV["USE_FAM"] => _ENV["INFOPATH"] => /usr/local/info:/usr/share/info:/usr/info _ENV["CONTENT_TYPE"] => _ENV["DISPLAY"] => :0 _ENV["CC"] => gcc _ENV["REQUEST_METHOD"] => _ENV["LESSCLOSE"] => lessclose.sh %s %s _ENV["G_BROKEN_FILENAMES"] => 1 _ENV["JAVA_ROOT"] => /usr/lib/jvm/java _ENV["COLORTERM"] => PHP License This program is free software; you can redistribute it and/or modify it under the terms of the PHP License as published by the PHP Group and included in the distribution in the file: LICENSE This program is distributed in the hope that it will be useful, but WITHOUT ANY WARRANTY; without even the implied warranty of MERCHANTABILITY or FITNESS FOR A PARTICULAR PURPOSE. If you did not receive a copy of the PHP license, or have any questions about PHP licensing, please contact license@php.net.

« previous php.qa (#25825) next »