Test results for 5.0.5 [failed]
| From: | noreply@php.net | Date: | Tue, 08 Nov 2005 22:30:03 +0000 |
| Subject: | Test results for 5.0.5 [failed] | ||
| Groups: | php.qa | ||
| Request: | Send a blank email to php-qa+get-26420@lists.php.net to get a copy of this message | ||
=====================================================================
FAILED TEST SUMMARY
---------------------------------------------------------------------
Bug #31672 (one-line comment with </script>) [tests/basic/bug31672.phpt]
Test for buffering in core functions with implicit flush off [tests/func/008.phpt]
Bug #27268 (Bad references accentuated by clone) [Zend/tests/bug27268.phpt]
Test 5: HTML Test [ext/dom/tests/dom005.phpt]
Bug #24155 (gdImageRotate270 rotation problem). [ext/gd/tests/bug24155.phpt]
Bug #27582 (ImageFillToBorder() on alphablending image looses alpha on fill color)
[ext/gd/tests/bug27582_1.phpt]
iconv stream filter [ext/iconv/tests/iconv_stream_filter.phpt]
IPv6 Loopback test [ext/sockets/tests/ipv6loop.phpt]
Bug #29992 (foreach by reference corrupts the array) [ext/standard/tests/array/bug29992.phpt]
date_sunrise() and date_sunset() functions [ext/standard/tests/general_functions/sunfuncts.phpt]
Bug #20382 (strtotime ("Monday", $date) produces wrong result on DST changeover)
[ext/standard/tests/time/bug20382.phpt]
Bug #26614 (CDATA sections skipped on line count) [ext/xml/tests/bug26614.phpt]
=====================================================================
=====================================================================
TEST RESULT SUMMARY
---------------------------------------------------------------------
Exts skipped : 60
Exts tested : 23
---------------------------------------------------------------------
Number of tests : 1415 734
Tests skipped : 681 ( 48.1%) --------
Tests warned : 0 ( 0.0%) ( 0.0%)
Tests failed : 12 ( 0.8%) ( 1.6%)
Tests passed : 722 ( 51.0%) ( 98.4%)
---------------------------------------------------------------------
Time taken : 58 seconds
=====================================================================
=====================================================================
FAILED TEST SUMMARY
---------------------------------------------------------------------
Bug #31672 (one-line comment with </script>) [tests/basic/bug31672.phpt]
Test for buffering in core functions with implicit flush off [tests/func/008.phpt]
Bug #27268 (Bad references accentuated by clone) [Zend/tests/bug27268.phpt]
Test 5: HTML Test [ext/dom/tests/dom005.phpt]
Bug #24155 (gdImageRotate270 rotation problem). [ext/gd/tests/bug24155.phpt]
Bug #27582 (ImageFillToBorder() on alphablending image looses alpha on fill color)
[ext/gd/tests/bug27582_1.phpt]
iconv stream filter [ext/iconv/tests/iconv_stream_filter.phpt]
IPv6 Loopback test [ext/sockets/tests/ipv6loop.phpt]
Bug #29992 (foreach by reference corrupts the array) [ext/standard/tests/array/bug29992.phpt]
date_sunrise() and date_sunset() functions [ext/standard/tests/general_functions/sunfuncts.phpt]
Bug #20382 (strtotime ("Monday", $date) produces wrong result on DST changeover)
[ext/standard/tests/time/bug20382.phpt]
Bug #26614 (CDATA sections skipped on line count) [ext/xml/tests/bug26614.phpt]
=====================================================================
================================================================================
/usr/src/_hosting/php-5.0.5/tests/basic/bug31672.phpt
================================================================================
---- EXPECTED OUTPUT
Foobar
Foobar
---- ACTUAL OUTPUT
Foobar
Foo
---- FAILED
================================================================================
002+ Foo
002- Foobar
================================================================================
================================================================================
/usr/src/_hosting/php-5.0.5/tests/func/008.phpt
================================================================================
---- EXPECTED OUTPUT
'foo1'
'foo2'
---- ACTUAL OUTPUT
---- FAILED
================================================================================
001- 'foo1'
003- 'foo2'
================================================================================
================================================================================
/usr/src/_hosting/php-5.0.5/Zend/tests/bug27268.phpt
================================================================================
---- EXPECTED OUTPUT
A Object
(
[a] => Array
(
[0] => 1
)
)
---- ACTUAL OUTPUT
A Object
(
[a] => Array
(
)
)
---- FAILED
================================================================================
005- [0] => 1
================================================================================
================================================================================
/usr/src/_hosting/php-5.0.5/ext/dom/tests/dom005.phpt
================================================================================
---- EXPECTED OUTPUT
--- save as XML
<?xml version="1.0" standalone="yes"?>
<!DOCTYPE html PUBLIC "-//W3C//DTD HTML 4.0 Transitional//EN" "http://www.w3.org/TR/REC-html40/loose.dtd">
<html><head><title>Hello world</title></head><body><p>
This is a not well-formed<br/>
html files with undeclared entities 
</p></body></html>
--- save as HTML
<!DOCTYPE html PUBLIC "-//W3C//DTD HTML 4.0 Transitional//EN" "http://www.w3.org/TR/REC-html40/loose.dtd">
<html>
<head><title>Hello world</title></head>
<body><p>
This is a not well-formed<br>
html files with undeclared entities
</p></body>
</html>
---- ACTUAL OUTPUT
--- save as XML
<?xml version="1.0" standalone="yes"?>
<!DOCTYPE html PUBLIC "-//W3C//DTD HTML 4.0 Transitional//EN" "http://www.w3.org/TR/REC-html40/loose.dtd">
<html><head><title>Hello world</title></head><body>
This is a not well-formed<br/>
html files with undeclared entities 
</body></html>
--- save as HTML
<!DOCTYPE html PUBLIC "-//W3C//DTD HTML 4.0 Transitional//EN" "http://www.w3.org/TR/REC-html40/loose.dtd">
<html>
<head><title>Hello world</title></head>
<body>
This is a not well-formed<br>
html files with undeclared entities
</body>
</html>
---- FAILED
================================================================================
004+ <html><head><title>Hello world</title></head><body>
004- <html><head><title>Hello
world</title></head><body><p>
007+ </body></html>
007- </p></body></html>
012+ <body>
012- <body><p>
015+ </body>
015- </p></body>
================================================================================
================================================================================
/usr/src/_hosting/php-5.0.5/ext/gd/tests/bug24155.phpt
================================================================================
---- EXPECTED OUTPUT
cc867fd65c30883463ce58d0341f0997
---- ACTUAL OUTPUT
409d70b5d493746acc2255c759d73436
---- FAILED
================================================================================
001+ 409d70b5d493746acc2255c759d73436
001- cc867fd65c30883463ce58d0341f0997
================================================================================
================================================================================
/usr/src/_hosting/php-5.0.5/ext/gd/tests/bug27582_1.phpt
================================================================================
---- EXPECTED OUTPUT
08287f8f5d406946009df5f04ca83dc0
---- ACTUAL OUTPUT
b6d55b399e27b895a1fee8a137bb8470
---- FAILED
================================================================================
001+ b6d55b399e27b895a1fee8a137bb8470
001- 08287f8f5d406946009df5f04ca83dc0
================================================================================
================================================================================
/usr/src/_hosting/php-5.0.5/ext/iconv/tests/iconv_stream_filter.phpt
================================================================================
---- EXPECTED OUTPUT
string(20) "1b244224332473244b24"
string(10) "41244f1b28"
string(2) "42"
string(20) "a4b3a4f3a4cba4c1a4cf"
string(10) "69636f6e76"
string(2) "0a"
Warning: fread(): iconv stream filter ("ISO-2022-JP"=>"EUC-JP"): invalid
multibyte sequence in %s on line %d
string(0) ""
string(0) ""
string(0) ""
---- ACTUAL OUTPUT
string(20) "1b244224332473244b24"
string(10) "41244f1b28"
string(2) "42"
string(20) "a4b3a4f3a4cba4c1a4cf"
string(10) "69636f6e76"
string(2) "0a"
string(20) "1b244f24332466245824"
string(10) "4e24421b28"
string(2) "4f"
---- FAILED
================================================================================
007+ string(20) "1b244f24332466245824"
008+ string(10) "4e24421b28"
009+ string(2) "4f"
007-
008- Warning: fread(): iconv stream filter ("ISO-2022-JP"=>"EUC-JP"): invalid
multibyte sequence in %s on line %d
009- string(0) ""
010- string(0) ""
011- string(0) ""
================================================================================
================================================================================
/usr/src/_hosting/php-5.0.5/ext/sockets/tests/ipv6loop.phpt
================================================================================
---- EXPECTED OUTPUT
string(10) "ABCdef123
"
---- ACTUAL OUTPUT
Notice: Use of undefined constant AF_INET6 - assumed 'AF_INET6' in
/usr/src/_hosting/php-5.0.5/ext/sockets/tests/ipv6loop.php on line 3
Warning: socket_create() expects parameter 1 to be long, string given in
/usr/src/_hosting/php-5.0.5/ext/sockets/tests/ipv6loop.php on line 3
Unable to create AF_INET6 socket [server]
---- FAILED
================================================================================
001+ Notice: Use of undefined constant AF_INET6 - assumed 'AF_INET6' in
/usr/src/_hosting/php-5.0.5/ext/sockets/tests/ipv6loop.php on line 3
002+
001- string(10) "ABCdef123
002- "
003+ Warning: socket_create() expects parameter 1 to be long, string given in
/usr/src/_hosting/php-5.0.5/ext/sockets/tests/ipv6loop.php on line 3
004+ Unable to create AF_INET6 socket [server]
================================================================================
================================================================================
/usr/src/_hosting/php-5.0.5/ext/standard/tests/array/bug29992.phpt
================================================================================
---- EXPECTED OUTPUT
Array
(
[0] => 1
[1] => 2
[2] => 3
)
int(1)
int(2)
int(3)
int(1)
int(2)
int(3)
int(1)
int(2)
int(3)
int(1)
int(2)
int(3)
Array
(
[0] => 1
[1] => 2
[2] => 3
)
===DONE===
---- ACTUAL OUTPUT
Array
(
[0] => 1
[1] => 2
[2] => 3
)
int(1)
int(2)
int(3)
int(1)
int(2)
int(3)
int(1)
int(2)
int(3)
int(1)
int(2)
int(2)
Array
(
[0] => 1
[1] => 2
[2] => 2
)
===DONE===
---- FAILED
================================================================================
018+ int(2)
018- int(3)
023+ [2] => 2
023- [2] => 3
================================================================================
================================================================================
/usr/src/_hosting/php-5.0.5/ext/standard/tests/general_functions/sunfuncts.phpt
================================================================================
---- EXPECTED OUTPUT
1041293199 06:39 6.652455761896
1041293806 16:46 16.76937486746
1043971592 06:32 6.54537029266
1043972233 17:13 17.21752470874
1046390766 06:06 6.115652675685
1046391456 17:36 17.6108549623
1049069128 05:28 5.472742029069
1049069878 17:58 17.97255258437
1051661094 04:54 4.901229982859
1051661898 18:18 18.31368876948
1054339474 04:34 4.57442928945
1054340319 18:39 18.65640094324
1056931476 04:36 4.616120450519
1056932328 18:48 18.80887165777
1059609894 04:54 4.906882509836
1059610715 18:35 18.59928600203
1062288314 05:14 5.236889557074
1062289083 18:03 18.06054178788
1064880332 05:32 5.542366581139
1064881044 17:24 17.41150561492
1067558754 05:54 5.916208842058
1067559410 16:50 16.83369857063
1070150780 06:20 6.34622155207
1070151395 16:35 16.58358905554
---- ACTUAL OUTPUT
1041316748 06:39 6.652455761896
1041353169 16:46 16.76937486746
1043994763 06:32 6.54537029266
1044033183 17:13 17.21752470874
1046412416 06:06 6.115652675685
1046453799 17:36 17.6108549623
1049088501 05:28 5.472742029069
1049133501 17:58 17.97255258437
1051678444 04:54 4.901229982859
1051726729 18:18 18.31368876948
1054355667 04:34 4.57442928945
1054406363 18:39 18.65640094324
1056947818 04:36 4.616120450519
1056998911 18:48 18.80887165777
1059627264 04:54 4.906882509836
1059676557 18:35 18.59928600203
1062306852 05:14 5.236889557074
1062353017 18:03 18.06054178788
1064899952 05:32 5.542366581139
1064942681 17:24 17.41150561492
1067579698 05:54 5.916208842058
1067619001 16:50 16.83369857063
1070173246 06:20 6.34622155207
1070210100 16:35 16.58358905554
---- FAILED
================================================================================
001+ 1041316748 06:39 6.652455761896
002+ 1041353169 16:46 16.76937486746
003+ 1043994763 06:32 6.54537029266
004+ 1044033183 17:13 17.21752470874
005+ 1046412416 06:06 6.115652675685
006+ 1046453799 17:36 17.6108549623
007+ 1049088501 05:28 5.472742029069
008+ 1049133501 17:58 17.97255258437
009+ 1051678444 04:54 4.901229982859
010+ 1051726729 18:18 18.31368876948
011+ 1054355667 04:34 4.57442928945
012+ 1054406363 18:39 18.65640094324
013+ 1056947818 04:36 4.616120450519
014+ 1056998911 18:48 18.80887165777
015+ 1059627264 04:54 4.906882509836
016+ 1059676557 18:35 18.59928600203
017+ 1062306852 05:14 5.236889557074
018+ 1062353017 18:03 18.06054178788
019+ 1064899952 05:32 5.542366581139
020+ 1064942681 17:24 17.41150561492
021+ 1067579698 05:54 5.916208842058
022+ 1067619001 16:50 16.83369857063
023+ 1070173246 06:20 6.34622155207
024+ 1070210100 16:35 16.58358905554
001- 1041293199 06:39 6.652455761896
002- 1041293806 16:46 16.76937486746
003- 1043971592 06:32 6.54537029266
004- 1043972233 17:13 17.21752470874
005- 1046390766 06:06 6.115652675685
006- 1046391456 17:36 17.6108549623
007- 1049069128 05:28 5.472742029069
008- 1049069878 17:58 17.97255258437
009- 1051661094 04:54 4.901229982859
010- 1051661898 18:18 18.31368876948
011- 1054339474 04:34 4.57442928945
012- 1054340319 18:39 18.65640094324
013- 1056931476 04:36 4.616120450519
014- 1056932328 18:48 18.80887165777
015- 1059609894 04:54 4.906882509836
016- 1059610715 18:35 18.59928600203
017- 1062288314 05:14 5.236889557074
018- 1062289083 18:03 18.06054178788
019- 1064880332 05:32 5.542366581139
020- 1064881044 17:24 17.41150561492
021- 1067558754 05:54 5.916208842058
022- 1067559410 16:50 16.83369857063
023- 1070150780 06:20 6.34622155207
024- 1070151395 16:35 16.58358905554
================================================================================
================================================================================
/usr/src/_hosting/php-5.0.5/ext/standard/tests/time/bug20382.phpt
================================================================================
---- EXPECTED OUTPUT
tStamp=Wednesday 2004-10-27 17:17:17 CEST
result=Monday 2004-11-01 00:00:00 CET
wanted=Monday 2004-11-01 00:00:00 CET
---- ACTUAL OUTPUT
tStamp=Wednesday 2004-10-27 17:17:17 CEST
result=Sunday 2004-10-31 23:00:00 CET
wanted=Monday 2004-11-01 00:00:00 CET
---- FAILED
================================================================================
002+ result=Sunday 2004-10-31 23:00:00 CET
002- result=Monday 2004-11-01 00:00:00 CET
================================================================================
================================================================================
/usr/src/_hosting/php-5.0.5/ext/xml/tests/bug26614.phpt
================================================================================
---- EXPECTED OUTPUT
CDATA
<DATA> at line 2, col 0 (byte 45)
</DATA> at line 9, col 0 (byte 90)
Comment
<DATA> at line 2, col 0 (byte 45)
</DATA> at line 9, col 0 (byte 90)
Text
<DATA> at line 2, col 0 (byte 45)
</DATA> at line 9, col 0 (byte 90)
---- ACTUAL OUTPUT
CDATA
<DATA> at line 2, col 6 (byte 9)
</DATA> at line 9, col 8 (byte 56)
Comment
<DATA> at line 2, col 6 (byte 9)
</DATA> at line 9, col 8 (byte 56)
Text
<DATA> at line 2, col 6 (byte 9)
</DATA> at line 9, col 8 (byte 56)
---- FAILED
================================================================================
002+ <DATA> at line 2, col 6 (byte 9)
003+ </DATA> at line 9, col 8 (byte 56)
002- <DATA> at line 2, col 0 (byte 45)
003- </DATA> at line 9, col 0 (byte 90)
005+ <DATA> at line 2, col 6 (byte 9)
006+ </DATA> at line 9, col 8 (byte 56)
005- <DATA> at line 2, col 0 (byte 45)
006- </DATA> at line 9, col 0 (byte 90)
008+ <DATA> at line 2, col 6 (byte 9)
009+ </DATA> at line 9, col 8 (byte 56)
008- <DATA> at line 2, col 0 (byte 45)
009- </DATA> at line 9, col 0 (byte 90)
================================================================================
================================================================================
BUILD ENVIRONMENT
================================================================================
OS:
Linux - Linux ks 2.4.31 #9 SMP Sun Nov 6 15:19:44 MSK 2005 i686
Automake:
automake (GNU automake) 1.9.5
Written by Tom Tromey <tromey@redhat.com>.
Copyright 2005 Free Software Foundation, Inc.
This is free software; see the source for copying conditions. There is NO
warranty; not even for MERCHANTABILITY or FITNESS FOR A PARTICULAR PURPOSE.
Autoconf:
autoconf (GNU Autoconf) 2.59
Written by David J. MacKenzie and Akim Demaille.
Copyright (C) 2003 Free Software Foundation, Inc.
This is free software; see the source for copying conditions. There is NO
warranty; not even for MERCHANTABILITY or FITNESS FOR A PARTICULAR PURPOSE.
Bundled Libtool:
ltmain.sh (GNU libtool) 1.4.3 (1.922.2.111 2002/10/23 02:54:36)
System Libtool:
ltmain.sh (GNU libtool) 1.5.20 (1.1220.2.287 2005/08/31 18:54:15)
Copyright (C) 2005 Free Software Foundation, Inc.
This is free software; see the source for copying conditions. There is NO
warranty; not even for MERCHANTABILITY or FITNESS FOR A PARTICULAR PURPOSE.
Compiler:
Reading specs from /usr/lib/gcc-lib/i486-slackware-linux/3.3.6/specs
Configured with: ../gcc-3.3.6/configure --prefix=/usr --enable-shared --enable-threads=posix
--enable-__cxa_atexit --disable-checking --with-gnu-ld --verbose --target=i486-slackware-linux
--host=i486-slackware-linux
Thread model: posix
gcc version 3.3.6
Bison:
bison (GNU Bison) 1.35
Copyright 1984, 1986, 1989, 1992, 2000, 2001, 2002
Free Software Foundation, Inc.
This is free software; see the source for copying conditions. There is NO
warranty; not even for MERCHANTABILITY or FITNESS FOR A PARTICULAR PURPOSE.
Libraries:
libcrypt.so.1 => /lib/libcrypt.so.1 (0x4001c000)
libsybdb.so.5 => /usr/lib/libsybdb.so.5 (0x4004a000)
libmcrypt.so.4 => /usr/lib/libmcrypt.so.4 (0x40090000)
libltdl.so.3 => /usr/lib/libltdl.so.3 (0x400c3000)
libpng.so.3 => /usr/lib/libpng.so.3 (0x400ca000)
libz.so.1 => /usr/lib/libz.so.1 (0x400fb000)
libbz2.so.1 => /lib/libbz2.so.1 (0x4010d000)
libresolv.so.2 => /lib/libresolv.so.2 (0x4011c000)
libm.so.6 => /lib/libm.so.6 (0x40130000)
libnsl.so.1 => /lib/libnsl.so.1 (0x40153000)
libxml2.so.2 => /usr/lib/libxml2.so.2 (0x40169000)
libdl.so.2 => /lib/libdl.so.2 (0x40287000)
libc.so.6 => /lib/libc.so.6 (0x4028b000)
/lib/ld-linux.so.2 (0x40000000)
User's E-mail: alex at hausnet dot ru
================================================================================
PHPINFO
================================================================================
phpinfo()
PHP Version => 5.0.5
System => Linux ks 2.4.31 #9 SMP Sun Nov 6 15:19:44 MSK 2005 i686
Build Date => Nov 8 2005 18:06:10
Configure Command => './configure' '--prefix=/usr'
'--with-config-file-path=/etc' '--with-mysql=/usr/local/mysql'
'--with-mysql-sock=/tmp/mysql.sock' '--with-mssql' '--with-iconv'
'--with-gd' '--with-zlib-dir=/usr/lib' '--with-gnu-ld'
'--with-mod_charset' '--with-zlib=yes' '--with-bz2'
'--with-mcrypt' '--enable-cli' '--disable-cgi'
'--disable-pear' '--enable-debug=no' '--enable-libgcc'
'--enable-pcntl' '--enable-ftp' '--enable-posix'
'--enable-sockets' '--disable-ipv6' '--enable-dba'
'--enable-libxml'
Server API => Command Line Interface
Virtual Directory Support => disabled
Configuration File (php.ini) Path => /etc/php.ini
PHP API => 20031224
PHP Extension => 20041030
Zend Extension => 220040412
Debug Build => no
Thread Safety => disabled
Zend Memory Manager => enabled
IPv6 Support => disabled
Registered PHP Streams => php, file, http, ftp, compress.bzip2, compress.zlib
Registered Stream Socket Transports => tcp, udp, unix, udg
This program makes use of the Zend Scripting Language Engine:
Zend Engine v2.0.5, Copyright (c) 1998-2004 Zend Technologies
_______________________________________________________________________
Configuration
PHP Core
Directive => Local Value => Master Value
allow_call_time_pass_reference => On => On
allow_url_fopen => On => On
always_populate_raw_post_data => Off => Off
arg_separator.input => & => &
arg_separator.output => & => &
asp_tags => Off => Off
auto_append_file => no value => no value
auto_globals_jit => On => On
auto_prepend_file => no value => no value
browscap => no value => no value
default_charset => no value => no value
default_mimetype => text/html => text/html
define_syslog_variables => Off => Off
disable_classes => no value => no value
disable_functions => no value => no value
display_errors => On => On
display_startup_errors => Off => Off
doc_root => no value => no value
docref_ext => no value => no value
docref_root => no value => no value
enable_dl => On => On
error_append_string => no value => no value
error_log => no value => no value
error_prepend_string => no value => no value
error_reporting => 2039 => 2039
expose_php => On => On
extension_dir => /usr/lib/php => /usr/lib/php
file_uploads => Off => Off
highlight.bg => #FFFFFF => #FFFFFF
highlight.comment => #FF8000 => #FF8000
highlight.default => #0000BB => #0000BB
highlight.html => #000000 => #000000
highlight.keyword => #007700 => #007700
highlight.string => #DD0000 => #DD0000
html_errors => Off => On
ignore_repeated_errors => Off => Off
ignore_repeated_source => Off => Off
ignore_user_abort => Off => Off
implicit_flush => On => Off
include_path => .: => .:
log_errors => Off => Off
log_errors_max_len => 1024 => 1024
magic_quotes_gpc => On => On
magic_quotes_runtime => Off => Off
magic_quotes_sybase => Off => Off
mail.force_extra_parameters => no value => no value
max_execution_time => 0 => 30
max_input_time => -1 => -1
open_basedir => no value => no value
output_buffering => 0 => no value
output_handler => no value => no value
post_max_size => 8M => 8M
precision => 12 => 12
register_argc_argv => On => On
register_globals => On => On
register_long_arrays => On => On
report_memleaks => On => On
report_zend_debug => Off => Off
safe_mode => Off => Off
safe_mode_exec_dir => no value => no value
safe_mode_gid => Off => Off
safe_mode_include_dir => no value => no value
sendmail_from => no value => no value
sendmail_path => /usr/sbin/sendmail -t -i => /usr/sbin/sendmail -t -i
serialize_precision => 100 => 100
short_open_tag => On => On
SMTP => localhost => localhost
smtp_port => 25 => 25
sql.safe_mode => Off => Off
track_errors => Off => Off
unserialize_callback_func => no value => no value
upload_max_filesize => 2M => 2M
upload_tmp_dir => no value => no value
user_dir => no value => no value
variables_order => EGPCS => EGPCS
xmlrpc_error_number => 0 => 0
xmlrpc_errors => Off => Off
y2k_compliance => On => On
zend.ze1_compatibility_mode => Off => Off
bz2
BZip2 Support => Enabled
BZip2 Version => 1.0.3, 15-Feb-2005
ctype
ctype functions => enabled
dba
DBA support => enabled
Supported handlers => cdb cdb_make inifile flatfile
dom
DOM/XML => enabled
DOM/XML API Version => 20031129
libxml Version => 2.6.21
HTML Support => enabled
XPath Support => enabled
XPointer Support => enabled
Schema Support => enabled
RelaxNG Support => enabled
ftp
FTP support => enabled
gd
GD Support => enabled
GD Version => bundled (2.0.28 compatible)
GIF Read Support => enabled
GIF Create Support => enabled
PNG Support => enabled
WBMP Support => enabled
XBM Support => enabled
iconv
iconv support => enabled
iconv implementation => glibc
iconv library version => 2.3.5
Directive => Local Value => Master Value
iconv.input_encoding => ISO-8859-1 => ISO-8859-1
iconv.internal_encoding => ISO-8859-1 => ISO-8859-1
iconv.output_encoding => ISO-8859-1 => ISO-8859-1
libxml
libXML support => active
libXML Version => 2.6.21
libXML streams => enabled
mcrypt
mcrypt support => enabled
Version => 2.5.7
Api No => 20021217
Supported ciphers => cast-128 gost rijndael-128 twofish arcfour cast-256 loki97 rijndael-192
saferplus wake blowfish-compat des rijndael-256 serpent xtea blowfish enigma rc2 tripledes
Supported modes => cbc cfb ctr ecb ncfb nofb ofb stream
Directive => Local Value => Master Value
mcrypt.algorithms_dir => no value => no value
mcrypt.modes_dir => no value => no value
mssql
MSSQL Support => enabled
Active Persistent Links => 0
Active Links => 0
Library version => 7.0
Directive => Local Value => Master Value
mssql.allow_persistent => On => On
mssql.batchsize => 0 => 0
mssql.compatability_mode => Off => Off
mssql.connect_timeout => 5 => 5
mssql.datetimeconvert => On => On
mssql.max_links => Unlimited => Unlimited
mssql.max_persistent => Unlimited => Unlimited
mssql.max_procs => 25 => 25
mssql.min_error_severity => 10 => 10
mssql.min_message_severity => 10 => 10
mssql.secure_connection => Off => Off
mssql.textlimit => Server default => Server default
mssql.textsize => Server default => Server default
mssql.timeout => 60 => 60
mysql
MySQL Support => enabled
Active Persistent Links => 0
Active Links => 0
Client API version => 5.0.15
MYSQL_MODULE_TYPE => external
MYSQL_SOCKET => /tmp/mysql.sock
MYSQL_INCLUDE => -I/usr/local/mysql/include
MYSQL_LIBS => -L/usr/local/mysql/lib -lmysqlclient
Directive => Local Value => Master Value
mysql.allow_persistent => On => On
mysql.connect_timeout => 60 => 60
mysql.default_host => localhost => localhost
mysql.default_password => no value => no value
mysql.default_port => 3306 => 3306
mysql.default_socket => /tmp/mysql.sock => /tmp/mysql.sock
mysql.default_user => no value => no value
mysql.max_links => Unlimited => Unlimited
mysql.max_persistent => Unlimited => Unlimited
mysql.trace_mode => Off => Off
pcntl
pcntl support => enabled
pcre
PCRE (Perl Compatible Regular Expressions) Support => enabled
PCRE Library Version => 6.2 01-Aug-2005
posix
Revision => $Revision: 1.60.2.4 $
session
Session Support => enabled
Registered save handlers => files user sqlite
Registered serializer handlers => php php_binary
Directive => Local Value => Master Value
session.auto_start => Off => Off
session.bug_compat_42 => On => On
session.bug_compat_warn => On => On
session.cache_expire => 180 => 180
session.cache_limiter => nocache => nocache
session.cookie_domain => no value => no value
session.cookie_lifetime => 0 => 0
session.cookie_path => / => /
session.cookie_secure => Off => Off
session.entropy_file => no value => no value
session.entropy_length => 0 => 0
session.gc_divisor => 100 => 100
session.gc_maxlifetime => 1440 => 1440
session.gc_probability => 1 => 1
session.hash_bits_per_character => 4 => 4
session.hash_function => 0 => 0
session.name => PHPSESSID => PHPSESSID
session.referer_check => no value => no value
session.save_handler => files => files
session.save_path => no value => no value
session.serialize_handler => php => php
session.use_cookies => On => On
session.use_only_cookies => Off => Off
session.use_trans_sid => 0 => 0
SimpleXML
Simplexml support => enabled
Revision => $Revision: 1.139.2.4 $
Schema support => enabled
sockets
Sockets Support => enabled
SPL
SPL support => enabled
Interfaces => RecursiveIterator, SeekableIterator
Classes => ArrayIterator, ArrayObject, CachingIterator, CachingRecursiveIterator,
DirectoryIterator, FilterIterator, LimitIterator, ParentIterator, RecursiveDirectoryIterator,
RecursiveIteratorIterator, SimpleXMLIterator
SQLite
SQLite support => enabled
PECL Module version => 2.0-dev $Id: sqlite.c,v 1.146.2.7 2005/06/07 15:38:37 dmitry Exp $
SQLite Library => 2.8.14
SQLite Encoding => iso8859
Directive => Local Value => Master Value
sqlite.assoc_case => 0 => 0
standard
Regex Library => Bundled library enabled
Dynamic Library Support => enabled
Path to sendmail => /usr/sbin/sendmail -t -i
Directive => Local Value => Master Value
assert.active => 1 => 1
assert.bail => 0 => 0
assert.callback => no value => no value
assert.quiet_eval => 0 => 0
assert.warning => 1 => 1
auto_detect_line_endings => 0 => 0
date.default_latitude => 31.7667 => 31.7667
date.default_longitude => 35.2333 => 35.2333
date.sunrise_zenith => 90.83 => 90.83
date.sunset_zenith => 90.83 => 90.83
default_socket_timeout => 60 => 60
safe_mode_allowed_env_vars => PHP_ => PHP_
safe_mode_protected_env_vars => LD_LIBRARY_PATH => LD_LIBRARY_PATH
url_rewriter.tags => a=href,area=href,frame=src,form=,fieldset= =>
a=href,area=href,frame=src,form=,fieldset=
user_agent => no value => no value
tokenizer
Tokenizer Support => enabled
xml
XML Support => active
XML Namespace Support => active
libxml2 Version => 2.6.21
zlib
ZLib Support => enabled
Compiled Version => 1.2.3
Linked Version => 1.2.3
Directive => Local Value => Master Value
zlib.output_compression => Off => Off
zlib.output_compression_level => -1 => -1
zlib.output_handler => no value => no value
Additional Modules
Module Name
Environment
Variable => Value
MANPATH => /usr/local/man:/usr/man:/usr/X11R6/man
HOSTNAME => ks.hausnet.ru
TEST_PHP_SRCDIR => /usr/src/_hosting/php-5.0.5
SHELL => /bin/sh
TERM => xterm-color
MAKEFLAGS =>
SSH_CLIENT => deleted
SSH_TTY => deleted
USER => root
LS_COLORS =>
SCRIPT_FILENAME =>
SSH_AUTH_SOCK => deleted
MAKELEVEL => 1
MFLAGS =>
MC_TMPDIR => /tmp/mc-root
MINICOM => -c on
PATH => /usr/local/sbin:/usr/sbin:/sbin:/usr/local/bin:/usr/bin:/bin:/usr/X11R6/bin:/usr/games
MAIL => /var/mail/root
_ => /usr/src/_hosting/php-5.0.5/sapi/cli/php
LC_COLLATE => C
PWD => /usr/src/_hosting/php-5.0.5
INPUTRC => /etc/inputrc
LANG => en_US
TEST_PHP_EXECUTABLE => /usr/src/_hosting/php-5.0.5/sapi/cli/php
REDIRECT_STATUS =>
PATH_TRANSLATED =>
HISTCONTROL => ignorespace
HOME => /root
SHLVL => 4
CONTENT_LENGTH =>
LS_OPTIONS => --color=auto -F -b -T 0
MC_SID => 5250
LOGNAME => root
LESS => -M
QUERY_STRING =>
SSH_CONNECTION => 10.0.7.17 2775 10.0.7.3 22
LESSOPEN => |lesspipe.sh %s
CONTENT_TYPE =>
CC => gcc
REQUEST_METHOD =>
PHP Variables
Variable => Value
PHP_SELF =>
_SERVER["MANPATH"] => /usr/local/man:/usr/man:/usr/X11R6/man
_SERVER["HOSTNAME"] => ks.hausnet.ru
_SERVER["TEST_PHP_SRCDIR"] => /usr/src/_hosting/php-5.0.5
_SERVER["SHELL"] => /bin/sh
_SERVER["TERM"] => xterm-color
_SERVER["MAKEFLAGS"] =>
_SERVER["SSH_CLIENT"] => deleted
_SERVER["SSH_TTY"] => deleted
_SERVER["USER"] => root
_SERVER["LS_COLORS"] =>
_SERVER["SCRIPT_FILENAME"] =>
_SERVER["SSH_AUTH_SOCK"] => deleted
_SERVER["MAKELEVEL"] => 1
_SERVER["MFLAGS"] =>
_SERVER["MC_TMPDIR"] => /tmp/mc-root
_SERVER["MINICOM"] => -c on
_SERVER["PATH"] =>
/usr/local/sbin:/usr/sbin:/sbin:/usr/local/bin:/usr/bin:/bin:/usr/X11R6/bin:/usr/games
_SERVER["MAIL"] => /var/mail/root
_SERVER["_"] => /usr/src/_hosting/php-5.0.5/sapi/cli/php
_SERVER["LC_COLLATE"] => C
_SERVER["PWD"] => /usr/src/_hosting/php-5.0.5
_SERVER["INPUTRC"] => /etc/inputrc
_SERVER["LANG"] => en_US
_SERVER["TEST_PHP_EXECUTABLE"] => /usr/src/_hosting/php-5.0.5/sapi/cli/php
_SERVER["REDIRECT_STATUS"] =>
_SERVER["PATH_TRANSLATED"] =>
_SERVER["HISTCONTROL"] => ignorespace
_SERVER["HOME"] => /root
_SERVER["SHLVL"] => 4
_SERVER["CONTENT_LENGTH"] =>
_SERVER["LS_OPTIONS"] => --color=auto -F -b -T 0
_SERVER["MC_SID"] => 5250
_SERVER["LOGNAME"] => root
_SERVER["LESS"] => -M
_SERVER["QUERY_STRING"] =>
_SERVER["SSH_CONNECTION"] => 10.0.7.17 2775 10.0.7.3 22
_SERVER["LESSOPEN"] => |lesspipe.sh %s
_SERVER["CONTENT_TYPE"] =>
_SERVER["CC"] => gcc
_SERVER["REQUEST_METHOD"] =>
_SERVER["PHP_SELF"] =>
_SERVER["SCRIPT_NAME"] =>
_SERVER["DOCUMENT_ROOT"] =>
_SERVER["argv"] => Array
(
)
_SERVER["argc"] => 0
_ENV["MANPATH"] => /usr/local/man:/usr/man:/usr/X11R6/man
_ENV["HOSTNAME"] => ks.hausnet.ru
_ENV["TEST_PHP_SRCDIR"] => /usr/src/_hosting/php-5.0.5
_ENV["SHELL"] => /bin/sh
_ENV["TERM"] => xterm-color
_ENV["MAKEFLAGS"] =>
_ENV["SSH_CLIENT"] => deleted
_ENV["SSH_TTY"] => deleted
_ENV["USER"] => root
_ENV["LS_COLORS"] =>
_ENV["SCRIPT_FILENAME"] =>
_ENV["SSH_AUTH_SOCK"] => deleted
_ENV["MAKELEVEL"] => 1
_ENV["MFLAGS"] =>
_ENV["MC_TMPDIR"] => /tmp/mc-root
_ENV["MINICOM"] => -c on
_ENV["PATH"] =>
/usr/local/sbin:/usr/sbin:/sbin:/usr/local/bin:/usr/bin:/bin:/usr/X11R6/bin:/usr/games
_ENV["MAIL"] => /var/mail/root
_ENV["_"] => /usr/src/_hosting/php-5.0.5/sapi/cli/php
_ENV["LC_COLLATE"] => C
_ENV["PWD"] => /usr/src/_hosting/php-5.0.5
_ENV["INPUTRC"] => /etc/inputrc
_ENV["LANG"] => en_US
_ENV["TEST_PHP_EXECUTABLE"] => /usr/src/_hosting/php-5.0.5/sapi/cli/php
_ENV["REDIRECT_STATUS"] =>
_ENV["PATH_TRANSLATED"] =>
_ENV["HISTCONTROL"] => ignorespace
_ENV["HOME"] => /root
_ENV["SHLVL"] => 4
_ENV["CONTENT_LENGTH"] =>
_ENV["LS_OPTIONS"] => --color=auto -F -b -T 0
_ENV["MC_SID"] => 5250
_ENV["LOGNAME"] => root
_ENV["LESS"] => -M
_ENV["QUERY_STRING"] =>
_ENV["SSH_CONNECTION"] => 10.0.7.17 2775 10.0.7.3 22
_ENV["LESSOPEN"] => |lesspipe.sh %s
_ENV["CONTENT_TYPE"] =>
_ENV["CC"] => gcc
_ENV["REQUEST_METHOD"] =>
PHP License
This program is free software; you can redistribute it and/or modify
it under the terms of the PHP License as published by the PHP Group
and included in the distribution in the file: LICENSE
This program is distributed in the hope that it will be useful,
but WITHOUT ANY WARRANTY; without even the implied warranty of
MERCHANTABILITY or FITNESS FOR A PARTICULAR PURPOSE.
If you did not receive a copy of the PHP license, or have any
questions about PHP licensing, please contact license@php.net.