Test results for 4.4.5 [failed]

From: Date: Mon, 19 Feb 2007 17:07:46 +0000
Subject: Test results for 4.4.5 [failed]
Groups: php.qa 
Request: Send a blank email to php-qa+get-27274@lists.php.net to get a copy of this message
===================================================================== FAILED TEST SUMMARY --------------------------------------------------------------------- Bug #28377 (debug_backtrace is intermittently passing args) [tests/lang/bug28377.phpt] Bug #35239 (Objects can lose references) [tests/lang/bug35239.phpt] Bug #24155 (gdImageRotate270 rotation problem). [ext/gd/tests/bug24155.phpt] Bug #27582 (ImageFillToBorder() on alphablending image looses alpha on fill color) [ext/gd/tests/bug27582_1.phpt] Bug #16069 [ext/iconv/tests/bug16069.phpt] bug compatibility: unset($c) with enabled register_globals [ext/session/tests/007.phpt] serializing references test case using globals [ext/session/tests/019.phpt] bug #31454 (session_set_save_handler crashes PHP when supplied non-existent object ref) [ext/session/tests/bug31454.phpt] Bug #22414: passthru() does not read data correctly [ext/standard/tests/file/bug22414.phpt] Bug #28325 (Problem in serialisation of circular references) [ext/standard/tests/serialize/bug28325.phpt] ===================================================================== ===================================================================== TEST RESULT SUMMARY --------------------------------------------------------------------- Exts skipped : 62 Exts tested : 26 --------------------------------------------------------------------- Number of tests : 632 Tests skipped : 153 (24.2%) Tests warned : 0 (0.0%) Tests failed : 10 (1.6%) Tests passed : 469 (74.2%) --------------------------------------------------------------------- Time taken : 38 seconds ===================================================================== ================================================================================ /usr/src/downloads/php-4.4.5/tests/lang/bug28377.phpt ================================================================================ ---- EXPECTED OUTPUT dereferenced -- args: 2 direct -- args: 2 ---- ACTUAL OUTPUT dereferenced -- args: 2 direct -- args: does not exist ---- FAILED ================================================================================ 002- direct -- args: 2 002+ direct -- args: does not exist ================================================================================ ================================================================================ /usr/src/downloads/php-4.4.5/tests/lang/bug35239.phpt ================================================================================ ---- EXPECTED OUTPUT object(stdClass)(1) { ["x0"]=> &object(stdClass)(3) { ["y0"]=> string(1) "b" ["y1"]=> &object(stdClass)(3) { ["y0"]=> string(1) "b" ["y1"]=> *RECURSION* ["y2"]=> *RECURSION* } ["y2"]=> &object(stdClass)(3) { ["y0"]=> string(1) "b" ["y1"]=> *RECURSION* ["y2"]=> *RECURSION* } } } string(2) "ok" ---- ACTUAL OUTPUT object(stdClass)(1) { ["x0"]=> &object(stdClass)(3) { ["y0"]=> string(1) "b" ["y1"]=> &object(stdClass)(3) { ["y0"]=> string(1) "b" ["y1"]=> *RECURSION* ["y2"]=> *RECURSION* } ["y2"]=> &object(stdClass)(3) { ["y0"]=> string(1) "b" ["y1"]=> *RECURSION* ["y2"]=> *RECURSION* } } } NULL ---- FAILED ================================================================================ 026- string(2) "ok" 026+ NULL ================================================================================ ================================================================================ /usr/src/downloads/php-4.4.5/ext/gd/tests/bug24155.phpt ================================================================================ ---- EXPECTED OUTPUT cc867fd65c30883463ce58d0341f0997 ---- ACTUAL OUTPUT 409d70b5d493746acc2255c759d73436 ---- FAILED ================================================================================ 001- cc867fd65c30883463ce58d0341f0997 001+ 409d70b5d493746acc2255c759d73436 ================================================================================ ================================================================================ /usr/src/downloads/php-4.4.5/ext/gd/tests/bug27582_1.phpt ================================================================================ ---- EXPECTED OUTPUT 08287f8f5d406946009df5f04ca83dc0 ---- ACTUAL OUTPUT b6d55b399e27b895a1fee8a137bb8470 ---- FAILED ================================================================================ 001- 08287f8f5d406946009df5f04ca83dc0 001+ b6d55b399e27b895a1fee8a137bb8470 ================================================================================ ================================================================================ /usr/src/downloads/php-4.4.5/ext/iconv/tests/bug16069.phpt ================================================================================ ---- EXPECTED OUTPUT ¥ß¥ê¥Ð¡¼¥ë¥ß¥ê¥Ð¡¼¥ë¥ß¥ê¥Ð¡¼¥ë¥ß¥ê¥Ð¡¼¥ë¥ß¥ê¥Ð¡¼¥ë¥ß¥ê¥Ð¡¼¥ë¥ß¥ê¥Ð¡¼¥ë¥ß¥ê¥Ð¡¼¥ë¥ß¥ê¥Ð¡¼¥ë¥ß¥ê¥Ð¡¼¥ë¥ß¥ê¥Ð¡¼¥ë¥ß¥ê¥Ð¡¼¥ë¥ß¥ê¥Ð¡¼¥ë¥ß¥ê¥Ð¡¼¥ë¥ß¥ê¥Ð¡¼¥ë¥ß¥ê¥Ð¡¼¥ë¥ß¥ê¥Ð¡¼¥ë¥ß¥ê¥Ð¡¼¥ë¥ß¥ê¥Ð¡¼¥ë¥ß¥ê¥Ð¡¼¥ë¥ß¥ê¥Ð¡¼¥ë¥ß¥ê¥Ð¡¼¥ë¥ß¥ê¥Ð¡¼¥ë¥ß¥ê¥Ð¡¼¥ë¥ß¥ê¥Ð¡¼¥ë¥ß¥ê¥Ð¡¼¥ë¥ß¥ê¥Ð¡¼¥ë¥ß¥ê¥Ð¡¼¥ë¥ß¥ê¥Ð¡¼¥ë¥ß¥ê¥Ð¡¼¥ë¥ß¥ê¥Ð¡¼¥ë¥ß¥ê¥Ð¡¼¥ë¥ß¥ê¥Ð¡¼¥ë¥ß¥ê¥Ð¡¼¥ë¥ß¥ê¥Ð¡¼¥ë¥ß¥ê¥Ð¡¼¥ë¥ß¥ê¥Ð¡¼¥ë¥ß¥ê¥Ð¡¼¥ë¥ß¥ê¥Ð¡¼¥ë¥ß¥ê¥Ð¡¼¥ë(¡ë§¥¡ë) ---- ACTUAL OUTPUT ¥ß¥ê¥Ð¡¼¥ë¥ß¥ê¥Ð¡¼¥ë¥ß¥ê¥Ð¡¼¥ë¥ß¥ê¥Ð¡¼¥ë¥ß¥ê¥Ð¡¼¥ë¥ß¥ê¥Ð¡¼¥ë¥ß¥ê¥Ð¡¼¥ë¥ß¥ê¥Ð¡¼¥ë¥ß¥ê¥Ð¡¼¥ë¥ß¥ê¥Ð¡¼¥ë¥ß¥ê¥Ð¡¼¥ë¥ß¥ß¥ê¥Ð¡¼¥ë¥ß¥ê¥Ð¡¼¥ë¥ß¥ê¥Ð¡¼¥ë¥ß¥ê¥Ð¡¼¥ë¥ß¥ê¥Ð¡¼¥ë¥ß¥ê¥Ð¡¼¥ë¥ß¥ê¥Ð¡¼¥ë¥ß¥ê¥Ð¡¼¥ë¥ß¥ê¥Ð¡¼¥ë¥ß¥ê¥Ð¡¼¥ë¥ß¥ê¥Ð¡¼¥ë¥ß¥ê¥Ð¡¼¥ë¥ß¥ê¥Ð¡¼¥ë¥ß¥ê¥Ð¡¼¥ë¥ß¥ê¥Ð¡¼¥ë¥ß¥ê¥Ð¡¼¥ë¥ß¥ê¥Ð¡¼¥ë¥ß¥ê¥Ð¡¼¥ë¥ß¥ê¥Ð¡¼¥ë¥ß¥ê¥Ð¡¼¥ë¥ß¥ê¥Ð¡¼¥ë¥ß¥ê¥Ð¡¼¥ë¥ß¥ê¥Ð¡¼¥ë¥ß¥ê¥Ð¡¼¥ë¥ß¥ê¥Ð¡¼¥ë¥ß¥ê¥Ð¡¼¥ë¥ß¥ê¥Ð¡¼¥ë¥ß¥ê¥Ð¡¼¥ë¥ß¥ê¥Ð¡¼¥ë(¡ë§¥¡ë) ---- FAILED ================================================================================ 001- ¥ß¥ê¥Ð¡¼¥ë¥ß¥ê¥Ð¡¼¥ë¥ß¥ê¥Ð¡¼¥ë¥ß¥ê¥Ð¡¼¥ë¥ß¥ê¥Ð¡¼¥ë¥ß¥ê¥Ð¡¼¥ë¥ß¥ê¥Ð¡¼¥ë¥ß¥ê¥Ð¡¼¥ë¥ß¥ê¥Ð¡¼¥ë¥ß¥ê¥Ð¡¼¥ë¥ß¥ê¥Ð¡¼¥ë¥ß¥ê¥Ð¡¼¥ë¥ß¥ê¥Ð¡¼¥ë¥ß¥ê¥Ð¡¼¥ë¥ß¥ê¥Ð¡¼¥ë¥ß¥ê¥Ð¡¼¥ë¥ß¥ê¥Ð¡¼¥ë¥ß¥ê¥Ð¡¼¥ë¥ß¥ê¥Ð¡¼¥ë¥ß¥ê¥Ð¡¼¥ë¥ß¥ê¥Ð¡¼¥ë¥ß¥ê¥Ð¡¼¥ë¥ß¥ê¥Ð¡¼¥ë¥ß¥ê¥Ð¡¼¥ë¥ß¥ê¥Ð¡¼¥ë¥ß¥ê¥Ð¡¼¥ë¥ß¥ê¥Ð¡¼¥ë¥ß¥ê¥Ð¡¼¥ë¥ß¥ê¥Ð¡¼¥ë¥ß¥ê¥Ð¡¼¥ë¥ß¥ê¥Ð¡¼¥ë¥ß¥ê¥Ð¡¼¥ë¥ß¥ê¥Ð¡¼¥ë¥ß¥ê¥Ð¡¼¥ë¥ß¥ê¥Ð¡¼¥ë¥ß¥ê¥Ð¡¼¥ë¥ß¥ê¥Ð¡¼¥ë¥ß¥ê¥Ð¡¼¥ë¥ß¥ê¥Ð¡¼¥ë¥ß¥ê¥Ð¡¼¥ë(¡ë§¥¡ë) 001+ ¥ß¥ê¥Ð¡¼¥ë¥ß¥ê¥Ð¡¼¥ë¥ß¥ê¥Ð¡¼¥ë¥ß¥ê¥Ð¡¼¥ë¥ß¥ê¥Ð¡¼¥ë¥ß¥ê¥Ð¡¼¥ë¥ß¥ê¥Ð¡¼¥ë¥ß¥ê¥Ð¡¼¥ë¥ß¥ê¥Ð¡¼¥ë¥ß¥ê¥Ð¡¼¥ë¥ß¥ê¥Ð¡¼¥ë¥ß¥ß¥ê¥Ð¡¼¥ë¥ß¥ê¥Ð¡¼¥ë¥ß¥ê¥Ð¡¼¥ë¥ß¥ê¥Ð¡¼¥ë¥ß¥ê¥Ð¡¼¥ë¥ß¥ê¥Ð¡¼¥ë¥ß¥ê¥Ð¡¼¥ë¥ß¥ê¥Ð¡¼¥ë¥ß¥ê¥Ð¡¼¥ë¥ß¥ê¥Ð¡¼¥ë¥ß¥ê¥Ð¡¼¥ë¥ß¥ê¥Ð¡¼¥ë¥ß¥ê¥Ð¡¼¥ë¥ß¥ê¥Ð¡¼¥ë¥ß¥ê¥Ð¡¼¥ë¥ß¥ê¥Ð¡¼¥ë¥ß¥ê¥Ð¡¼¥ë¥ß¥ê¥Ð¡¼¥ë¥ß¥ê¥Ð¡¼¥ë¥ß¥ê¥Ð¡¼¥ë¥ß¥ê¥Ð¡¼¥ë¥ß¥ê¥Ð¡¼¥ë¥ß¥ê¥Ð¡¼¥ë¥ß¥ê¥Ð¡¼¥ë¥ß¥ê¥Ð¡¼¥ë¥ß¥ê¥Ð¡¼¥ë¥ß¥ê¥Ð¡¼¥ë¥ß¥ê¥Ð¡¼¥ë¥ß¥ê¥Ð¡¼¥ë(¡ë§¥¡ë) ================================================================================ ================================================================================ /usr/src/downloads/php-4.4.5/ext/session/tests/007.phpt ================================================================================ ---- EXPECTED OUTPUT float(3.14) array(1) { ["c"]=> &float(3.14) } float(3.14) array(1) { ["c"]=> &float(3.14) } ---- ACTUAL OUTPUT ---- FAILED ================================================================================ 001- float(3.14) 001+ 002- array(1) { 003- ["c"]=> 004- &float(3.14) 005- } 006- float(3.14) 007- array(1) { 008- ["c"]=> 009- &float(3.14) 010- } ================================================================================ ================================================================================ /usr/src/downloads/php-4.4.5/ext/session/tests/019.phpt ================================================================================ ---- EXPECTED OUTPUT array(2) { ["o1"]=> &object(tfoo)(1) { ["c"]=> int(42) } ["o2"]=> &object(tfoo)(1) { ["c"]=> int(42) } } array(2) { ["o1"]=> &object(tfoo)(1) { ["c"]=> int(44) } ["o2"]=> &object(tfoo)(1) { ["c"]=> int(44) } } ---- ACTUAL OUTPUT ---- FAILED ================================================================================ 001- array(2) { 001+ 002- ["o1"]=> 003- &object(tfoo)(1) { 004- ["c"]=> 005- int(42) 006- } 007- ["o2"]=> 008- &object(tfoo)(1) { 009- ["c"]=> 010- int(42) 011- } 012- } 013- array(2) { 014- ["o1"]=> 015- &object(tfoo)(1) { 016- ["c"]=> 017- int(44) 018- } 019- ["o2"]=> 020- &object(tfoo)(1) { 021- ["c"]=> 022- int(44) 023- } 024- } ================================================================================ ================================================================================ /usr/src/downloads/php-4.4.5/ext/session/tests/bug31454.phpt ================================================================================ ---- EXPECTED OUTPUT Warning: session_set_save_handler() [/phpmanual/function.session-set-save-handler.html]: Argument 1 is not a valid callback in %sbug31454.php on line %d Done ---- ACTUAL OUTPUT Notice: Undefined variable: arf in /usr/src/downloads/php-4.4.5/ext/session/tests/bug31454.php on line 4 Warning: session_set_save_handler() [/phpmanual/function.session-set-save-handler.html]: Argument 1 is not a valid callback in /usr/src/downloads/php-4.4.5/ext/session/tests/bug31454.php on line 9 Done ---- FAILED ================================================================================ 001- Warning: session_set_save_handler() [/phpmanual/function.session-set-save-handler.html]: Argument 1 is not a valid callback in %sbug31454.php on line %d 001+ Notice: Undefined variable: arf in /usr/src/downloads/php-4.4.5/ext/session/tests/bug31454.php on line 4 002- Done 002+ 003+ Warning: session_set_save_handler() [/phpmanual/function.session-set-save-handler.html]: Argument 1 is not a valid callback in /usr/src/downloads/php-4.4.5/ext/session/tests/bug31454.php on line 9 004+ Done ================================================================================ ================================================================================ /usr/src/downloads/php-4.4.5/ext/standard/tests/file/bug22414.phpt ================================================================================ ---- EXPECTED OUTPUT HELLO Works ---- ACTUAL OUTPUT HELLO sh: /usr/local/php/bin/php: No such file or directory Does not work ---- FAILED ================================================================================ 002- Works 002+ sh: /usr/local/php/bin/php: No such file or directory 003+ Does not work ================================================================================ ================================================================================ /usr/src/downloads/php-4.4.5/ext/standard/tests/serialize/bug28325.phpt ================================================================================ ---- EXPECTED OUTPUT object(a)(1) { ["b"]=> object(b)(1) { ["c"]=> object(c)(1) { ["d"]=> object(a)(1) { ["b"]=> object(b)(1) { ["c"]=> object(c)(1) { ["d"]=> NULL } } } } } } ---- ACTUAL OUTPUT object(a)(1) { ["b"]=> object(b)(1) { ["c"]=> object(c)(1) { ["d"]=> object(a)(1) { ["b"]=> object(b)(1) { ["c"]=> object(c)(1) { ["d"]=> *RECURSION* } } } } } } ---- FAILED ================================================================================ 013- NULL 013+ *RECURSION* ================================================================================ ================================================================================ BUILD ENVIRONMENT ================================================================================ OS: Linux - Linux test 2.6.16 #1 Tue May 30 23:32:07 MSD 2006 i686 Automake: automake (GNU automake) 1.9.2 Written by Tom Tromey <tromey@redhat.com>. Copyright 2004 Free Software Foundation, Inc. This is free software; see the source for copying conditions. There is NO warranty; not even for MERCHANTABILITY or FITNESS FOR A PARTICULAR PURPOSE. Autoconf: autoconf (GNU Autoconf) 2.59 Written by David J. MacKenzie and Akim Demaille. Copyright (C) 2003 Free Software Foundation, Inc. This is free software; see the source for copying conditions. There is NO warranty; not even for MERCHANTABILITY or FITNESS FOR A PARTICULAR PURPOSE. Libtool: ltmain.sh (GNU libtool) 1.4.3 (1.922.2.111 2002/10/23 02:54:36) Compiler: Reading specs from /usr/lib/gcc/i386-redhat-linux/3.4.6/specs Configured with: ../configure --prefix=/usr --mandir=/usr/share/man --infodir=/usr/share/info --enable-shared --enable-threads=posix --disable-checking --with-system-zlib --enable-__cxa_atexit --disable-libunwind-exceptions --enable-java-awt=gtk --host=i386-redhat-linux Thread model: posix gcc version 3.4.6 20060404 (Red Hat 3.4.6-3) Bison: bison (GNU Bison) 1.875c Written by Robert Corbett and Richard Stallman. Copyright (C) 2003 Free Software Foundation, Inc. This is free software; see the source for copying conditions. There is NO warranty; not even for MERCHANTABILITY or FITNESS FOR A PARTICULAR PURPOSE. Libraries: linux-gate.so.1 => (0xffffe000) libcrypt.so.1 => /lib/libcrypt.so.1 (0x4783c000) libc-client.so.0 => /usr/lib/libc-client.so.0 (0xb7ed9000) libmysqlclient.so.14 => /usr/lib/mysql/libmysqlclient.so.14 (0x45e9c000) libmcrypt.so.4 => /usr/local/lib/libmcrypt.so.4 (0xb7ed4000) libdl.so.2 => /lib/libdl.so.2 (0x477d6000) libltdl.so.3 => /usr/lib/libltdl.so.3 (0x47801000) libldap-2.2.so.7 => /usr/lib/libldap-2.2.so.7 (0xb7ea2000) liblber-2.2.so.7 => /usr/lib/liblber-2.2.so.7 (0x47b63000) libpam.so.0 => /lib/libpam.so.0 (0x47813000) libfreetype.so.6 => /usr/lib/libfreetype.so.6 (0xb7e44000) libz.so.1 => /usr/lib/libz.so.1 (0xb7e34000) libX11.so.6 => /usr/X11R6/lib/libX11.so.6 (0x4d468000) libXpm.so.4 => /usr/X11R6/lib/libXpm.so.4 (0x4d5e8000) libpng12.so.0 => /usr/lib/libpng12.so.0 (0x47a97000) libjpeg.so.62 => /usr/lib/libjpeg.so.62 (0xb7e15000) libcurl.so.3 => /usr/lib/libcurl.so.3 (0xb7de5000) libbz2.so.1 => /usr/lib/libbz2.so.1 (0x47a4a000) libresolv.so.2 => /lib/libresolv.so.2 (0x47827000) libm.so.6 => /lib/tls/libm.so.6 (0x477dc000) libnsl.so.1 => /lib/libnsl.so.1 (0x4786c000) libgssapi_krb5.so.2 => /usr/lib/libgssapi_krb5.so.2 (0x479fe000) libkrb5.so.3 => /usr/lib/libkrb5.so.3 (0x47889000) libk5crypto.so.3 => /usr/lib/libk5crypto.so.3 (0x479db000) libcom_err.so.2 => /lib/libcom_err.so.2 (0x47884000) libssl.so.4 => /lib/libssl.so.4 (0x45e66000) libcrypto.so.4 => /lib/libcrypto.so.4 (0x45d7b000) libidn.so.11 => /usr/lib/libidn.so.11 (0xb7db3000) libc.so.6 => /lib/tls/libc.so.6 (0x476a9000) /lib/ld-linux.so.2 (0x47690000) libsasl2.so.2 => /usr/lib/libsasl2.so.2 (0xb7d9f000) libaudit.so.0 => /lib/libaudit.so.0 (0x47ad1000) libXext.so.6 => /usr/X11R6/lib/libXext.so.6 (0x4d549000) User's E-mail: balrog at info-srv dot ru ================================================================================ PHPINFO ================================================================================ phpinfo() PHP Version => 4.4.5 System => Linux test 2.6.16 #1 Tue May 30 23:32:07 MSD 2006 i686 Build Date => Feb 19 2007 20:04:50 Configure Command => './configure' '--with-apxs' '--enable-track-vars' '--enable-force-cgi-redirect' '--with-gettext' '--enable-safe-mode' '--enable-ftp' '--enable-pcntl' '--with-zlib' '--with-bz2' '--with-gd' '--with-jpeg-dir=/usr' '--with-xpm-dir=/usr' '--with-curl' '--with-openssl' '--with-ldap' '--with-iconv' '--enable-dbase' '--with-mysql=/usr' '--with-ttf' '--with-freetype-dir=/usr' '--with-mod_charset' '--enable-mbstring=all' '--enable-sockets' '--with-imap' '--with-config-file-path=/etc/httpd/' '--with-kerberos' '--with-imap-ssl' '--with-mcrypt=/usr/local/lib' Server API => Command Line Interface Virtual Directory Support => disabled Configuration File (php.ini) Path => /usr/local/Zend/etc/php.ini PHP API => 20020918 PHP Extension => 20020429 Zend Extension => 20050606 Debug Build => no Zend Memory Manager => enabled Thread Safety => disabled Registered PHP Streams => php, http, ftp, https, ftps, compress.bzip2, compress.zlib This program makes use of the Zend Scripting Language Engine: Zend Engine v1.3.0, Copyright (c) 1998-2004 Zend Technologies with Zend Extension Manager v1.0.9, Copyright (c) 2003-2006, by Zend Technologies with Zend Optimizer v2.6.1, Copyright (c) 1998-2006, by Zend Technologies with Zend Debugger v5.1.0, Copyright (c) 1999-2006, by Zend Technologies _______________________________________________________________________ Configuration PHP Core Directive => Local Value => Master Value allow_call_time_pass_reference => On => On allow_url_fopen => On => On always_populate_raw_post_data => Off => Off arg_separator.input => & => & arg_separator.output => & => & asp_tags => Off => Off auto_append_file => no value => no value auto_prepend_file => no value => no value browscap => no value => no value default_charset => no value => no value default_mimetype => text/html => text/html define_syslog_variables => Off => Off disable_classes => no value => no value disable_functions => no value => no value display_errors => On => On display_startup_errors => Off => Off doc_root => no value => no value docref_ext => no value => no value docref_root => no value => no value enable_dl => On => On error_append_string => no value => no value error_log => no value => no value error_prepend_string => no value => no value error_reporting => 2039 => 2039 expose_php => On => On extension_dir => ./ => ./ file_uploads => On => On gpc_order => GPC => GPC highlight.bg => #FFFFFF => #FFFFFF highlight.comment => #FF8000 => #FF8000 highlight.default => #0000BB => #0000BB highlight.html => #000000 => #000000 highlight.keyword => #007700 => #007700 highlight.string => #DD0000 => #DD0000 html_errors => Off => On ignore_repeated_errors => Off => Off ignore_repeated_source => Off => Off ignore_user_abort => Off => Off implicit_flush => On => Off include_path => .:/usr/local/lib/php => .:/usr/local/lib/php log_errors => Off => Off log_errors_max_len => 1024 => 1024 magic_quotes_gpc => On => On magic_quotes_runtime => Off => Off magic_quotes_sybase => Off => Off max_execution_time => 0 => 60 max_input_time => 60 => 60 open_basedir => no value => no value output_buffering => 0 => no value output_handler => no value => no value post_max_size => 8M => 8M precision => 12 => 12 register_argc_argv => On => On register_globals => Off => Off report_memleaks => On => On safe_mode => Off => Off safe_mode_exec_dir => no value => no value safe_mode_gid => Off => Off safe_mode_include_dir => no value => no value sendmail_from => no value => no value sendmail_path => /usr/sbin/sendmail -t -i => /usr/sbin/sendmail -t -i serialize_precision => 100 => 100 short_open_tag => On => On SMTP => localhost => localhost smtp_port => 25 => 25 sql.safe_mode => Off => Off track_errors => Off => Off unserialize_callback_func => no value => no value upload_max_filesize => 2M => 2M upload_tmp_dir => no value => no value user_dir => no value => no value variables_order => EGPCS => EGPCS xmlrpc_error_number => 0 => 0 xmlrpc_errors => Off => Off y2k_compliance => On => On Zend Debugger Expose Zend Debugger => allowed hosts only Passive Mode Timeout => 20 seconds Connector PID => -1 Directive => Local Value => Master Value zend_debugger.allow_hosts => 127.0.0.1/32,0.0.0.0/0 => 127.0.0.1/32,0.0.0.0/0 zend_debugger.allow_tunnel => 127.0.0.1/32 => 127.0.0.1/32 zend_debugger.connect_password => no value => no value zend_debugger.deny_hosts => no value => no value zend_debugger.httpd_uid => 502 => 502 zend_debugger.max_msg_size => 2097152 => 2097152 Zend Optimizer Optimization Pass 1 => enabled Optimization Pass 2 => enabled Optimization Pass 3 => enabled Optimization Pass 4 => enabled Optimization Pass 9 => enabled Zend Loader => enabled License Path => bz2 BZip2 Support => Enabled BZip2 Version => 1.0.2, 30-Dec-2001 ctype ctype functions => enabled curl CURL support => enabled CURL Information => libcurl/7.12.1 OpenSSL/0.9.7a zlib/1.2.1.2 libidn/0.5.6 ftp FTP support => enabled gd GD Support => enabled GD Version => bundled (2.0.28 compatible) FreeType Support => enabled FreeType Linkage => with freetype GIF Read Support => enabled GIF Create Support => enabled JPG Support => enabled PNG Support => enabled WBMP Support => enabled XBM Support => enabled gettext GetText Support => enabled iconv iconv support => enabled iconv implementation => glibc iconv library version => 2.3.4 Directive => Local Value => Master Value iconv.input_encoding => ISO-8859-1 => ISO-8859-1 iconv.internal_encoding => ISO-8859-1 => ISO-8859-1 iconv.output_encoding => ISO-8859-1 => ISO-8859-1 imap IMAP c-Client Version => 2001 SSL Support => enabled Kerberos Support => enabled ldap LDAP Support => enabled RCS Version => $Id: ldap.c,v 1.130.2.13.2.2 2007/01/01 09:46:44 sebastian Exp $ Total Links => 0/unlimited API Version => 3001 Vendor Name => OpenLDAP Vendor Version => 20213 mbstring Multibyte Support => enabled Japanese support => enabled Simplified chinese support => enabled Traditional chinese support => enabled Korean support => enabled Russian support => enabled Multibyte (japanese) regex support => enabled mbstring extension makes use of "streamable kanji code filter and converter", which is distributed under the GNU Lesser General Public License version 2.1. Directive => Local Value => Master Value mbstring.detect_order => no value => no value mbstring.encoding_translation => Off => Off mbstring.func_overload => 0 => 0 mbstring.http_input => pass => pass mbstring.http_output => pass => pass mbstring.internal_encoding => ISO-8859-1 => no value mbstring.language => neutral => neutral mbstring.substitute_character => no value => no value mcrypt mcrypt support => enabled version => >= 2.4.x Supported ciphers => rijndael-192 twofish saferplus enigma blowfish-compat safer-sk128 safer-sk64 blowfish tripledes rc2 arcfour threeway rijndael-256 wake loki97 cast-256 rijndael-128 des cast-128 gost serpent xtea Supported modes => nofb ecb cbc ofb ctr stream cfb ncfb Directive => Local Value => Master Value mcrypt.algorithms_dir => no value => no value mcrypt.modes_dir => no value => no value mysql MySQL Support => enabled Active Persistent Links => 0 Active Links => 0 Client API version => 4.1.20 MYSQL_MODULE_TYPE => external MYSQL_SOCKET => /var/lib/mysql/mysql.sock MYSQL_INCLUDE => -I/usr/include/mysql MYSQL_LIBS => -L/usr/lib/mysql -lmysqlclient Directive => Local Value => Master Value mysql.allow_persistent => On => On mysql.connect_timeout => 60 => 60 mysql.default_host => no value => no value mysql.default_password => no value => no value mysql.default_port => no value => no value mysql.default_socket => no value => no value mysql.default_user => no value => no value mysql.max_links => Unlimited => Unlimited mysql.max_persistent => Unlimited => Unlimited mysql.trace_mode => Off => Off openssl OpenSSL support => enabled OpenSSL Version => OpenSSL 0.9.7a Feb 19 2003 overload User-Space Object Overloading Support => enabled pcntl pcntl support => enabled pcre PCRE (Perl Compatible Regular Expressions) Support => enabled PCRE Library Version => 6.7 04-Jul-2006 posix Revision => $Revision: 1.51.2.4.2.3 $ session Session Support => enabled Registered save handlers => files user Directive => Local Value => Master Value session.auto_start => Off => Off session.bug_compat_42 => On => On session.bug_compat_warn => On => On session.cache_expire => 180 => 180 session.cache_limiter => nocache => nocache session.cookie_domain => no value => no value session.cookie_lifetime => 0 => 0 session.cookie_path => / => / session.cookie_secure => Off => Off session.entropy_file => no value => no value session.entropy_length => 0 => 0 session.gc_divisor => 100 => 100 session.gc_maxlifetime => 1440 => 1440 session.gc_probability => 1 => 1 session.name => PHPSESSID => PHPSESSID session.referer_check => no value => no value session.save_handler => files => files session.save_path => /tmp => /tmp session.serialize_handler => php => php session.use_cookies => On => On session.use_only_cookies => Off => Off session.use_trans_sid => Off => Off sockets Sockets Support => enabled standard Regex Library => Bundled library enabled Dynamic Library Support => enabled Path to sendmail => /usr/sbin/sendmail -t -i Directive => Local Value => Master Value assert.active => 1 => 1 assert.bail => 0 => 0 assert.callback => no value => no value assert.quiet_eval => 0 => 0 assert.warning => 1 => 1 auto_detect_line_endings => 0 => 0 default_socket_timeout => 60 => 60 safe_mode_allowed_env_vars => PHP_ => PHP_ safe_mode_protected_env_vars => LD_LIBRARY_PATH => LD_LIBRARY_PATH url_rewriter.tags => a=href,area=href,frame=src,input=src,form=,fieldset= => a=href,area=href,frame=src,input=src,form=,fieldset= user_agent => no value => no value tokenizer Tokenizer Support => enabled xml XML Support => active XML Namespace Support => active EXPAT Version => 1.95.6 zlib ZLib Support => enabled Compiled Version => 1.2.1.2 Linked Version => 1.2.1.2 Directive => Local Value => Master Value zlib.output_compression => Off => Off zlib.output_compression_level => -1 => -1 zlib.output_handler => no value => no value Additional Modules Module Name dbase Environment Variable => Value LC_PAPER => ru_RU.cp1251 LC_ADDRESS => ru_RU.cp1251 HOSTNAME => test LC_MONETARY => ru_RU.cp1251 TEST_PHP_SRCDIR => /usr/src/downloads/php-4.4.5 SHELL => /bin/sh TERM => xterm MAKEFLAGS => HISTSIZE => 1000 LC_NUMERIC => C LC_ALL => en_US.UTF-8 USER => root LS_COLORS => no=00:fi=00:di=00;34:ln=00;36:pi=40;33:so=00;35:bd=40;33;01:cd=40;33;01:or=01;05;37;41:mi=01;05;37;41:ex=00;32:*.cmd=00;32:*.exe=00;32:*.com=00;32:*.btm=00;32:*.bat=00;32:*.sh=00;32:*.csh=00;32:*.tar=00;31:*.tgz=00;31:*.arj=00;31:*.taz=00;31:*.lzh=00;31:*.zip=00;31:*.z=00;31:*.Z=00;31:*.gz=00;31:*.bz2=00;31:*.bz=00;31:*.tz=00;31:*.rpm=00;31:*.cpio=00;31:*.jpg=00;35:*.gif=00;35:*.bmp=00;35:*.xbm=00;35:*.xpm=00;35:*.png=00;35:*.tif=00;35: LC_TELEPHONE => ru_RU.cp1251 SCRIPT_FILENAME => MAKELEVEL => 1 MFLAGS => MC_TMPDIR => /tmp/mc-root PATH => /usr/kerberos/sbin:/usr/kerberos/bin:/usr/local/sbin:/usr/local/bin:/sbin:/bin:/usr/sbin:/usr/bin:/usr/X11R6/bin:/root/bin:/bin:/sbin:/usr/bin:/usr/sbin:/usr/local/bin:/usr/local/sbin:/usr/local/apache/bin MAIL => /var/spool/mail/root LC_MESSAGES => ru_RU.cp1251 _ => /usr/src/downloads/php-4.4.5/sapi/cli/php LC_COLLATE => ru_RU.cp1251 LC_IDENTIFICATION => ru_RU.cp1251 PWD => /usr/src/downloads/php-4.4.5 INPUTRC => /etc/inputrc LANG => ru_RU.CP1251 TEST_PHP_EXECUTABLE => /usr/src/downloads/php-4.4.5/sapi/cli/php REDIRECT_STATUS => LC_MEASUREMENT => ru_RU.cp1251 PATH_TRANSLATED => HISTCONTROL => ignorespace HOME => /root SHLVL => 4 CONTENT_LENGTH => MC_SID => 8153 LOGNAME => root QUERY_STRING => LC_CTYPE => ru_RU.cp1251 LESSOPEN => |/usr/bin/lesspipe.sh %s CONTENT_TYPE => CC => gcc REQUEST_METHOD => LC_TIME => ru_RU.cp1251 G_BROKEN_FILENAMES => 1 LC_NAME => ru_RU.cp1251 PHP Variables Variable => Value _SERVER["LC_PAPER"] => ru_RU.cp1251 _SERVER["LC_ADDRESS"] => ru_RU.cp1251 _SERVER["HOSTNAME"] => test _SERVER["LC_MONETARY"] => ru_RU.cp1251 _SERVER["TEST_PHP_SRCDIR"] => /usr/src/downloads/php-4.4.5 _SERVER["SHELL"] => /bin/sh _SERVER["TERM"] => xterm _SERVER["MAKEFLAGS"] => _SERVER["HISTSIZE"] => 1000 _SERVER["LC_NUMERIC"] => C _SERVER["LC_ALL"] => en_US.UTF-8 _SERVER["USER"] => root _SERVER["LS_COLORS"] => no=00:fi=00:di=00;34:ln=00;36:pi=40;33:so=00;35:bd=40;33;01:cd=40;33;01:or=01;05;37;41:mi=01;05;37;41:ex=00;32:*.cmd=00;32:*.exe=00;32:*.com=00;32:*.btm=00;32:*.bat=00;32:*.sh=00;32:*.csh=00;32:*.tar=00;31:*.tgz=00;31:*.arj=00;31:*.taz=00;31:*.lzh=00;31:*.zip=00;31:*.z=00;31:*.Z=00;31:*.gz=00;31:*.bz2=00;31:*.bz=00;31:*.tz=00;31:*.rpm=00;31:*.cpio=00;31:*.jpg=00;35:*.gif=00;35:*.bmp=00;35:*.xbm=00;35:*.xpm=00;35:*.png=00;35:*.tif=00;35: _SERVER["LC_TELEPHONE"] => ru_RU.cp1251 _SERVER["SCRIPT_FILENAME"] => _SERVER["MAKELEVEL"] => 1 _SERVER["MFLAGS"] => _SERVER["MC_TMPDIR"] => /tmp/mc-root _SERVER["PATH"] => /usr/kerberos/sbin:/usr/kerberos/bin:/usr/local/sbin:/usr/local/bin:/sbin:/bin:/usr/sbin:/usr/bin:/usr/X11R6/bin:/root/bin:/bin:/sbin:/usr/bin:/usr/sbin:/usr/local/bin:/usr/local/sbin:/usr/local/apache/bin _SERVER["MAIL"] => /var/spool/mail/root _SERVER["LC_MESSAGES"] => ru_RU.cp1251 _SERVER["_"] => /usr/src/downloads/php-4.4.5/sapi/cli/php _SERVER["LC_COLLATE"] => ru_RU.cp1251 _SERVER["LC_IDENTIFICATION"] => ru_RU.cp1251 _SERVER["PWD"] => /usr/src/downloads/php-4.4.5 _SERVER["INPUTRC"] => /etc/inputrc _SERVER["LANG"] => ru_RU.CP1251 _SERVER["TEST_PHP_EXECUTABLE"] => /usr/src/downloads/php-4.4.5/sapi/cli/php _SERVER["REDIRECT_STATUS"] => _SERVER["LC_MEASUREMENT"] => ru_RU.cp1251 _SERVER["PATH_TRANSLATED"] => _SERVER["HISTCONTROL"] => ignorespace _SERVER["HOME"] => /root _SERVER["SHLVL"] => 4 _SERVER["CONTENT_LENGTH"] => _SERVER["MC_SID"] => 8153 _SERVER["LOGNAME"] => root _SERVER["QUERY_STRING"] => _SERVER["LC_CTYPE"] => ru_RU.cp1251 _SERVER["LESSOPEN"] => |/usr/bin/lesspipe.sh %s _SERVER["CONTENT_TYPE"] => _SERVER["CC"] => gcc _SERVER["REQUEST_METHOD"] => _SERVER["LC_TIME"] => ru_RU.cp1251 _SERVER["G_BROKEN_FILENAMES"] => 1 _SERVER["LC_NAME"] => ru_RU.cp1251 _SERVER["PHP_SELF"] => _SERVER["SCRIPT_NAME"] => _SERVER["DOCUMENT_ROOT"] => _SERVER["argv"] => Array ( ) _SERVER["argc"] => 0 _ENV["LC_PAPER"] => ru_RU.cp1251 _ENV["LC_ADDRESS"] => ru_RU.cp1251 _ENV["HOSTNAME"] => test _ENV["LC_MONETARY"] => ru_RU.cp1251 _ENV["TEST_PHP_SRCDIR"] => /usr/src/downloads/php-4.4.5 _ENV["SHELL"] => /bin/sh _ENV["TERM"] => xterm _ENV["MAKEFLAGS"] => _ENV["HISTSIZE"] => 1000 _ENV["LC_NUMERIC"] => C _ENV["LC_ALL"] => en_US.UTF-8 _ENV["USER"] => root _ENV["LS_COLORS"] => no=00:fi=00:di=00;34:ln=00;36:pi=40;33:so=00;35:bd=40;33;01:cd=40;33;01:or=01;05;37;41:mi=01;05;37;41:ex=00;32:*.cmd=00;32:*.exe=00;32:*.com=00;32:*.btm=00;32:*.bat=00;32:*.sh=00;32:*.csh=00;32:*.tar=00;31:*.tgz=00;31:*.arj=00;31:*.taz=00;31:*.lzh=00;31:*.zip=00;31:*.z=00;31:*.Z=00;31:*.gz=00;31:*.bz2=00;31:*.bz=00;31:*.tz=00;31:*.rpm=00;31:*.cpio=00;31:*.jpg=00;35:*.gif=00;35:*.bmp=00;35:*.xbm=00;35:*.xpm=00;35:*.png=00;35:*.tif=00;35: _ENV["LC_TELEPHONE"] => ru_RU.cp1251 _ENV["SCRIPT_FILENAME"] => _ENV["MAKELEVEL"] => 1 _ENV["MFLAGS"] => _ENV["MC_TMPDIR"] => /tmp/mc-root _ENV["PATH"] => /usr/kerberos/sbin:/usr/kerberos/bin:/usr/local/sbin:/usr/local/bin:/sbin:/bin:/usr/sbin:/usr/bin:/usr/X11R6/bin:/root/bin:/bin:/sbin:/usr/bin:/usr/sbin:/usr/local/bin:/usr/local/sbin:/usr/local/apache/bin _ENV["MAIL"] => /var/spool/mail/root _ENV["LC_MESSAGES"] => ru_RU.cp1251 _ENV["_"] => /usr/src/downloads/php-4.4.5/sapi/cli/php _ENV["LC_COLLATE"] => ru_RU.cp1251 _ENV["LC_IDENTIFICATION"] => ru_RU.cp1251 _ENV["PWD"] => /usr/src/downloads/php-4.4.5 _ENV["INPUTRC"] => /etc/inputrc _ENV["LANG"] => ru_RU.CP1251 _ENV["TEST_PHP_EXECUTABLE"] => /usr/src/downloads/php-4.4.5/sapi/cli/php _ENV["REDIRECT_STATUS"] => _ENV["LC_MEASUREMENT"] => ru_RU.cp1251 _ENV["PATH_TRANSLATED"] => _ENV["HISTCONTROL"] => ignorespace _ENV["HOME"] => /root _ENV["SHLVL"] => 4 _ENV["CONTENT_LENGTH"] => _ENV["MC_SID"] => 8153 _ENV["LOGNAME"] => root _ENV["QUERY_STRING"] => _ENV["LC_CTYPE"] => ru_RU.cp1251 _ENV["LESSOPEN"] => |/usr/bin/lesspipe.sh %s _ENV["CONTENT_TYPE"] => _ENV["CC"] => gcc _ENV["REQUEST_METHOD"] => _ENV["LC_TIME"] => ru_RU.cp1251 _ENV["G_BROKEN_FILENAMES"] => 1 _ENV["LC_NAME"] => ru_RU.cp1251 PHP License This program is free software; you can redistribute it and/or modify it under the terms of the PHP License as published by the PHP Group and included in the distribution in the file: LICENSE This program is distributed in the hope that it will be useful, but WITHOUT ANY WARRANTY; without even the implied warranty of MERCHANTABILITY or FITNESS FOR A PARTICULAR PURPOSE. If you did not receive a copy of the PHP license, or have any questions about PHP licensing, please contact license@php.net.

« previous php.qa (#27274) next »