Test results for 4.4.6 [failed]

From: Date: Mon, 05 Mar 2007 20:57:41 +0000
Subject: Test results for 4.4.6 [failed]
Groups: php.qa 
Request: Send a blank email to php-qa+get-27570@lists.php.net to get a copy of this message
===================================================================== FAILED TEST SUMMARY --------------------------------------------------------------------- Error message handling (with ZendOptimizer) [tests/run-test/test008.phpt] Bug #12647 (Locale settings affecting float parsing) [tests/lang/034.phpt] Bug #28377 (debug_backtrace is intermittently passing args) [tests/lang/bug28377.phpt] Bug #35239 (Objects can lose references) [tests/lang/bug35239.phpt] Bug #24155 (gdImageRotate270 rotation problem). [ext/gd/tests/bug24155.phpt] Bug #27582 (ImageFillToBorder() on alphablending image looses alpha on fill color) [ext/gd/tests/bug27582_1.phpt] bug #31454 (session_set_save_handler crashes PHP when supplied non-existent object ref) [ext/session/tests/bug31454.phpt] Bug #28325 (Problem in serialisation of circular references) [ext/standard/tests/serialize/bug28325.phpt] ===================================================================== ===================================================================== TEST RESULT SUMMARY --------------------------------------------------------------------- Exts skipped : 68 Exts tested : 24 --------------------------------------------------------------------- Number of tests : 632 Tests skipped : 170 (26.9%) Tests warned : 0 (0.0%) Tests failed : 8 (1.3%) Tests passed : 454 (71.8%) --------------------------------------------------------------------- Time taken : 175 seconds ===================================================================== ================================================================================ /home/admin/php-4.4.6/tests/run-test/test008.phpt ================================================================================ ---- EXPECTED OUTPUT %s: %sivision by zero in %s on line %d string(1) "1" string(4) "2047" string(1) "0" string(1) "1" string(1) "0" string(%d) "%sivision by zer%s" string(%d) "%sivision by zer%s" ---- ACTUAL OUTPUT string(1) "1" string(4) "2047" string(1) "0" string(1) "1" string(1) "0" string(16) "Division by zero" string(16) "Division by zero" ---- FAILED ================================================================================ 001- %s: %sivision by zero in %s on line %d 001+ string(1) "1" 002- string(1) "1" 002+ string(4) "2047" 003- string(4) "2047" 003+ string(1) "0" 004- string(1) "0" 004+ string(1) "1" 005- string(1) "1" 005+ string(1) "0" 006- string(1) "0" 006+ string(16) "Division by zero" 007- string(%d) "%sivision by zer%s" 007+ string(16) "Division by zero" 008- string(%d) "%sivision by zer%s" ================================================================================ ================================================================================ /home/admin/php-4.4.6/tests/lang/034.phpt ================================================================================ ---- EXPECTED OUTPUT 3,14 ---- ACTUAL OUTPUT 3.14 ---- FAILED ================================================================================ 001- 3,14 001+ 3.14 ================================================================================ ================================================================================ /home/admin/php-4.4.6/tests/lang/bug28377.phpt ================================================================================ ---- EXPECTED OUTPUT dereferenced -- args: 2 direct -- args: 2 ---- ACTUAL OUTPUT dereferenced -- args: 2 direct -- args: does not exist ---- FAILED ================================================================================ 002- direct -- args: 2 002+ direct -- args: does not exist ================================================================================ ================================================================================ /home/admin/php-4.4.6/tests/lang/bug35239.phpt ================================================================================ ---- EXPECTED OUTPUT object(stdClass)(1) { ["x0"]=> &object(stdClass)(3) { ["y0"]=> string(1) "b" ["y1"]=> &object(stdClass)(3) { ["y0"]=> string(1) "b" ["y1"]=> *RECURSION* ["y2"]=> *RECURSION* } ["y2"]=> &object(stdClass)(3) { ["y0"]=> string(1) "b" ["y1"]=> *RECURSION* ["y2"]=> *RECURSION* } } } string(2) "ok" ---- ACTUAL OUTPUT object(stdClass)(1) { ["x0"]=> &object(stdClass)(3) { ["y0"]=> string(1) "b" ["y1"]=> &object(stdClass)(3) { ["y0"]=> string(1) "b" ["y1"]=> *RECURSION* ["y2"]=> *RECURSION* } ["y2"]=> &object(stdClass)(3) { ["y0"]=> string(1) "b" ["y1"]=> *RECURSION* ["y2"]=> *RECURSION* } } } NULL ---- FAILED ================================================================================ 026- string(2) "ok" 026+ NULL ================================================================================ ================================================================================ /home/admin/php-4.4.6/ext/gd/tests/bug24155.phpt ================================================================================ ---- EXPECTED OUTPUT cc867fd65c30883463ce58d0341f0997 ---- ACTUAL OUTPUT 409d70b5d493746acc2255c759d73436 ---- FAILED ================================================================================ 001- cc867fd65c30883463ce58d0341f0997 001+ 409d70b5d493746acc2255c759d73436 ================================================================================ ================================================================================ /home/admin/php-4.4.6/ext/gd/tests/bug27582_1.phpt ================================================================================ ---- EXPECTED OUTPUT 08287f8f5d406946009df5f04ca83dc0 ---- ACTUAL OUTPUT b6d55b399e27b895a1fee8a137bb8470 ---- FAILED ================================================================================ 001- 08287f8f5d406946009df5f04ca83dc0 001+ b6d55b399e27b895a1fee8a137bb8470 ================================================================================ ================================================================================ /home/admin/php-4.4.6/ext/session/tests/bug31454.phpt ================================================================================ ---- EXPECTED OUTPUT Warning: session_set_save_handler() [/phpmanual/function.session-set-save-handler.html]: Argument 1 is not a valid callback in %sbug31454.php on line %d Done ---- ACTUAL OUTPUT Notice: Undefined variable: arf in /home/admin/php-4.4.6/ext/session/tests/bug31454.php on line 4 Warning: session_set_save_handler() [/phpmanual/function.session-set-save-handler.html]: Argument 1 is not a valid callback in /home/admin/php-4.4.6/ext/session/tests/bug31454.php on line 9 Done ---- FAILED ================================================================================ 001- Warning: session_set_save_handler() [/phpmanual/function.session-set-save-handler.html]: Argument 1 is not a valid callback in %sbug31454.php on line %d 001+ Notice: Undefined variable: arf in /home/admin/php-4.4.6/ext/session/tests/bug31454.php on line 4 002- Done 002+ 003+ Warning: session_set_save_handler() [/phpmanual/function.session-set-save-handler.html]: Argument 1 is not a valid callback in /home/admin/php-4.4.6/ext/session/tests/bug31454.php on line 9 004+ Done ================================================================================ ================================================================================ /home/admin/php-4.4.6/ext/standard/tests/serialize/bug28325.phpt ================================================================================ ---- EXPECTED OUTPUT object(a)(1) { ["b"]=> object(b)(1) { ["c"]=> object(c)(1) { ["d"]=> object(a)(1) { ["b"]=> object(b)(1) { ["c"]=> object(c)(1) { ["d"]=> NULL } } } } } } ---- ACTUAL OUTPUT object(a)(1) { ["b"]=> object(b)(1) { ["c"]=> object(c)(1) { ["d"]=> object(a)(1) { ["b"]=> object(b)(1) { ["c"]=> object(c)(1) { ["d"]=> *RECURSION* } } } } } } ---- FAILED ================================================================================ 013- NULL 013+ *RECURSION* ================================================================================ ================================================================================ BUILD ENVIRONMENT ================================================================================ OS: Linux - Linux http0.lancasteronline.com 2.6.9-42.0.2.ELhugemem #1 SMP Wed Aug 23 00:38:38 CDT 2006 i686 Automake: automake (GNU automake) 1.9.2 Written by Tom Tromey <tromey@redhat.com>. Copyright 2004 Free Software Foundation, Inc. This is free software; see the source for copying conditions. There is NO warranty; not even for MERCHANTABILITY or FITNESS FOR A PARTICULAR PURPOSE. Autoconf: autoconf (GNU Autoconf) 2.59 Written by David J. MacKenzie and Akim Demaille. Copyright (C) 2003 Free Software Foundation, Inc. This is free software; see the source for copying conditions. There is NO warranty; not even for MERCHANTABILITY or FITNESS FOR A PARTICULAR PURPOSE. Libtool: ltmain.sh (GNU libtool) 1.4.3 (1.922.2.111 2002/10/23 02:54:36) Compiler: Reading specs from /usr/lib/gcc/i386-redhat-linux/3.4.6/specs Configured with: ../configure --prefix=/usr --mandir=/usr/share/man --infodir=/usr/share/info --enable-shared --enable-threads=posix --disable-checking --with-system-zlib --enable-__cxa_atexit --disable-libunwind-exceptions --enable-java-awt=gtk --host=i386-redhat-linux Thread model: posix gcc version 3.4.6 20060404 (Red Hat 3.4.6-3) Bison: bison (GNU Bison) 1.875c Written by Robert Corbett and Richard Stallman. Copyright (C) 2003 Free Software Foundation, Inc. This is free software; see the source for copying conditions. There is NO warranty; not even for MERCHANTABILITY or FITNESS FOR A PARTICULAR PURPOSE. Libraries: libcrypt.so.1 => /lib/libcrypt.so.1 (0x0028d000) libzzip-0.so.10 => /usr/local/lib/libzzip-0.so.10 (0x00aca000) libz.so.1 => /usr/lib/libz.so.1 (0x00b46000) libmysqlclient.so.14 => /usr/lib/mysql/libmysqlclient.so.14 (0x002de000) libWand.so.10 => /usr/lib/libWand.so.10 (0x00b58000) libpng12.so.0 => /usr/lib/libpng12.so.0 (0x00111000) libcurl.so.3 => /hsphere/shared/lib/libcurl.so.3 (0x00134000) libbz2.so.1 => /usr/lib/libbz2.so.1 (0x00257000) libresolv.so.2 => /lib/libresolv.so.2 (0x00268000) libm.so.6 => /lib/tls/libm.so.6 (0x00a16000) libdl.so.2 => /lib/libdl.so.2 (0x00a3b000) libnsl.so.1 => /lib/libnsl.so.1 (0x00c14000) libssl.so.4 => /lib/libssl.so.4 (0x00414000) libcrypto.so.4 => /lib/libcrypto.so.4 (0x0070b000) libgssapi_krb5.so.2 => /usr/lib/libgssapi_krb5.so.2 (0x00d52000) libkrb5.so.3 => /usr/lib/libkrb5.so.3 (0x00d8b000) libcom_err.so.2 => /lib/libcom_err.so.2 (0x00c0f000) libk5crypto.so.3 => /usr/lib/libk5crypto.so.3 (0x00d68000) libidn.so.11 => /usr/lib/libidn.so.11 (0x00448000) libMagick.so.10 => /usr/lib/libMagick.so.10 (0x00478000) libtiff.so.3 => /usr/lib/libtiff.so.3 (0x04040000) libjpeg.so.62 => /usr/lib/libjpeg.so.62 (0x002bb000) libXext.so.6 => /usr/X11R6/lib/libXext.so.6 (0x00a41000) libSM.so.6 => /usr/X11R6/lib/libSM.so.6 (0x00a51000) libICE.so.6 => /usr/X11R6/lib/libICE.so.6 (0x00a5b000) libX11.so.6 => /usr/X11R6/lib/libX11.so.6 (0x007f4000) libXt.so.6 => /usr/X11R6/lib/libXt.so.6 (0x00646000) libfreetype.so.6 => /usr/lib/libfreetype.so.6 (0x00697000) libc.so.6 => /lib/tls/libc.so.6 (0x008e9000) libpthread.so.0 => /lib/tls/libpthread.so.0 (0x00b22000) /lib/ld-linux.so.2 (0x008d0000) User's E-mail: dbrieck at lnpnews dot com ================================================================================ PHPINFO ================================================================================ phpinfo() PHP Version => 4.4.6 System => Linux http0.lancasteronline.com 2.6.9-42.0.2.ELhugemem #1 SMP Wed Aug 23 00:38:38 CDT 2006 i686 Build Date => Mar 5 2007 15:09:35 Configure Command => './configure' '--with-apxs=/hsphere/shared/apache/bin/apxs' '--with-jpeg-dir=/usr' '--with-png-dir=/usr' '--with-gd' '--with-freetype-dir=/usr/local/include/freetype2' '--with-gettext' '--with-bz2' '--with-zlib' '--with-zip=/usr/local/lib' '--disable-debug' '--enable-sockets' '--enable-track-vars' '--localstatedir=/var/hsphere/php' '--enable-trans-sid' '--enable-ftp' Server API => Command Line Interface Virtual Directory Support => disabled Configuration File (php.ini) Path => /usr/local/Zend/etc/php.ini PHP API => 20020918 PHP Extension => 20020429 Zend Extension => 20050606 Debug Build => no Zend Memory Manager => enabled Thread Safety => disabled Registered PHP Streams => php, http, ftp, compress.bzip2, compress.zlib This program makes use of the Zend Scripting Language Engine: Zend Engine v1.3.0, Copyright (c) 1998-2004 Zend Technologies with Zend Extension Manager v1.2.0, Copyright (c) 2003-2006, by Zend Technologies with Zend Optimizer v3.2.3, Copyright (c) 1998-2006, by Zend Technologies with jobqueue_client wrapper v1.0, Copyright (c) 2004-2007, by Zend Technologies with <b>DISABLED</b> Zend Download Server v1.0.6, Copyright (c) 2003-2005, by Zend Technologies with <b>DISABLED</b> Zend Platform v3.0.0, Copyright (c) 1999-2007, by The Zend Platform presently supports only Apache, ISAPI and FastCGI SAPIs with Zend Debugger v5.2.5, Copyright (c) 1999-2007, by Zend Technologies with mod_cluster wrapper v1.0, Copyright (c) 2004-2005, by Zend Technologies _______________________________________________________________________ Configuration PHP Core Directive => Local Value => Master Value allow_call_time_pass_reference => On => On allow_url_fopen => On => On always_populate_raw_post_data => Off => Off arg_separator.input => & => & arg_separator.output => & => & asp_tags => Off => Off auto_append_file => no value => no value auto_prepend_file => no value => no value browscap => no value => no value default_charset => no value => no value default_mimetype => text/html => text/html define_syslog_variables => Off => Off disable_classes => no value => no value disable_functions => no value => no value display_errors => On => On display_startup_errors => On => On doc_root => no value => no value docref_ext => no value => no value docref_root => no value => no value enable_dl => On => On error_append_string => no value => no value error_log => syslog => syslog error_prepend_string => no value => no value error_reporting => 1 => 1 expose_php => Off => Off extension_dir => ./ => ./ file_uploads => On => On gpc_order => GPC => GPC highlight.bg => #FFFFFF => #FFFFFF highlight.comment => #FF9900 => #FF9900 highlight.default => #0000CC => #0000CC highlight.html => #000000 => #000000 highlight.keyword => #006600 => #006600 highlight.string => #CC0000 => #CC0000 html_errors => Off => On ignore_repeated_errors => Off => Off ignore_repeated_source => Off => Off ignore_user_abort => Off => Off implicit_flush => On => Off include_path => .:/usr/local/lib/php => .:/usr/local/lib/php log_errors => Off => Off log_errors_max_len => 1024 => 1024 magic_quotes_gpc => On => On magic_quotes_runtime => Off => Off magic_quotes_sybase => Off => Off max_execution_time => 0 => 30 max_input_time => -1 => -1 open_basedir => no value => no value output_buffering => 0 => no value output_handler => no value => no value post_max_size => 8M => 8M precision => 14 => 14 register_argc_argv => On => On register_globals => On => On report_memleaks => On => On safe_mode => Off => Off safe_mode_exec_dir => no value => no value safe_mode_gid => Off => Off safe_mode_include_dir => no value => no value sendmail_from => me@localhost.com => me@localhost.com sendmail_path => /usr/sbin/sendmail -t -i => /usr/sbin/sendmail -t -i serialize_precision => 100 => 100 short_open_tag => On => On SMTP => localhost => localhost smtp_port => 25 => 25 sql.safe_mode => Off => Off track_errors => Off => Off unserialize_callback_func => no value => no value upload_max_filesize => 5M => 5M upload_tmp_dir => no value => no value user_dir => no value => no value variables_order => EGPCS => EGPCS xmlrpc_error_number => 0 => 0 xmlrpc_errors => Off => Off y2k_compliance => Off => Off Zend Debugger Expose Zend Debugger => never Passive Mode Timeout => 20 seconds Connector PID => -1 Directive => Local Value => Master Value zend_debugger.allow_hosts => 127.0.0.1/32,72.25.5.70/32,10.1.1.110/32,10.1.1.111/32,10.1.1.199/32,10.1.1.179,10.1.1.159 => 127.0.0.1/32,72.25.5.70/32,10.1.1.110/32,10.1.1.111/32,10.1.1.199/32,10.1.1.179,10.1.1.159 zend_debugger.allow_tunnel => 127.0.0.1/32,72.25.5.70/32,10.1.1.110/32,10.1.1.111/32,10.1.1.199/32,10.1.1.179,10.1.1.159 => 127.0.0.1/32,72.25.5.70/32,10.1.1.110/32,10.1.1.111/32,10.1.1.199/32,10.1.1.179,10.1.1.159 zend_debugger.connect_password => no value => no value zend_debugger.connector_port => 10013 => 10013 zend_debugger.deny_hosts => no value => no value zend_debugger.httpd_uid => 398 => 398 zend_debugger.max_msg_size => 2097152 => 2097152 zend_debugger.tunnel_max_port => 65535 => 65535 zend_debugger.tunnel_min_port => 1024 => 1024 Zend Download Server Download Server => disabled ZDS PID => 0 Directive => Local Value => Master Value zds.disable_byterange => 0 => 0 zds.enable => 1 => 1 zds.log_file => /usr/local/Zend/logs/ZDS.log => /usr/local/Zend/logs/ZDS.log zds.mime_types_file => /usr/local/Zend/etc/zend_mime_types.ini => /usr/local/Zend/etc/zend_mime_types.ini zds.min_file_size => 500 => 500 zds.mmap_chunk => 256 => 256 zds.nice => 10 => 10 Zend Optimizer Optimization Pass 1 => enabled Optimization Pass 2 => enabled Optimization Pass 3 => enabled Optimization Pass 4 => enabled Optimization Pass 5 => enabled Optimization Pass 9 => enabled Optimization Pass 10 => enabled Zend Loader => enabled License Path => Obfuscation level => 3 bz2 BZip2 Support => Enabled BZip2 Version => 1.0.2, 30-Dec-2001 ctype ctype functions => enabled curl CURL support => enabled CURL Information => libcurl/7.15.3 OpenSSL/0.9.7a zlib/1.2.1.2 ftp FTP support => enabled gd GD Support => enabled GD Version => bundled (2.0.28 compatible) FreeType Support => enabled FreeType Linkage => with freetype GIF Read Support => enabled GIF Create Support => enabled JPG Support => enabled PNG Support => enabled WBMP Support => enabled XBM Support => enabled gettext GetText Support => enabled imagick ImageMagick support => enabled Magick Backend => ImageMagick ImageMagick version => 6.2.9 PHP imagick version => 0.9.11.1 MaxRGB => 65535 Supported image formats => clipmask Font Family - Name => AvantGarde - AvantGarde-Book jobqueue_client JobQueue Client => Enabled mbstring Multibyte Support => enabled Japanese support => enabled Simplified chinese support => enabled Traditional chinese support => enabled Korean support => enabled Russian support => enabled Multibyte (japanese) regex support => enabled mbstring extension makes use of "streamable kanji code filter and converter", which is distributed under the GNU Lesser General Public License version 2.1. Directive => Local Value => Master Value mbstring.detect_order => no value => no value mbstring.encoding_translation => Off => Off mbstring.func_overload => 0 => 0 mbstring.http_input => pass => pass mbstring.http_output => pass => pass mbstring.internal_encoding => ISO-8859-1 => no value mbstring.language => neutral => neutral mbstring.substitute_character => no value => no value mod_cluster Clustering Session Module => Disabled reason => mysql MySQL Support => enabled Active Persistent Links => 0 Active Links => 0 Client API version => 4.1.20 MYSQL_MODULE_TYPE => external MYSQL_SOCKET => /var/lib/mysql/mysql.sock MYSQL_INCLUDE => -I/usr/include/mysql MYSQL_LIBS => -L/usr/lib/mysql -lmysqlclient Directive => Local Value => Master Value mysql.allow_persistent => Off => Off mysql.connect_timeout => 60 => 60 mysql.default_host => no value => no value mysql.default_password => no value => no value mysql.default_port => no value => no value mysql.default_socket => no value => no value mysql.default_user => no value => no value mysql.max_links => Unlimited => Unlimited mysql.max_persistent => Unlimited => Unlimited mysql.trace_mode => Off => Off overload User-Space Object Overloading Support => enabled pcre PCRE (Perl Compatible Regular Expressions) Support => enabled PCRE Library Version => 7.0 18-Dec-2006 posix Revision => $Revision: 1.51.2.4.2.3 $ session Session Support => enabled Registered save handlers => files user Directive => Local Value => Master Value session.auto_start => Off => Off session.bug_compat_42 => On => On session.bug_compat_warn => On => On session.cache_expire => 180 => 180 session.cache_limiter => nocache => nocache session.cookie_domain => no value => no value session.cookie_lifetime => 0 => 0 session.cookie_path => / => / session.cookie_secure => Off => Off session.entropy_file => no value => no value session.entropy_length => 0 => 0 session.gc_divisor => 100 => 100 session.gc_maxlifetime => 3600 => 3600 session.gc_probability => 1 => 1 session.name => sessionID => sessionID session.referer_check => no value => no value session.save_handler => files => files session.save_path => /hsphere/sessions => /hsphere/sessions session.serialize_handler => php => php session.use_cookies => On => On session.use_only_cookies => Off => Off session.use_trans_sid => Off => Off sockets Sockets Support => enabled standard Regex Library => Bundled library enabled Dynamic Library Support => enabled Path to sendmail => /usr/sbin/sendmail -t -i Directive => Local Value => Master Value assert.active => 1 => 1 assert.bail => 0 => 0 assert.callback => no value => no value assert.quiet_eval => 0 => 0 assert.warning => 1 => 1 auto_detect_line_endings => 0 => 0 default_socket_timeout => 60 => 60 safe_mode_allowed_env_vars => PHP_ => PHP_ safe_mode_protected_env_vars => LD_LIBRARY_PATH => LD_LIBRARY_PATH url_rewriter.tags => a=href,area=href,frame=src,input=src,form=fakeentry => a=href,area=href,frame=src,input=src,form=fakeentry user_agent => no value => no value tokenizer Tokenizer Support => enabled xml XML Support => active XML Namespace Support => active EXPAT Version => 1.95.6 zip Zip support => enabled zlib ZLib Support => enabled Compiled Version => 1.2.1.2 Linked Version => 1.2.1.2 Directive => Local Value => Master Value zlib.output_compression => Off => Off zlib.output_compression_level => -1 => -1 zlib.output_handler => no value => no value Additional Modules Module Name Environment Variable => Value HOSTNAME => http0.lancasteronline.com TEST_PHP_SRCDIR => /home/admin/php-4.4.6 SHELL => /bin/sh TERM => xterm MAKEFLAGS => HISTSIZE => 1000 SSH_CLIENT => ::ffff:10.1.1.100 3052 22 SSH_TTY => /dev/pts/2 USER => root LS_COLORS => no=00:fi=00:di=00;34:ln=00;36:pi=40;33:so=00;35:bd=40;33;01:cd=40;33;01:or=01;05;37;41:mi=01;05;37;41:ex=00;32:*.cmd=00;32:*.exe=00;32:*.com=00;32:*.btm=00;32:*.bat=00;32:*.sh=00;32:*.csh=00;32:*.tar=00;31:*.tgz=00;31:*.arj=00;31:*.taz=00;31:*.lzh=00;31:*.zip=00;31:*.z=00;31:*.Z=00;31:*.gz=00;31:*.bz2=00;31:*.bz=00;31:*.tz=00;31:*.rpm=00;31:*.cpio=00;31:*.jpg=00;35:*.gif=00;35:*.bmp=00;35:*.xbm=00;35:*.xpm=00;35:*.png=00;35:*.tif=00;35: SCRIPT_FILENAME => MAKELEVEL => 1 MFLAGS => PATH => /hsphere/shared/bin:/hsphere/shared/sbin:/hsphere/local/var/vpopmail/bin:/usr/local/bin:/usr/local/sbin:/usr/kerberos/sbin:/usr/kerberos/bin:/usr/local/sbin:/usr/local/bin:/sbin:/bin:/usr/sbin:/usr/bin:/usr/X11R6/bin:/root/bin MAIL => /var/spool/mail/root _ => /home/admin/php-4.4.6/sapi/cli/php PWD => /home/admin/php-4.4.6 INPUTRC => /etc/inputrc LANG => en_US.UTF-8 TEST_PHP_EXECUTABLE => /home/admin/php-4.4.6/sapi/cli/php REDIRECT_STATUS => PATH_TRANSLATED => SSH_ASKPASS => /usr/libexec/openssh/gnome-ssh-askpass HOME => /root SHLVL => 3 CONTENT_LENGTH => LOGNAME => root QUERY_STRING => SSH_CONNECTION => ::ffff:10.1.1.100 3052 ::ffff:10.1.1.121 22 LESSOPEN => |/usr/bin/lesspipe.sh %s CONTENT_TYPE => CC => gcc REQUEST_METHOD => G_BROKEN_FILENAMES => 1 PHP Variables Variable => Value PHP_SELF => _SERVER["HOSTNAME"] => http0.lancasteronline.com _SERVER["TEST_PHP_SRCDIR"] => /home/admin/php-4.4.6 _SERVER["SHELL"] => /bin/sh _SERVER["TERM"] => xterm _SERVER["MAKEFLAGS"] => _SERVER["HISTSIZE"] => 1000 _SERVER["SSH_CLIENT"] => ::ffff:10.1.1.100 3052 22 _SERVER["SSH_TTY"] => /dev/pts/2 _SERVER["USER"] => root _SERVER["LS_COLORS"] => no=00:fi=00:di=00;34:ln=00;36:pi=40;33:so=00;35:bd=40;33;01:cd=40;33;01:or=01;05;37;41:mi=01;05;37;41:ex=00;32:*.cmd=00;32:*.exe=00;32:*.com=00;32:*.btm=00;32:*.bat=00;32:*.sh=00;32:*.csh=00;32:*.tar=00;31:*.tgz=00;31:*.arj=00;31:*.taz=00;31:*.lzh=00;31:*.zip=00;31:*.z=00;31:*.Z=00;31:*.gz=00;31:*.bz2=00;31:*.bz=00;31:*.tz=00;31:*.rpm=00;31:*.cpio=00;31:*.jpg=00;35:*.gif=00;35:*.bmp=00;35:*.xbm=00;35:*.xpm=00;35:*.png=00;35:*.tif=00;35: _SERVER["SCRIPT_FILENAME"] => _SERVER["MAKELEVEL"] => 1 _SERVER["MFLAGS"] => _SERVER["PATH"] => /hsphere/shared/bin:/hsphere/shared/sbin:/hsphere/local/var/vpopmail/bin:/usr/local/bin:/usr/local/sbin:/usr/kerberos/sbin:/usr/kerberos/bin:/usr/local/sbin:/usr/local/bin:/sbin:/bin:/usr/sbin:/usr/bin:/usr/X11R6/bin:/root/bin _SERVER["MAIL"] => /var/spool/mail/root _SERVER["_"] => /home/admin/php-4.4.6/sapi/cli/php _SERVER["PWD"] => /home/admin/php-4.4.6 _SERVER["INPUTRC"] => /etc/inputrc _SERVER["LANG"] => en_US.UTF-8 _SERVER["TEST_PHP_EXECUTABLE"] => /home/admin/php-4.4.6/sapi/cli/php _SERVER["REDIRECT_STATUS"] => _SERVER["PATH_TRANSLATED"] => _SERVER["SSH_ASKPASS"] => /usr/libexec/openssh/gnome-ssh-askpass _SERVER["HOME"] => /root _SERVER["SHLVL"] => 3 _SERVER["CONTENT_LENGTH"] => _SERVER["LOGNAME"] => root _SERVER["QUERY_STRING"] => _SERVER["SSH_CONNECTION"] => ::ffff:10.1.1.100 3052 ::ffff:10.1.1.121 22 _SERVER["LESSOPEN"] => |/usr/bin/lesspipe.sh %s _SERVER["CONTENT_TYPE"] => _SERVER["CC"] => gcc _SERVER["REQUEST_METHOD"] => _SERVER["G_BROKEN_FILENAMES"] => 1 _SERVER["PHP_SELF"] => _SERVER["SCRIPT_NAME"] => _SERVER["DOCUMENT_ROOT"] => _SERVER["argv"] => Array ( ) _SERVER["argc"] => 0 _ENV["HOSTNAME"] => http0.lancasteronline.com _ENV["TEST_PHP_SRCDIR"] => /home/admin/php-4.4.6 _ENV["SHELL"] => /bin/sh _ENV["TERM"] => xterm _ENV["MAKEFLAGS"] => _ENV["HISTSIZE"] => 1000 _ENV["SSH_CLIENT"] => ::ffff:10.1.1.100 3052 22 _ENV["SSH_TTY"] => /dev/pts/2 _ENV["USER"] => root _ENV["LS_COLORS"] => no=00:fi=00:di=00;34:ln=00;36:pi=40;33:so=00;35:bd=40;33;01:cd=40;33;01:or=01;05;37;41:mi=01;05;37;41:ex=00;32:*.cmd=00;32:*.exe=00;32:*.com=00;32:*.btm=00;32:*.bat=00;32:*.sh=00;32:*.csh=00;32:*.tar=00;31:*.tgz=00;31:*.arj=00;31:*.taz=00;31:*.lzh=00;31:*.zip=00;31:*.z=00;31:*.Z=00;31:*.gz=00;31:*.bz2=00;31:*.bz=00;31:*.tz=00;31:*.rpm=00;31:*.cpio=00;31:*.jpg=00;35:*.gif=00;35:*.bmp=00;35:*.xbm=00;35:*.xpm=00;35:*.png=00;35:*.tif=00;35: _ENV["SCRIPT_FILENAME"] => _ENV["MAKELEVEL"] => 1 _ENV["MFLAGS"] => _ENV["PATH"] => /hsphere/shared/bin:/hsphere/shared/sbin:/hsphere/local/var/vpopmail/bin:/usr/local/bin:/usr/local/sbin:/usr/kerberos/sbin:/usr/kerberos/bin:/usr/local/sbin:/usr/local/bin:/sbin:/bin:/usr/sbin:/usr/bin:/usr/X11R6/bin:/root/bin _ENV["MAIL"] => /var/spool/mail/root _ENV["_"] => /home/admin/php-4.4.6/sapi/cli/php _ENV["PWD"] => /home/admin/php-4.4.6 _ENV["INPUTRC"] => /etc/inputrc _ENV["LANG"] => en_US.UTF-8 _ENV["TEST_PHP_EXECUTABLE"] => /home/admin/php-4.4.6/sapi/cli/php _ENV["REDIRECT_STATUS"] => _ENV["PATH_TRANSLATED"] => _ENV["SSH_ASKPASS"] => /usr/libexec/openssh/gnome-ssh-askpass _ENV["HOME"] => /root _ENV["SHLVL"] => 3 _ENV["CONTENT_LENGTH"] => _ENV["LOGNAME"] => root _ENV["QUERY_STRING"] => _ENV["SSH_CONNECTION"] => ::ffff:10.1.1.100 3052 ::ffff:10.1.1.121 22 _ENV["LESSOPEN"] => |/usr/bin/lesspipe.sh %s _ENV["CONTENT_TYPE"] => _ENV["CC"] => gcc _ENV["REQUEST_METHOD"] => _ENV["G_BROKEN_FILENAMES"] => 1 PHP License This program is free software; you can redistribute it and/or modify it under the terms of the PHP License as published by the PHP Group and included in the distribution in the file: LICENSE This program is distributed in the hope that it will be useful, but WITHOUT ANY WARRANTY; without even the implied warranty of MERCHANTABILITY or FITNESS FOR A PARTICULAR PURPOSE. If you did not receive a copy of the PHP license, or have any questions about PHP licensing, please contact license@php.net.

« previous php.qa (#27570) next »