Test results for 5.2.2RC1 [failed]

From: Date: Thu, 12 Apr 2007 08:11:13 +0000
Subject: Test results for 5.2.2RC1 [failed]
Groups: php.qa 
Request: Send a blank email to php-qa+get-28149@lists.php.net to get a copy of this message
===================================================================== FAILED TEST SUMMARY --------------------------------------------------------------------- Bug #40236 (php -a function allocation eats memory) [Zend/tests/bug40236.phpt] easter_date() [ext/calendar/tests/easter_date.phpt] unixtojd() [ext/calendar/tests/unixtojd.phpt] Bug #40861 (Multiple +/- on relative units breaks strtotime()) [ext/date/tests/bug40861.phpt] Bug #38474 (getAttribute select attribute by order, even when prefixed) (OK to fail with libxml2 < 2.6.2x) [ext/dom/tests/bug38474.phpt] Bug #16069 [ext/iconv/tests/bug16069.phpt] iconv stream filter [ext/iconv/tests/iconv_stream_filter.phpt] oci_internal_debug() [ext/oci8/tests/debug.phpt] Test CLOB->write() for multiple inserts [ext/oci8/tests/lob_039.phpt] PECL Bug #10194 (segfault in Instant Client when memory_limit is reached inside the callback) [ext/oci8/tests/pecl_bug10194.phpt] PECL Bug #10194 (segfault in Instant Client when memory_limit is reached inside the callback) [ext/oci8/tests/pecl_bug10194_blob.phpt] via [ext/pdo_oci/tests/common.phpt] OCI PDO Common: PHP Bug #38253: PDO produces segfault with default fetch mode [ext/pdo_oci/tests/bug_38253.phpt] via [ext/pdo_oci/tests/common.phpt] OCI PDO Common: PDO::FETCH_BOUND [ext/pdo_oci/tests/pdo_016.phpt] via [ext/pdo_oci/tests/common.phpt] OCI PDO Common: PDO::FETCH_BOUND w/o : [ext/pdo_oci/tests/pdo_016a.phpt] via [ext/pdo_oci/tests/common.phpt] OCI PDO Common: serializing [ext/pdo_oci/tests/pdo_018.phpt] via [ext/pdo_oci/tests/common.phpt] OCI PDO Common: PDOStatement::execute with parameters [ext/pdo_oci/tests/pdo_021.phpt] via [ext/pdo_oci/tests/common.phpt] OCI PDO Common: PDO::quote() [ext/pdo_oci/tests/pdo_033.phpt] Bug #31422 No Error-Logging on SoapServer-Side [ext/soap/tests/bugs/bug31422.phpt] IPv6 Loopback test [ext/sockets/tests/ipv6loop.phpt] bug #39322: proc_terminate() loosing process resource [ext/standard/tests/general_functions/bug39322.phpt] proc_open [ext/standard/tests/general_functions/proc_open02.phpt] htmlentities() test 2 (setlocale / fr_FR.ISO-8859-15) [ext/standard/tests/strings/htmlentities02.phpt] (warn: possibly braindead libc) htmlentities() test 4 (setlocale / ja_JP.EUC-JP) [ext/standard/tests/strings/htmlentities04.phpt] htmlentities() test 15 (setlocale / KOI8-R) [ext/standard/tests/strings/htmlentities15.phpt] Generic pack()/unpack() tests [ext/standard/tests/strings/pack.phpt] ===================================================================== ===================================================================== TEST RESULT SUMMARY --------------------------------------------------------------------- Exts skipped : 22 Exts tested : 57 --------------------------------------------------------------------- Number of tests : 3257 2950 Tests skipped : 307 ( 9.4%) -------- Tests warned : 1 ( 0.0%) ( 0.0%) Tests failed : 24 ( 0.7%) ( 0.8%) Tests passed : 2925 ( 89.8%) ( 99.2%) --------------------------------------------------------------------- Time taken : 759 seconds ===================================================================== ===================================================================== FAILED TEST SUMMARY --------------------------------------------------------------------- Bug #40236 (php -a function allocation eats memory) [Zend/tests/bug40236.phpt] easter_date() [ext/calendar/tests/easter_date.phpt] unixtojd() [ext/calendar/tests/unixtojd.phpt] Bug #40861 (Multiple +/- on relative units breaks strtotime()) [ext/date/tests/bug40861.phpt] Bug #38474 (getAttribute select attribute by order, even when prefixed) (OK to fail with libxml2 < 2.6.2x) [ext/dom/tests/bug38474.phpt] Bug #16069 [ext/iconv/tests/bug16069.phpt] iconv stream filter [ext/iconv/tests/iconv_stream_filter.phpt] oci_internal_debug() [ext/oci8/tests/debug.phpt] Test CLOB->write() for multiple inserts [ext/oci8/tests/lob_039.phpt] PECL Bug #10194 (segfault in Instant Client when memory_limit is reached inside the callback) [ext/oci8/tests/pecl_bug10194.phpt] PECL Bug #10194 (segfault in Instant Client when memory_limit is reached inside the callback) [ext/oci8/tests/pecl_bug10194_blob.phpt] via [ext/pdo_oci/tests/common.phpt] OCI PDO Common: PHP Bug #38253: PDO produces segfault with default fetch mode [ext/pdo_oci/tests/bug_38253.phpt] via [ext/pdo_oci/tests/common.phpt] OCI PDO Common: PDO::FETCH_BOUND [ext/pdo_oci/tests/pdo_016.phpt] via [ext/pdo_oci/tests/common.phpt] OCI PDO Common: PDO::FETCH_BOUND w/o : [ext/pdo_oci/tests/pdo_016a.phpt] via [ext/pdo_oci/tests/common.phpt] OCI PDO Common: serializing [ext/pdo_oci/tests/pdo_018.phpt] via [ext/pdo_oci/tests/common.phpt] OCI PDO Common: PDOStatement::execute with parameters [ext/pdo_oci/tests/pdo_021.phpt] via [ext/pdo_oci/tests/common.phpt] OCI PDO Common: PDO::quote() [ext/pdo_oci/tests/pdo_033.phpt] Bug #31422 No Error-Logging on SoapServer-Side [ext/soap/tests/bugs/bug31422.phpt] IPv6 Loopback test [ext/sockets/tests/ipv6loop.phpt] bug #39322: proc_terminate() loosing process resource [ext/standard/tests/general_functions/bug39322.phpt] proc_open [ext/standard/tests/general_functions/proc_open02.phpt] htmlentities() test 2 (setlocale / fr_FR.ISO-8859-15) [ext/standard/tests/strings/htmlentities02.phpt] (warn: possibly braindead libc) htmlentities() test 4 (setlocale / ja_JP.EUC-JP) [ext/standard/tests/strings/htmlentities04.phpt] htmlentities() test 15 (setlocale / KOI8-R) [ext/standard/tests/strings/htmlentities15.phpt] Generic pack()/unpack() tests [ext/standard/tests/strings/pack.phpt] ===================================================================== ================================================================================ /usr/src/php-5.2.2RC1/Zend/tests/bug40236.phpt ================================================================================ Interactive shell php > ================================================================================ 003+ php > 003- ok ================================================================================ ================================================================================ /usr/src/php-5.2.2RC1/ext/calendar/tests/easter_date.phpt ================================================================================ 2000-04-22 2001-04-14 2002-03-30 Warning: easter_date(): This function is only valid for years between 1970 and 2037 inclusive in /usr/src/php-5.2.2RC1/ext/calendar/tests/easter_date.php on line 5 1970-01-01 ================================================================================ 001+ 2000-04-22 002+ 2001-04-14 003+ 2002-03-30 001- 2000-04-23 002- 2001-04-15 003- 2002-03-31 ================================================================================ ================================================================================ /usr/src/php-5.2.2RC1/ext/calendar/tests/unixtojd.phpt ================================================================================ 2440588 2452162 2453926 ================================================================================ 002+ 2452162 002- 2452161 ================================================================================ ================================================================================ /usr/src/php-5.2.2RC1/ext/date/tests/bug40861.phpt ================================================================================ 2000-01-01 13:00:00 1970-01-01 00:00:00 1970-01-01 00:00:00 2000-01-01 13:00:00 ================================================================================ 002+ 1970-01-01 00:00:00 003+ 1970-01-01 00:00:00 002- 2000-01-01 11:00:00 003- 2000-01-01 11:00:00 ================================================================================ ================================================================================ /usr/src/php-5.2.2RC1/ext/dom/tests/bug38474.phpt ================================================================================ foo bar foo2 bar baz2 ================================================================================ 004+ bar 005+ 006+ 004- bar2 005- baz 008- baz ================================================================================ ================================================================================ /usr/src/php-5.2.2RC1/ext/iconv/tests/bug16069.phpt ================================================================================ ????????????????????????????????????????(¡ë§¥¡ë) ================================================================================ 001+ ????????????????????????????????????????(¡ë§¥¡ë) 001- ¥ß¥ê¥Ð¡¼¥ë¥ß¥ê¥Ð¡¼¥ë¥ß¥ê¥Ð¡¼¥ë¥ß¥ê¥Ð¡¼¥ë¥ß¥ê¥Ð¡¼¥ë¥ß¥ê¥Ð¡¼¥ë¥ß¥ê¥Ð¡¼¥ë¥ß¥ê¥Ð¡¼¥ë¥ß¥ê¥Ð¡¼¥ë¥ß¥ê¥Ð¡¼¥ë¥ß¥ê¥Ð¡¼¥ë¥ß¥ê¥Ð¡¼¥ë¥ß¥ê¥Ð¡¼¥ë¥ß¥ê¥Ð¡¼¥ë¥ß¥ê¥Ð¡¼¥ë¥ß¥ê¥Ð¡¼¥ë¥ß¥ê¥Ð¡¼¥ë¥ß¥ê¥Ð¡¼¥ë¥ß¥ê¥Ð¡¼¥ë¥ß¥ê¥Ð¡¼¥ë¥ß¥ê¥Ð¡¼¥ë¥ß¥ê¥Ð¡¼¥ë¥ß¥ê¥Ð¡¼¥ë¥ß¥ê¥Ð¡¼¥ë¥ß¥ê¥Ð¡¼¥ë¥ß¥ê¥Ð¡¼¥ë¥ß¥ê¥Ð¡¼¥ë¥ß¥ê¥Ð¡¼¥ë¥ß¥ê¥Ð¡¼¥ë¥ß¥ê¥Ð¡¼¥ë¥ß¥ê¥Ð¡¼¥ë¥ß¥ê¥Ð¡¼¥ë¥ß¥ê¥Ð¡¼¥ë¥ß¥ê¥Ð¡¼¥ë¥ß¥ê¥Ð¡¼¥ë¥ß¥ê¥Ð¡¼¥ë¥ß¥ê¥Ð¡¼¥ë¥ß¥ê¥Ð¡¼¥ë¥ß¥ê¥Ð¡¼¥ë¥ß¥ê¥Ð¡¼¥ë(¡ë§¥¡ë) ================================================================================ ================================================================================ /usr/src/php-5.2.2RC1/ext/iconv/tests/iconv_stream_filter.phpt ================================================================================ string(20) "1b244224332473244b24" string(10) "41244f1b28" string(2) "42" string(20) "a4b3a4f3a4cba4c1a4cf" string(10) "69636f6e76" string(2) "0a" string(20) "1b244f24332466245824" string(10) "4e24421b28" string(2) "4f" ================================================================================ 007+ string(20) "1b244f24332466245824" 008+ string(10) "4e24421b28" 009+ string(2) "4f" 007- 008- Warning: fread(): iconv stream filter ("ISO-2022-JP"=>"EUC-JP"): invalid multibyte sequence in %s on line %d 009- string(0) "" 010- string(0) "" 011- string(0) "" ================================================================================ ================================================================================ /usr/src/php-5.2.2RC1/ext/oci8/tests/debug.phpt ================================================================================ OCI8 DEBUG: OCINlsEnvironmentVariableGet at (/usr/src/php-5.2.2RC1/ext/oci8/oci8.c:1057) Done OCI8 DEBUG: OCISessionEnd at (/usr/src/php-5.2.2RC1/ext/oci8/oci8.c:1510) OCI8 DEBUG: OCIHandleFree at (/usr/src/php-5.2.2RC1/ext/oci8/oci8.c:1514) OCI8 DEBUG: OCIServerDetach at (/usr/src/php-5.2.2RC1/ext/oci8/oci8.c:1518) OCI8 DEBUG: OCIHandleFree at (/usr/src/php-5.2.2RC1/ext/oci8/oci8.c:1522) OCI8 DEBUG: OCIHandleFree at (/usr/src/php-5.2.2RC1/ext/oci8/oci8.c:1526) OCI8 DEBUG: OCIHandleFree at (/usr/src/php-5.2.2RC1/ext/oci8/oci8.c:1530) OCI8 DEBUG: OCIHandleFree at (/usr/src/php-5.2.2RC1/ext/oci8/oci8.c:1534) ================================================================================ 009- OCI8 DEBUG: OCIHandleFree at (%s:%d) 010- OCI8 DEBUG: OCIHandleFree at (%s:%d) ================================================================================ ================================================================================ /usr/src/php-5.2.2RC1/ext/oci8/tests/lob_039.phpt ================================================================================ Test 1: CLOB int(11) int(11) int(11) bool(true) array(1) { ["CLOB"]=> array(3) { [0]=> string(11) "clob test 1" [1]=> string(22) " clob test 2" [2]=> string(33) " clob test 3" } } Done ================================================================================ 012+ string(22) " clob test 2" 012- string(11) "clob test 2" 014+ string(33) " clob test 3" 014- string(11) "clob test 3" ================================================================================ ================================================================================ /usr/src/php-5.2.2RC1/ext/oci8/tests/pecl_bug10194.phpt ================================================================================ Fatal error: Allowed memory size of 10485760 bytes exhausted (tried to allocate 16777217 bytes) in /usr/src/php-5.2.2RC1/ext/oci8/tests/pecl_bug10194.php on line 33 ================================================================================ 001+ Fatal error: Allowed memory size of 10485760 bytes exhausted (tried to allocate 16777217 bytes) in /usr/src/php-5.2.2RC1/ext/oci8/tests/pecl_bug10194.php on line 33 001- Fatal error: Allowed memory size of 10485760 bytes exhausted at %s:%d (tried to allocate %d bytes) in %s on line %d ================================================================================ ================================================================================ /usr/src/php-5.2.2RC1/ext/oci8/tests/pecl_bug10194_blob.phpt ================================================================================ Fatal error: Allowed memory size of 10485760 bytes exhausted (tried to allocate 16777217 bytes) in /usr/src/php-5.2.2RC1/ext/oci8/tests/pecl_bug10194_blob.php on line 33 ================================================================================ 001+ Fatal error: Allowed memory size of 10485760 bytes exhausted (tried to allocate 16777217 bytes) in /usr/src/php-5.2.2RC1/ext/oci8/tests/pecl_bug10194_blob.php on line 33 001- Fatal error: Allowed memory size of %d bytes exhausted at %s:%d (tried to allocate %d bytes) in %s on line %d ================================================================================ ================================================================================ /usr/src/php-5.2.2RC1/ext/pdo/tests/bug_38253.phpt ================================================================================ Warning: PDO::exec(): SQLSTATE[HY000]: General error: 902 OCIStmtExecute: ORA-00902: invalid datatype (/usr/src/php-5.2.2RC1/ext/pdo_oci/oci_driver.c:334) in /usr/src/php-5.2.2RC1/ext/pdo_oci/tests/bug_38253.php on line 7 Warning: PDO::exec(): SQLSTATE[HY000]: General error: 942 OCIStmtExecute: ORA-00942: table or view does not exist (/usr/src/php-5.2.2RC1/ext/pdo_oci/oci_driver.c:334) in /usr/src/php-5.2.2RC1/ext/pdo_oci/tests/bug_38253.php on line 8 Warning: PDOStatement::execute(): SQLSTATE[HY000]: General error: 942 OCIStmtExecute: ORA-00942: table or view does not exist (/usr/src/php-5.2.2RC1/ext/pdo_oci/oci_statement.c:142) in /usr/src/php-5.2.2RC1/ext/pdo_oci/tests/bug_38253.php on line 12 array(0) { } Warning: PDO::exec(): SQLSTATE[HY000]: General error: 902 OCIStmtExecute: ORA-00902: invalid datatype (/usr/src/php-5.2.2RC1/ext/pdo_oci/oci_driver.c:334) in /usr/src/php-5.2.2RC1/ext/pdo_oci/tests/bug_38253.php on line 17 Warning: PDO::exec(): SQLSTATE[HY000]: General error: 942 OCIStmtExecute: ORA-00942: table or view does not exist (/usr/src/php-5.2.2RC1/ext/pdo_oci/oci_driver.c:334) in /usr/src/php-5.2.2RC1/ext/pdo_oci/tests/bug_38253.php on line 18 Warning: PDOStatement::execute(): SQLSTATE[HY000]: General error: 942 OCIStmtExecute: ORA-00942: table or view does not exist (/usr/src/php-5.2.2RC1/ext/pdo_oci/oci_statement.c:142) in /usr/src/php-5.2.2RC1/ext/pdo_oci/tests/bug_38253.php on line 22 array(0) { } ================================================================================ 001+ Warning: PDO::exec(): SQLSTATE[HY000]: General error: 902 OCIStmtExecute: ORA-00902: invalid datatype 002+ (/usr/src/php-5.2.2RC1/ext/pdo_oci/oci_driver.c:334) in /usr/src/php-5.2.2RC1/ext/pdo_oci/tests/bug_38253.php on line 7 001- Warning: PDOStatement::fetchAll(): SQLSTATE[HY000]: General error: No fetch class specified in %s on line %d 003- Warning: PDOStatement::fetchAll(): SQLSTATE[HY000]: General error%s on line %d 004+ Warning: PDO::exec(): SQLSTATE[HY000]: General error: 942 OCIStmtExecute: ORA-00942: table or view does not exist 005+ (/usr/src/php-5.2.2RC1/ext/pdo_oci/oci_driver.c:334) in /usr/src/php-5.2.2RC1/ext/pdo_oci/tests/bug_38253.php on line 8 006+ 007+ Warning: PDOStatement::execute(): SQLSTATE[HY000]: General error: 942 OCIStmtExecute: ORA-00942: table or view does not exist 008+ (/usr/src/php-5.2.2RC1/ext/pdo_oci/oci_statement.c:142) in /usr/src/php-5.2.2RC1/ext/pdo_oci/tests/bug_38253.php on line 12 007- Warning: PDOStatement::fetchAll(): SQLSTATE[HY000]: General error: No fetch function specified in %s on line %d 009- Warning: PDOStatement::fetchAll(): SQLSTATE[HY000]: General error%s on line %d 012+ Warning: PDO::exec(): SQLSTATE[HY000]: General error: 902 OCIStmtExecute: ORA-00902: invalid datatype 013+ (/usr/src/php-5.2.2RC1/ext/pdo_oci/oci_driver.c:334) in /usr/src/php-5.2.2RC1/ext/pdo_oci/tests/bug_38253.php on line 17 015+ Warning: PDO::exec(): SQLSTATE[HY000]: General error: 942 OCIStmtExecute: ORA-00942: table or view does not exist 016+ (/usr/src/php-5.2.2RC1/ext/pdo_oci/oci_driver.c:334) in /usr/src/php-5.2.2RC1/ext/pdo_oci/tests/bug_38253.php on line 18 017+ 018+ Warning: PDOStatement::execute(): SQLSTATE[HY000]: General error: 942 OCIStmtExecute: ORA-00942: table or view does not exist 019+ (/usr/src/php-5.2.2RC1/ext/pdo_oci/oci_statement.c:142) in /usr/src/php-5.2.2RC1/ext/pdo_oci/tests/bug_38253.php on line 22 ================================================================================ ================================================================================ /usr/src/php-5.2.2RC1/ext/pdo/tests/pdo_016.phpt ================================================================================ string(1) "3" array(3) { [0]=> string(7) "String0" [1]=> string(7) "String1" [2]=> string(7) "String2" } ===WHILE=== array(1) { [0]=> string(7) "String0" } array(1) { [1]=> string(7) "String1" } array(1) { [2]=> string(7) "String2" } ===ALONE=== array(1) { [0]=> string(7) "String0" } bool(true) bool(true) bool(true) bool(true) array(1) { [0]=> string(7) "String0" } array(1) { [1]=> string(7) "String1" } bool(true) bool(true) bool(true) bool(true) array(1) { [""]=> NULL } array(1) { [2]=> string(7) "String2" } bool(true) bool(true) bool(true) bool(true) array(1) { [""]=> NULL } ===REBIND/SAME=== array(1) { [0]=> string(7) "String0" } bool(true) bool(true) NULL bool(true) bool(true) NULL array(1) { [1]=> string(7) "String1" } bool(true) bool(true) NULL bool(true) bool(true) NULL array(1) { [2]=> string(7) "String2" } bool(true) bool(true) NULL bool(true) bool(true) NULL ===REBIND/CONFLICT=== string(7) "String0" string(7) "String1" string(7) "String2" ================================================================================ 045+ [""]=> 046+ NULL 045- [1]=> 046- string(7) "String1" 057+ [""]=> 058+ NULL 057- [2]=> 058- string(7) "String2" 067+ NULL 067- string(7) "String0" 070+ NULL 070- string(1) "0" 077+ NULL 077- string(7) "String1" 080+ NULL 080- string(1) "1" 087+ NULL 087- string(7) "String2" 090+ NULL 090- string(1) "2" ================================================================================ ================================================================================ /usr/src/php-5.2.2RC1/ext/pdo/tests/pdo_016a.phpt ================================================================================ string(1) "3" array(3) { [0]=> string(7) "String0" [1]=> string(7) "String1" [2]=> string(7) "String2" } ===WHILE=== array(1) { [0]=> string(7) "String0" } array(1) { [1]=> string(7) "String1" } array(1) { [2]=> string(7) "String2" } ===ALONE=== array(1) { [0]=> string(7) "String0" } bool(true) bool(true) bool(true) bool(true) array(1) { [0]=> string(7) "String0" } array(1) { [1]=> string(7) "String1" } bool(true) bool(true) bool(true) bool(true) array(1) { [""]=> NULL } array(1) { [2]=> string(7) "String2" } bool(true) bool(true) bool(true) bool(true) array(1) { [""]=> NULL } ===REBIND/SAME=== array(1) { [0]=> string(7) "String0" } bool(true) bool(true) NULL bool(true) bool(true) NULL array(1) { [1]=> string(7) "String1" } bool(true) bool(true) NULL bool(true) bool(true) NULL array(1) { [2]=> string(7) "String2" } bool(true) bool(true) NULL bool(true) bool(true) NULL ===REBIND/CONFLICT=== string(7) "String0" string(7) "String1" string(7) "String2" ================================================================================ 045+ [""]=> 046+ NULL 045- [1]=> 046- string(7) "String1" 057+ [""]=> 058+ NULL 057- [2]=> 058- string(7) "String2" 067+ NULL 067- string(7) "String0" 070+ NULL 070- string(1) "0" 077+ NULL 077- string(7) "String1" 080+ NULL 080- string(1) "1" 087+ NULL 087- string(7) "String2" 090+ NULL 090- string(1) "2" ================================================================================ ================================================================================ /usr/src/php-5.2.2RC1/ext/pdo/tests/pdo_018.phpt ================================================================================ string(1) "3" array(3) { [0]=> string(8) "stdClass" [1]=> string(8) "TestBase" [2]=> string(11) "TestDerived" } ===TYPES=== array(4) { ["stdClass"]=> string(1) "0" ["TestBase"]=> string(1) "1" ["TestDerived"]=> string(1) "2" ["TestLeaf"]=> NULL } ===INSERT=== TestBase::serialize() = 'a:3:{s:7:"BasePub";s:6:"Public";s:7:"BasePro";s:9:"Protected";s:7:"BasePri";s:7:"Private";}' TestDerived::serialize() TestBase::serialize() = 'a:4:{s:7:"BasePub";s:13:"DerivedPublic";s:7:"BasePro";s:16:"DerivdeProtected";s:10:"DerivedPub";s:6:"Public";s:10:"DerivedPro";s:9:"Protected";}' TestDerived::serialize() TestBase::serialize() = 'a:4:{s:7:"BasePub";s:13:"DerivedPublic";s:7:"BasePro";s:16:"DerivdeProtected";s:10:"DerivedPub";s:6:"Public";s:10:"DerivedPro";s:9:"Protected";}' ===DATA=== array(4) { [0]=> NULL [1]=> string(91) "a:3:{s:7:"BasePub";s:6:"Public";s:7:"BasePro";s:9:"Protected";s:7:"BasePri";s:7:"Private";}" [2]=> string(144) "a:4:{s:7:"BasePub";s:13:"DerivedPublic";s:7:"BasePro";s:16:"DerivdeProtected";s:10:"DerivedPub";s:6:"Public";s:10:"DerivedPro";s:9:"Protected";}" [3]=> string(144) "a:4:{s:7:"BasePub";s:13:"DerivedPublic";s:7:"BasePro";s:16:"DerivdeProtected";s:10:"DerivedPub";s:6:"Public";s:10:"DerivedPro";s:9:"Protected";}" } ===FAILURE=== Exception:SQLSTATE[HY000]: General error: cannot unserialize class ===COUNT=== string(1) "3" ===DATABASE=== array(3) { [0]=> array(2) { ["name"]=> string(8) "TestBase" ["val"]=> string(91) "a:3:{s:7:"BasePub";s:6:"Public";s:7:"BasePro";s:9:"Protected";s:7:"BasePri";s:7:"Private";}" } [1]=> array(2) { ["name"]=> string(11) "TestDerived" ["val"]=> string(144) "a:4:{s:7:"BasePub";s:13:"DerivedPublic";s:7:"BasePro";s:16:"DerivdeProtected";s:10:"DerivedPub";s:6:"Public";s:10:"DerivedPro";s:9:"Protected";}" } [2]=> array(2) { ["name"]=> NULL ["val"]=> string(144) "a:4:{s:7:"BasePub";s:13:"DerivedPublic";s:7:"BasePro";s:16:"DerivdeProtected";s:10:"DerivedPub";s:6:"Public";s:10:"DerivedPro";s:9:"Protected";}" } } ===FETCHCLASS=== TestBase::unserialize(a:3:{s:7:"BasePub";s:6:"Public";s:7:"BasePro";s:9:"Protected";s:7:"BasePri";s:7:"Private";}) TestDerived::unserialize() TestBase::unserialize(a:4:{s:7:"BasePub";s:13:"DerivedPublic";s:7:"BasePro";s:16:"DerivdeProtected";s:10:"DerivedPub";s:6:"Public";s:10:"DerivedPro";s:9:"Protected";}) TestDerived::unserialize() TestBase::unserialize(a:4:{s:7:"BasePub";s:13:"DerivedPublic";s:7:"BasePro";s:16:"DerivdeProtected";s:10:"DerivedPub";s:6:"Public";s:10:"DerivedPro";s:9:"Protected";}) array(3) { [0]=> object(TestBase)#8 (3) { ["BasePub"]=> string(7) "#Public" ["BasePro:protected"]=> string(10) "#Protected" ["BasePri:private"]=> string(8) "#Private" } [1]=> object(TestDerived)#9 (6) { ["BasePub"]=> string(14) "#DerivedPublic" ["BasePro:protected"]=> string(17) "#DerivdeProtected" ["DerivedPub"]=> string(7) "#Public" ["DerivedPro:protected"]=> string(10) "#Protected" ["DerivedPri:private"]=> string(7) "Private" ["BasePri:private"]=> string(7) "Private" } [2]=> object(TestLeaf)#10 (6) { ["BasePub"]=> string(14) "#DerivedPublic" ["BasePro:protected"]=> string(17) "#DerivdeProtected" ["DerivedPub"]=> string(7) "#Public" ["DerivedPro:protected"]=> string(10) "#Protected" ["DerivedPri:private"]=> string(7) "Private" ["BasePri:private"]=> string(7) "Private" } } ================================================================================ 030+ NULL 030- string(0) "" ================================================================================ ================================================================================ /usr/src/php-5.2.2RC1/ext/pdo/tests/pdo_021.phpt ================================================================================ There are 6 rows in the table. There are rows in the table. ================================================================================ 002+ There are rows in the table. 002- There are 12 rows in the table. ================================================================================ ================================================================================ /usr/src/php-5.2.2RC1/ext/pdo/tests/pdo_033.phpt ================================================================================ Warning: PDO::query(): SQLSTATE[HY000]: General error: 936 OCIStmtExecute: ORA-00936: missing expression (/usr/src/php-5.2.2RC1/ext/pdo_oci/oci_statement.c:142) in /usr/src/php-5.2.2RC1/ext/pdo_oci/tests/pdo_033.php on line 12 Array ( ) ================================================================================ 001+ Warning: PDO::query(): SQLSTATE[HY000]: General error: 936 OCIStmtExecute: ORA-00936: missing expression 002+ (/usr/src/php-5.2.2RC1/ext/pdo_oci/oci_statement.c:142) in /usr/src/php-5.2.2RC1/ext/pdo_oci/tests/pdo_033.php on line 12 003- [0] => Array 004- ( 005- [t] => !"#$%&'()*+,-./0123456789:;<=>?@ABCDEFGHIJKLMNOPQRSTUVWXYZ[\]^_`abcdefghijklmnopqrstuvwxyz{|}~ 006- ) 007- ================================================================================ ================================================================================ /usr/src/php-5.2.2RC1/ext/soap/tests/bugs/bug31422.phpt ================================================================================ <?xml version="1.0" encoding="UTF-8"?> <SOAP-ENV:Envelope xmlns:SOAP-ENV="http://schemas.xmlsoap.org/soap/envelope/"><SOAP-ENV:Body><SOAP-ENV:Fault><faultcode>SOAP-ENV:Server</faultcode><faultstring>Hello</faultstring></SOAP-ENV:Fault></SOAP-ENV:Body></SOAP-ENV:Envelope> ================================================================================ 001- PHP Warning: fopen() expects at least 2 parameters, 0 given in %sbug31422.php on line %d 002- PHP Fatal error: Hello in %sbug31422.php on line %d ================================================================================ ================================================================================ /usr/src/php-5.2.2RC1/ext/sockets/tests/ipv6loop.phpt ================================================================================ Warning: socket_create(): Unable to create socket [97]: Address family not supported by protocol in /usr/src/php-5.2.2RC1/ext/sockets/tests/ipv6loop.php on line 3 Unable to create AF_INET6 socket [server] ================================================================================ 001+ Warning: socket_create(): Unable to create socket [97]: Address family not supported by protocol in /usr/src/php-5.2.2RC1/ext/sockets/tests/ipv6loop.php on line 3 002+ Unable to create AF_INET6 socket [server] 001- string(10) "ABCdef123 002- " ================================================================================ ================================================================================ /usr/src/php-5.2.2RC1/ext/standard/tests/general_functions/bug39322.phpt ================================================================================ array(8) { ["command"]=> string(14) "/bin/sleep 120" ["pid"]=> int(6028) ["running"]=> bool(false) ["signaled"]=> bool(false) ["stopped"]=> bool(false) ["exitcode"]=> int(-1) ["termsig"]=> int(0) ["stopsig"]=> int(0) } Done! ================================================================================ 009+ bool(false) 009- bool(true) 015+ int(0) 015- int(15) ================================================================================ ================================================================================ /usr/src/php-5.2.2RC1/ext/standard/tests/general_functions/proc_open02.phpt ================================================================================ bool(true) array(8) { ["command"]=> string(28) "/usr/bin/nohup /bin/sleep 50" ["pid"]=> int(6074) ["running"]=> bool(true) ["signaled"]=> bool(false) ["stopped"]=> bool(false) ["exitcode"]=> int(-1) ["termsig"]=> int(0) ["stopsig"]=> int(0) } bool(true) array(8) { ["command"]=> string(28) "/usr/bin/nohup /bin/sleep 50" ["pid"]=> int(6074) ["running"]=> bool(false) ["signaled"]=> bool(false) ["stopped"]=> bool(false) ["exitcode"]=> int(-1) ["termsig"]=> int(0) ["stopsig"]=> int(0) } Done! ================================================================================ 029+ bool(false) 029- bool(true) 035+ int(0) 035- int(15) ================================================================================ ================================================================================ /usr/src/php-5.2.2RC1/ext/standard/tests/strings/htmlentities02.phpt (warn: possibly braindead libc) ================================================================================ string(24) "&frac14;&frac12;&frac34;" ================================================================================ 001+ string(24) "&frac14;&frac12;&frac34;" 001- string(20) "&OElig;&oelig;&Yuml;" ================================================================================ ================================================================================ /usr/src/php-5.2.2RC1/ext/standard/tests/strings/htmlentities04.phpt ================================================================================ string(42) "&iexcl;&cent;&iexcl;&pound;&iexcl;&curren;" ================================================================================ 001+ string(42) "&iexcl;&cent;&iexcl;&pound;&iexcl;&curren;" 001- string(6) "¡¢¡£¡¤" ================================================================================ ================================================================================ /usr/src/php-5.2.2RC1/ext/standard/tests/strings/htmlentities15.phpt ================================================================================ string(9) "ÒÏÓËÏÛÎÙÊ" string(63) "&Ograve;&Iuml;&Oacute;&Euml;&Iuml;&Ucirc;&Icirc;&Ugrave;&Ecirc;" ================================================================================ 002+ string(63) "&Ograve;&Iuml;&Oacute;&Euml;&Iuml;&Ucirc;&Icirc;&Ugrave;&Ecirc;" 002- string(63) "&#1088;&#1086;&#1089;&#1082;&#1086;&#1096;&#1085;&#1099;&#1081;" ================================================================================ ================================================================================ /usr/src/php-5.2.2RC1/ext/standard/tests/strings/pack.phpt ================================================================================ Array ( [1] => h ) Array ( [1] => hello world ) "hello " Array ( [1] => 129 ) Array ( [1] => 127 ) Array ( [1] => 255 ) Array ( [1] => 127 ) Array ( [1] => 4 ) Array ( [1] => 65534 ) Array ( [1] => 0 ) Array ( [1] => -1000 ) Array ( [1] => -64434 ) Array ( [1] => 0 ) Array ( [1] => -2147483648 ) Array ( [1] => 65534 ) Array ( [1] => 0 ) Array ( [1] => -2147483646 ) Array ( [1] => -1 ) Array ( [1] => -2147483648 ) Array ( [1] => 65534 ) Array ( [1] => 0 ) Array ( [1] => -2147483646 ) Array ( [1] => 0 ) Array ( [1] => -2147483648 ) Array ( [1] => -30000 ) Array ( [1] => 65534 ) Array ( [1] => 1 ) Array ( [1] => 0 ) Array ( [1] => 64536 ) Array ( [1] => 1102 ) Array ( [1] => 1 ) Array ( [1] => 65534 ) Array ( [1] => 0 ) Array ( [1] => -2147483646 ) Array ( [1] => 0 ) Array ( [1] => -2147483648 ) Array ( [1] => h ) Array ( [1] => hello world ) Array ( [1] => -127 ) Array ( [1] => 127 ) Array ( [1] => -1 ) Array ( [1] => 127 ) Array ( [1] => 3 ) Array ( [1] => 65534 ) Array ( [1] => 0 ) Array ( [1] => -1000 ) Array ( [1] => -64434 ) Array ( [1] => -65535 ) Array ( [1] => -2147483647 ) Array ( [1] => 65534 ) Array ( [1] => 0 ) Array ( [1] => -2147483646 ) Array ( [1] => 0 ) Array ( [1] => -2147483648 ) Array ( [1] => 65534 ) Array ( [1] => 1 ) Array ( [1] => 0 ) Array ( [1] => 64536 ) Array ( [1] => 1102 ) Array ( [1] => 1 ) Array ( [1] => 32767 ) Array ( [1] => -1 ) Array ( [1] => 0 ) Array ( [1] => -1000 ) Array ( [1] => 1102 ) Array ( [1] => 1 ) Array ( [1] => 65534 ) Array ( [1] => 1 ) Array ( [1] => 0 ) Array ( [1] => 64536 ) Array ( [1] => 1102 ) Array ( [1] => 1 ) ================================================================================ 048+ [1] => 0 048- [1] => -1 088+ [1] => 0 088- [1] => -1 136+ [1] => 0 136- [1] => -1 208+ [1] => 0 208- [1] => -1 ================================================================================ ================================================================================ BUILD ENVIRONMENT ================================================================================ OS: Linux - Linux sgllinux.teles.de 2.6.9-42.0.10.plus.c4smp #1 SMP Tue Feb 27 17:29:28 EST 2007 i686 Autoconf: Autoconf version 2.13 Bundled Libtool: ltmain.sh (GNU libtool) 1.5.20 (1.1220.2.287 2005/08/31 18:54:15) Copyright (C) 2005 Free Software Foundation, Inc. This is free software; see the source for copying conditions. There is NO warranty; not even for MERCHANTABILITY or FITNESS FOR A PARTICULAR PURPOSE. System Libtool: N/A Compiler: Reading specs from /usr/lib/gcc/i386-redhat-linux/3.4.6/specs Configured with: ../configure --prefix=/usr --mandir=/usr/share/man --infodir=/usr/share/info --enable-shared --enable-threads=posix --disable-checking --with-system-zlib --enable-__cxa_atexit --disable-libunwind-exceptions --enable-java-awt=gtk --host=i386-redhat-linux Thread model: posix gcc version 3.4.6 20060404 (Red Hat 3.4.6-3) Bison: bison (GNU Bison) 1.875c Written by Robert Corbett and Richard Stallman. Copyright (C) 2003 Free Software Foundation, Inc. This is free software; see the source for copying conditions. There is NO warranty; not even for MERCHANTABILITY or FITNESS FOR A PARTICULAR PURPOSE. Libraries: /etc/libcwait.so (0x005d7000) libcrypt.so.1 => /lib/libcrypt.so.1 (0x00687000) libz.so.1 => /usr/lib/libz.so.1 (0x00a67000) libexslt.so.0 => /usr/lib/libexslt.so.0 (0x00101000) libgcrypt.so.11 => /usr/lib/libgcrypt.so.11 (0x0024d000) libgpg-error.so.0 => /usr/lib/libgpg-error.so.0 (0x00129000) libm.so.6 => /lib/tls/libm.so.6 (0x00870000) libhistory.so.4 => /usr/lib/libhistory.so.4 (0x006f0000) libreadline.so.4 => /usr/lib/libreadline.so.4 (0x00d3e000) libncurses.so.5 => /usr/lib/libncurses.so.5 (0x00763000) libpq.so.4 => /usr/lib/libpq.so.4 (0x00456000) librt.so.1 => /lib/tls/librt.so.1 (0x00517000) libpanel.so.5 => /usr/lib/libpanel.so.5 (0x00dc2000) libmysqlclient.so.15 => /usr/lib/mysql/libmysqlclient.so.15 (0x00297000) libmhash.so.2 => /usr/lib/libmhash.so.2 (0x00212000) libmcrypt.so.4 => /usr/lib/libmcrypt.so.4 (0x001ad000) libgmp.so.3 => /usr/lib/sse2/libgmp.so.3 (0x00912000) libfreetype.so.6 => /usr/lib/libfreetype.so.6 (0x0012d000) libX11.so.6 => /usr/X11R6/lib/libX11.so.6 (0x00e13000) libXpm.so.4 => /usr/X11R6/lib/libXpm.so.4 (0x00111000) libpng12.so.0 => /usr/lib/libpng12.so.0 (0x00c36000) libjpeg.so.62 => /usr/lib/libjpeg.so.62 (0x00b65000) libssl.so.4 => /lib/libssl.so.4 (0x001de000) libcrypto.so.4 => /lib/libcrypto.so.4 (0x0093d000) libdb-4.2.so => /lib/tls/i686/libdb-4.2.so (0x00a77000) libgdbm.so.2 => /usr/lib/libgdbm.so.2 (0x00120000) libcurl.so.3 => /usr/lib/libcurl.so.3 (0x003ed000) libbz2.so.1 => /usr/lib/libbz2.so.1 (0x00198000) libresolv.so.2 => /lib/libresolv.so.2 (0x0041d000) libdl.so.2 => /lib/libdl.so.2 (0x001a9000) libnsl.so.1 => /lib/libnsl.so.1 (0x00430000) libgssapi_krb5.so.2 => /usr/lib/libgssapi_krb5.so.2 (0x00efe000) libkrb5.so.3 => /usr/lib/libkrb5.so.3 (0x00472000) libcom_err.so.2 => /lib/libcom_err.so.2 (0x00126000) libk5crypto.so.3 => /usr/lib/libk5crypto.so.3 (0x004d7000) libidn.so.11 => /usr/lib/libidn.so.11 (0x0052b000) libclntsh.so.9.0 => /opt/oracle/9iR2/lib/libclntsh.so.9.0 (0x00f12000) libnetsnmp.so.5 => /usr/lib/libnetsnmp.so.5 (0x005d9000) libelf.so.1 => /usr/lib/libelf.so.1 (0x004f8000) libxslt.so.1 => /usr/lib/libxslt.so.1 (0x0055b000) libxml2.so.2 => /usr/lib/libxml2.so.2 (0x040d6000) libpthread.so.0 => /lib/tls/libpthread.so.0 (0x006da000) libc.so.6 => /lib/tls/libc.so.6 (0x06243000) /lib/ld-linux.so.2 (0x008a7000) libXext.so.6 => /usr/X11R6/lib/libXext.so.6 (0x00bae000) libwtc9.so => /opt/oracle/9iR2/lib/libwtc9.so (0x00244000) User's E-mail: s dot pfalz at teles dot de ================================================================================ PHPINFO ================================================================================ phpinfo() PHP Version => 5.2.2RC1 System => Linux sgllinux.teles.de 2.6.9-42.0.10.plus.c4smp #1 SMP Tue Feb 27 17:29:28 EST 2007 i686 Build Date => Apr 11 2007 12:59:34 Configure Command => './configure' '--with-apxs2=/opt/apache22/bin/apxs' '--with-config-file-path=/opt/apache22/conf/php5' '--enable-cli' '--enable-cgi' '--enable-libgcc' '--disable-debug' '--with-zlib=/usr' '--enable-bcmath' '--with-bz2=/usr' '--enable-calendar' '--enable-ctype' '--with-curl=/usr' '--with-curlwrappers' '--enable-dba' '--with-gdbm=/usr' '--with-db4=/usr' '--with-inifile' '--with-flatfile' '--enable-exif' '--enable-ftp' '--with-openssl-dir=/usr' '--with-gd' '--with-jpeg-dir=/usr' '--with-png-dir=/usr' '--with-zlib-dir=/usr' '--with-xpm-dir=/usr' '--with-ttf=/usr' '--with-freetype-dir=/usr' '--enable-gd-native-ttf' '--enable-gd-jis-conv' '--with-gettext=/usr' '--enable-hash' '--with-gmp=/usr' '--enable-mbstring' '--enable-mbregex' '--with-mcrypt' '--with-mhash=/usr' '--without-msql' '--with-mysql=/usr' '--with-zlib-dir=/usr' '--with-mysqli' '--with-ncurses=/usr' '--with-oci8' '--enable-pcntl' '--with-pdo-mysql=/usr' '--with-pdo-oci' '--with-readline=/usr' '--! enable-shmop' '--enable-soap' '--enable-sockets' '--with-sqlite' '--enable-sqlite-utf8' '--enable-sysvmsg' '--enable-sysvsem' '--enable-sysvshm' '--enable-wddx' '--with-dom=/usr' '--with-dom-xslt=/usr' '--with-dom-exslt=/usr' '--with-xsl' '--with-pear=/html/PEAR' '--with-tsrm-pthreads' '--with-gnu-ld' '--with-openssl=/usr' '--enable-sigchild' '--enable-track-vars' '--disable-trans-sid' '--enable-dbx' '--enable-dio' '--with-pgsql' '--with-pdo-pgsql' '--enable-zip' '--with-zlib-dir=/usr' '--with-snmp=/usr' Server API => Command Line Interface Virtual Directory Support => disabled Configuration File (php.ini) Path => /opt/apache22/conf/php5 Loaded Configuration File => /usr/local/Zend/etc/php.ini PHP API => 20041225 PHP Extension => 20060613 Zend Extension => 220060519 Debug Build => no Thread Safety => disabled Zend Memory Manager => enabled IPv6 Support => enabled Registered PHP Streams => zip, php, file, data, ftp, gopher, telnet, dict, ldap, http, https, ftps, compress.bzip2, compress.zlib Registered Stream Socket Transports => tcp, udp, unix, udg, ssl, sslv3, sslv2, tls Registered Stream Filters => string.rot13, string.toupper, string.tolower, string.strip_tags, convert.*, consumed, convert.iconv.*, bzip2.*, zlib.* This program makes use of the Zend Scripting Language Engine: Zend Engine v2.2.0, Copyright (c) 1998-2007 Zend Technologies _______________________________________________________________________ Configuration PHP Core Directive => Local Value => Master Value allow_call_time_pass_reference => Off => Off allow_url_fopen => On => On allow_url_include => Off => Off always_populate_raw_post_data => Off => Off arg_separator.input => & => & arg_separator.output => & => & asp_tags => Off => Off auto_append_file => no value => no value auto_globals_jit => On => On auto_prepend_file => no value => no value browscap => /html/php_browscap.ini => /html/php_browscap.ini default_charset => no value => no value default_mimetype => text/html => text/html define_syslog_variables => Off => Off disable_classes => no value => no value disable_functions => no value => no value display_errors => On => On display_startup_errors => Off => Off doc_root => no value => no value docref_ext => no value => no value docref_root => no value => no value enable_dl => On => On error_append_string => no value => no value error_log => /var/log/apache2/php5-errors.log => /var/log/apache2/php5-errors.log error_prepend_string => no value => no value error_reporting => 8183 => 8183 expose_php => On => On extension_dir => ./ => ./ file_uploads => On => On highlight.bg => <font style="color: #FFFFFF">#FFFFFF</font> => <font style="color: #FFFFFF">#FFFFFF</font> highlight.comment => <font style="color: #FF8000">#FF8000</font> => <font style="color: #FF8000">#FF8000</font> highlight.default => <font style="color: #0000BB">#0000BB</font> => <font style="color: #0000BB">#0000BB</font> highlight.html => <font style="color: #000000">#000000</font> => <font style="color: #000000">#000000</font> highlight.keyword => <font style="color: #007700">#007700</font> => <font style="color: #007700">#007700</font> highlight.string => <font style="color: #DD0000">#DD0000</font> => <font style="color: #DD0000">#DD0000</font> html_errors => Off => Off ignore_repeated_errors => Off => Off ignore_repeated_source => Off => Off ignore_user_abort => Off => Off implicit_flush => On => On include_path => .:/html/PEAR => .:/html/PEAR log_errors => On => On log_errors_max_len => 0 => 0 magic_quotes_gpc => Off => Off magic_quotes_runtime => Off => Off magic_quotes_sybase => Off => Off mail.force_extra_parameters => no value => no value max_execution_time => 0 => 0 max_input_nesting_level => 64 => 64 max_input_time => -1 => -1 memory_limit => 64M => 64M open_basedir => no value => no value output_buffering => 0 => 0 output_handler => no value => no value post_max_size => 64M => 64M precision => 14 => 14 realpath_cache_size => 16K => 16K realpath_cache_ttl => 120 => 120 register_argc_argv => On => On register_globals => Off => Off register_long_arrays => Off => Off report_memleaks => On => On report_zend_debug => Off => Off safe_mode => Off => Off safe_mode_exec_dir => no value => no value safe_mode_gid => Off => Off safe_mode_include_dir => no value => no value sendmail_from => no value => no value sendmail_path => /usr/sbin/sendmail -t -i => /usr/sbin/sendmail -t -i serialize_precision => 100 => 100 short_open_tag => On => On SMTP => localhost => localhost smtp_port => 25 => 25 sql.safe_mode => Off => Off track_errors => Off => Off unserialize_callback_func => no value => no value upload_max_filesize => 64M => 64M upload_tmp_dir => no value => no value user_dir => no value => no value variables_order => GEPCS => GEPCS xmlrpc_error_number => 0 => 0 xmlrpc_errors => Off => Off y2k_compliance => On => On zend.ze1_compatibility_mode => Off => Off bcmath BCMath support => enabled bz2 BZip2 Support => Enabled Stream Wrapper support => compress.bz2:// Stream Filter support => bzip2.decompress, bzip2.compress BZip2 Version => 1.0.2, 30-Dec-2001 calendar Calendar support => enabled ctype ctype functions => enabled curl cURL support => enabled cURL Information => libcurl/7.12.1 OpenSSL/0.9.7a zlib/1.2.1.2 libidn/0.5.6 date date/time support => enabled "Olson" Timezone Database Version => 2007.3 Timezone Database => internal Default timezone => Europe/Berlin Directive => Local Value => Master Value date.default_latitude => 31.7667 => 31.7667 date.default_longitude => 35.2333 => 35.2333 date.sunrise_zenith => 90.583333 => 90.583333 date.sunset_zenith => 90.583333 => 90.583333 date.timezone => Europe/Berlin => Europe/Berlin dba DBA support => enabled Supported handlers => gdbm cdb cdb_make db4 inifile flatfile dom DOM/XML => enabled DOM/XML API Version => 20031129 libxml Version => 2.6.16 HTML Support => enabled XPath Support => enabled XPointer Support => enabled Schema Support => enabled RelaxNG Support => enabled exif EXIF Support => enabled EXIF Version => 1.4 $Id: exif.c,v 1.173.2.5.2.19 2007/02/27 03:04:40 iliaa Exp $ Supported EXIF Version => 0220 Supported filetypes => JPEG,TIFF filter Input Validation and Filtering => enabled Revision => $Revision: 1.52.2.39 $ Directive => Local Value => Master Value filter.default => unsafe_raw => unsafe_raw filter.default_flags => no value => no value ftp FTP support => enabled gd GD Support => enabled GD Version => bundled (2.0.34 compatible) FreeType Support => enabled FreeType Linkage => with freetype FreeType Version => 2.1.9 GIF Read Support => enabled GIF Create Support => enabled JPG Support => enabled PNG Support => enabled WBMP Support => enabled XPM Support => enabled XBM Support => enabled JIS-mapped Japanese Font Support => enabled gettext GetText Support => enabled gmp gmp support => enabled hash hash support => enabled Hashing Engines => md2 md4 md5 sha1 sha256 sha384 sha512 ripemd128 ripemd160 ripemd256 ripemd320 whirlpool tiger128,3 tiger160,3 tiger192,3 tiger128,4 tiger160,4 tiger192,4 snefru gost adler32 crc32 crc32b haval128,3 haval160,3 haval192,3 haval224,3 haval256,3 haval128,4 haval160,4 haval192,4 haval224,4 haval256,4 haval128,5 haval160,5 haval192,5 haval224,5 haval256,5 iconv iconv support => enabled iconv implementation => glibc iconv library version => 2.3.4 Directive => Local Value => Master Value iconv.input_encoding => ISO-8859-1 => ISO-8859-1 iconv.internal_encoding => ISO-8859-1 => ISO-8859-1 iconv.output_encoding => ISO-8859-1 => ISO-8859-1 json json support => enabled json version => 1.2.1 libxml libXML support => active libXML Version => 2.6.16 libXML streams => enabled mbstring Multibyte Support => enabled Multibyte string engine => libmbfl Multibyte (japanese) regex support => enabled Multibyte regex (oniguruma) version => 4.4.4 Multibyte regex (oniguruma) backtrack check => On mbstring extension makes use of "streamable kanji code filter and converter", which is distributed under the GNU Lesser General Public License version 2.1. Directive => Local Value => Master Value mbstring.detect_order => no value => no value mbstring.encoding_translation => Off => Off mbstring.func_overload => 0 => 0 mbstring.http_input => pass => pass mbstring.http_output => pass => pass mbstring.internal_encoding => ISO-8859-1 => no value mbstring.language => neutral => neutral mbstring.strict_detection => Off => Off mbstring.substitute_character => no value => no value mcrypt mcrypt support => enabled Version => 2.5.7 Api No => 20021217 Supported ciphers => cast-128 gost rijndael-128 twofish arcfour cast-256 loki97 rijndael-192 saferplus wake blowfish-compat des rijndael-256 serpent xtea blowfish enigma rc2 tripledes Supported modes => cbc cfb ctr ecb ncfb nofb ofb stream Directive => Local Value => Master Value mcrypt.algorithms_dir => no value => no value mcrypt.modes_dir => no value => no value mhash MHASH support => Enabled MHASH API Version => 20020524 mysql MySQL Support => enabled Active Persistent Links => 0 Active Links => 0 Client API version => 5.0.27 MYSQL_MODULE_TYPE => external MYSQL_SOCKET => /var/lib/mysql/mysql.sock MYSQL_INCLUDE => -I/usr/include/mysql MYSQL_LIBS => -L/usr/lib/mysql -lmysqlclient Directive => Local Value => Master Value mysql.allow_persistent => On => On mysql.connect_timeout => 60 => 60 mysql.default_host => no value => no value mysql.default_password => no value => no value mysql.default_port => no value => no value mysql.default_socket => no value => no value mysql.default_user => no value => no value mysql.max_links => Unlimited => Unlimited mysql.max_persistent => Unlimited => Unlimited mysql.trace_mode => Off => Off mysqli MysqlI Support => enabled Client API library version => 5.0.27 Client API header version => 5.0.27 MYSQLI_SOCKET => /var/lib/mysql/mysql.sock Directive => Local Value => Master Value mysqli.default_host => no value => no value mysqli.default_port => 3306 => 3306 mysqli.default_pw => no value => no value mysqli.default_socket => no value => no value mysqli.default_user => no value => no value mysqli.max_links => Unlimited => Unlimited mysqli.reconnect => Off => Off ncurses ncurses support => enabled ncurses library version => 5.4 color support => yes oci8 OCI8 Support => enabled Version => 1.2.3 Revision => $Revision: 1.269.2.16.2.32 $ Active Persistent Connections => 0 Active Connections => 0 Oracle Version => 9.2 Compile-time ORACLE_HOME => /opt/oracle/9iR2 Libraries Used => Temporary Lob support => enabled Collections support => enabled Directive => Local Value => Master Value oci8.default_prefetch => 20 => 20 oci8.max_persistent => -1 => -1 oci8.old_oci_close_semantics => 0 => 0 oci8.persistent_timeout => 15 => 15 oci8.ping_interval => 0 => 0 oci8.privileged_connect => Off => Off oci8.statement_cache_size => 50 => 50 openssl OpenSSL support => enabled OpenSSL Version => OpenSSL 0.9.7a Feb 19 2003 pcntl pcntl support => enabled pcre PCRE (Perl Compatible Regular Expressions) Support => enabled PCRE Library Version => 7.0 18-Dec-2006 PDO PDO support => enabled PDO drivers => sqlite2, sqlite, pgsql, oci, mysql pdo_mysql PDO Driver for MySQL, client library version => 5.0.27 PDO_OCI PDO Driver for OCI 8 and later => enabled pdo_pgsql PDO Driver for PostgreSQL => enabled PostgreSQL(libpq) Version => 8.1.8 Module version => 1.0.2 Revision => $Id: pdo_pgsql.c,v 1.7.2.11.2.1 2007/01/01 09:36:05 sebastian Exp $ pdo_sqlite PDO Driver for SQLite 3.x => enabled PECL Module version => (bundled) 1.0.1 $Id: pdo_sqlite.c,v 1.10.2.6.2.2 2007/03/23 14:30:00 wez Exp $ SQLite Library => 3.3.15 pgsql PostgreSQL Support => enabled PostgreSQL(libpq) Version => 8.1.8 Multibyte character support => enabled SSL support => enabled Active Persistent Links => 0 Active Links => 0 Directive => Local Value => Master Value pgsql.allow_persistent => On => On pgsql.auto_reset_persistent => Off => Off pgsql.ignore_notice => Off => Off pgsql.log_notice => Off => Off pgsql.max_links => Unlimited => Unlimited pgsql.max_persistent => Unlimited => Unlimited posix Revision => $Revision: 1.70.2.3.2.15 $ Reflection Reflection => enabled Version => $Id: php_reflection.c,v 1.164.2.33.2.36 2007/03/17 23:00:49 tony2001 Exp $ session Session Support => enabled Registered save handlers => files user sqlite Registered serializer handlers => php php_binary wddx Directive => Local Value => Master Value session.auto_start => Off => Off session.bug_compat_42 => Off => Off session.bug_compat_warn => On => On session.cache_expire => 180 => 180 session.cache_limiter => nocache => nocache session.cookie_domain => no value => no value session.cookie_httponly => Off => Off session.cookie_lifetime => 0 => 0 session.cookie_path => / => / session.cookie_secure => Off => Off session.entropy_file => no value => no value session.entropy_length => 0 => 0 session.gc_divisor => 1000 => 1000 session.gc_maxlifetime => 1440 => 1440 session.gc_probability => 1 => 1 session.hash_bits_per_character => 5 => 5 session.hash_function => 0 => 0 session.name => PHPSESSID => PHPSESSID session.referer_check => no value => no value session.save_handler => files => files session.save_path => no value => no value session.serialize_handler => php => php session.use_cookies => On => On session.use_only_cookies => Off => Off session.use_trans_sid => 0 => 0 shmop shmop support => enabled SimpleXML Simplexml support => enabled Revision => $Revision: 1.151.2.22.2.24 $ Schema support => enabled snmp NET-SNMP Support => enabled NET-SNMP Version => 5.1.2 soap Soap Client => enabled Soap Server => enabled Directive => Local Value => Master Value soap.wsdl_cache => 1 => 1 soap.wsdl_cache_dir => /tmp => /tmp soap.wsdl_cache_enabled => 1 => 1 soap.wsdl_cache_limit => 5 => 5 soap.wsdl_cache_ttl => 86400 => 86400 sockets Sockets Support => enabled SPL SPL support => enabled Interfaces => Countable, OuterIterator, RecursiveIterator, SeekableIterator, SplObserver, SplSubject Classes => AppendIterator, ArrayIterator, ArrayObject, BadFunctionCallException, BadMethodCallException, CachingIterator, DirectoryIterator, DomainException, EmptyIterator, FilterIterator, InfiniteIterator, InvalidArgumentException, IteratorIterator, LengthException, LimitIterator, LogicException, NoRewindIterator, OutOfBoundsException, OutOfRangeException, OverflowException, ParentIterator, RangeException, RecursiveArrayIterator, RecursiveCachingIterator, RecursiveDirectoryIterator, RecursiveFilterIterator, RecursiveIteratorIterator, RecursiveRegexIterator, RegexIterator, RuntimeException, SimpleXMLIterator, SplFileInfo, SplFileObject, SplObjectStorage, SplTempFileObject, UnderflowException, UnexpectedValueException SQLite SQLite support => enabled PECL Module version => 2.0-dev $Id: sqlite.c,v 1.166.2.13.2.7 2007/03/06 02:17:13 stas Exp $ SQLite Library => 2.8.17 SQLite Encoding => UTF-8 Directive => Local Value => Master Value sqlite.assoc_case => 0 => 0 standard Regex Library => Bundled library enabled Dynamic Library Support => enabled Path to sendmail => /usr/sbin/sendmail -t -i Directive => Local Value => Master Value assert.active => 1 => 1 assert.bail => 0 => 0 assert.callback => no value => no value assert.quiet_eval => 0 => 0 assert.warning => 1 => 1 auto_detect_line_endings => 0 => 0 default_socket_timeout => 30 => 30 safe_mode_allowed_env_vars => PHP_ => PHP_ safe_mode_protected_env_vars => LD_LIBRARY_PATH => LD_LIBRARY_PATH url_rewriter.tags => a=href,area=href,frame=src,input=src,form=fakeentry => a=href,area=href,frame=src,input=src,form=fakeentry user_agent => no value => no value sysvmsg sysvmsg support => enabled Revision => $Revision: 1.20.2.3.2.6 $ tokenizer Tokenizer Support => enabled wddx WDDX Support => enabled WDDX Session Serializer => enabled xml XML Support => active XML Namespace Support => active libxml2 Version => 2.6.16 xmlreader XMLReader => enabled xmlwriter XMLWriter => enabled xsl XSL => enabled libxslt Version => 1.1.11 libxslt compiled against libxml Version => 2.6.16 EXSLT => enabled libexslt Version => 1.1.11 zip Zip => enabled Extension Version => $Id: php_zip.c,v 1.1.2.31 2007/03/14 15:02:20 iliaa Exp $ Zip version => 2.0.0 Libzip version => 0.7.1 zlib ZLib Support => enabled Stream Wrapper support => compress.zlib:// Stream Filter support => zlib.inflate, zlib.deflate Compiled Version => 1.2.1.2 Linked Version => 1.2.1.2 Directive => Local Value => Master Value zlib.output_compression => Off => Off zlib.output_compression_level => -1 => -1 zlib.output_handler => no value => no value Additional Modules Module Name readline sysvsem sysvshm Environment Variable => Value HOSTNAME => sgllinux.teles.de TEST_PHP_SRCDIR => /usr/src/php-5.2.2RC1 SHELL => /bin/sh TERM => xterm MAKEFLAGS => HISTSIZE => 1000 NLS_LANG => AMERICAN_AMERICA.WE8ISO8859P1 SSH_CLIENT => deleted SSH_TTY => deleted USER => root LS_COLORS => no=00:fi=00:di=00;34:ln=00;36:pi=40;33:so=00;35:bd=40;33;01:cd=40;33;01:or=01;05;37;41:mi=01;05;37;41:ex=00;32:*.cmd=00;32:*.exe=00;32:*.com=00;32:*.btm=00;32:*.bat=00;32:*.sh=00;32:*.csh=00;32:*.tar=00;31:*.tgz=00;31:*.arj=00;31:*.taz=00;31:*.lzh=00;31:*.zip=00;31:*.z=00;31:*.Z=00;31:*.gz=00;31:*.bz2=00;31:*.bz=00;31:*.tz=00;31:*.rpm=00;31:*.cpio=00;31:*.jpg=00;35:*.gif=00;35:*.bmp=00;35:*.xbm=00;35:*.xpm=00;35:*.png=00;35:*.tif=00;35: LD_LIBRARY_PATH => /opt/oracle/9iR2/lib:/opt/oracle/9iR2/lib32:/lib:/usr/lib:/usr/local/lib ORACLE_SID => SGLDEV ORACLE_BASE => /opt/oracle SSH_AUTH_SOCK => deleted KDEDIR => /usr MAKELEVEL => 1 MFLAGS => PATH => /opt/oracle/9iR2/bin:/opt/oracle/9iR2/bin:/usr/kerberos/sbin:/usr/kerberos/bin:/usr/local/sbin:/usr/local/bin:/sbin:/bin:/usr/sbin:/usr/bin:/usr/X11R6/bin:/root/bin MAIL => /var/spool/mail/root _ => /usr/src/php-5.2.2RC1/sapi/cli/php PWD => /usr/src/php-5.2.2RC1 INPUTRC => /etc/inputrc TEST_PHP_EXECUTABLE => /usr/src/php-5.2.2RC1/sapi/cli/php ORACLE_TERM => xterm HOME => /root SHLVL => 3 LD_ASSUME_KERNEL => 2.4.21 CFLAGS => -I/usr/include -O3 -march=pentium4 -pipe -mfpmath=sse -fomit-frame-pointer -funroll-loops -prefer-non-pic LOGNAME => root SSH_CONNECTION => deleted LESSOPEN => |/usr/bin/lesspipe.sh %s ORA_NLS33 => /opt/oracle/9iR2/ocommon/nls/admin/data CC => gcc ORACLE_HOME => /opt/oracle/9iR2 G_BROKEN_FILENAMES => 1 PHP Variables Variable => Value _SERVER["HOSTNAME"] => sgllinux.teles.de _SERVER["TEST_PHP_SRCDIR"] => /usr/src/php-5.2.2RC1 _SERVER["SHELL"] => /bin/sh _SERVER["TERM"] => xterm _SERVER["MAKEFLAGS"] => _SERVER["HISTSIZE"] => 1000 _SERVER["NLS_LANG"] => AMERICAN_AMERICA.WE8ISO8859P1 _SERVER["SSH_CLIENT"] => deleted _SERVER["SSH_TTY"] => deleted _SERVER["USER"] => root _SERVER["LS_COLORS"] => no=00:fi=00:di=00;34:ln=00;36:pi=40;33:so=00;35:bd=40;33;01:cd=40;33;01:or=01;05;37;41:mi=01;05;37;41:ex=00;32:*.cmd=00;32:*.exe=00;32:*.com=00;32:*.btm=00;32:*.bat=00;32:*.sh=00;32:*.csh=00;32:*.tar=00;31:*.tgz=00;31:*.arj=00;31:*.taz=00;31:*.lzh=00;31:*.zip=00;31:*.z=00;31:*.Z=00;31:*.gz=00;31:*.bz2=00;31:*.bz=00;31:*.tz=00;31:*.rpm=00;31:*.cpio=00;31:*.jpg=00;35:*.gif=00;35:*.bmp=00;35:*.xbm=00;35:*.xpm=00;35:*.png=00;35:*.tif=00;35: _SERVER["LD_LIBRARY_PATH"] => /opt/oracle/9iR2/lib:/opt/oracle/9iR2/lib32:/lib:/usr/lib:/usr/local/lib _SERVER["ORACLE_SID"] => SGLDEV _SERVER["ORACLE_BASE"] => /opt/oracle _SERVER["SSH_AUTH_SOCK"] => deleted _SERVER["KDEDIR"] => /usr _SERVER["MAKELEVEL"] => 1 _SERVER["MFLAGS"] => _SERVER["PATH"] => /opt/oracle/9iR2/bin:/opt/oracle/9iR2/bin:/usr/kerberos/sbin:/usr/kerberos/bin:/usr/local/sbin:/usr/local/bin:/sbin:/bin:/usr/sbin:/usr/bin:/usr/X11R6/bin:/root/bin _SERVER["MAIL"] => /var/spool/mail/root _SERVER["_"] => /usr/src/php-5.2.2RC1/sapi/cli/php _SERVER["PWD"] => /usr/src/php-5.2.2RC1 _SERVER["INPUTRC"] => /etc/inputrc _SERVER["TEST_PHP_EXECUTABLE"] => /usr/src/php-5.2.2RC1/sapi/cli/php _SERVER["ORACLE_TERM"] => xterm _SERVER["HOME"] => /root _SERVER["SHLVL"] => 3 _SERVER["LD_ASSUME_KERNEL"] => 2.4.21 _SERVER["CFLAGS"] => -I/usr/include -O3 -march=pentium4 -pipe -mfpmath=sse -fomit-frame-pointer -funroll-loops -prefer-non-pic _SERVER["LOGNAME"] => root _SERVER["SSH_CONNECTION"] => deleted _SERVER["LESSOPEN"] => |/usr/bin/lesspipe.sh %s _SERVER["ORA_NLS33"] => /opt/oracle/9iR2/ocommon/nls/admin/data _SERVER["CC"] => gcc _SERVER["ORACLE_HOME"] => /opt/oracle/9iR2 _SERVER["G_BROKEN_FILENAMES"] => 1 _SERVER["PHP_SELF"] => _SERVER["SCRIPT_NAME"] => _SERVER["SCRIPT_FILENAME"] => _SERVER["PATH_TRANSLATED"] => _SERVER["DOCUMENT_ROOT"] => _SERVER["REQUEST_TIME"] => 1176365471 _SERVER["argv"] => Array ( ) _SERVER["argc"] => 0 _ENV["HOSTNAME"] => sgllinux.teles.de _ENV["TEST_PHP_SRCDIR"] => /usr/src/php-5.2.2RC1 _ENV["SHELL"] => /bin/sh _ENV["TERM"] => xterm _ENV["MAKEFLAGS"] => _ENV["HISTSIZE"] => 1000 _ENV["NLS_LANG"] => AMERICAN_AMERICA.WE8ISO8859P1 _ENV["SSH_CLIENT"] => deleted _ENV["SSH_TTY"] => deleted _ENV["USER"] => root _ENV["LS_COLORS"] => no=00:fi=00:di=00;34:ln=00;36:pi=40;33:so=00;35:bd=40;33;01:cd=40;33;01:or=01;05;37;41:mi=01;05;37;41:ex=00;32:*.cmd=00;32:*.exe=00;32:*.com=00;32:*.btm=00;32:*.bat=00;32:*.sh=00;32:*.csh=00;32:*.tar=00;31:*.tgz=00;31:*.arj=00;31:*.taz=00;31:*.lzh=00;31:*.zip=00;31:*.z=00;31:*.Z=00;31:*.gz=00;31:*.bz2=00;31:*.bz=00;31:*.tz=00;31:*.rpm=00;31:*.cpio=00;31:*.jpg=00;35:*.gif=00;35:*.bmp=00;35:*.xbm=00;35:*.xpm=00;35:*.png=00;35:*.tif=00;35: _ENV["LD_LIBRARY_PATH"] => /opt/oracle/9iR2/lib:/opt/oracle/9iR2/lib32:/lib:/usr/lib:/usr/local/lib _ENV["ORACLE_SID"] => SGLDEV _ENV["ORACLE_BASE"] => /opt/oracle _ENV["SSH_AUTH_SOCK"] => deleted _ENV["KDEDIR"] => /usr _ENV["MAKELEVEL"] => 1 _ENV["MFLAGS"] => _ENV["PATH"] => /opt/oracle/9iR2/bin:/opt/oracle/9iR2/bin:/usr/kerberos/sbin:/usr/kerberos/bin:/usr/local/sbin:/usr/local/bin:/sbin:/bin:/usr/sbin:/usr/bin:/usr/X11R6/bin:/root/bin _ENV["MAIL"] => /var/spool/mail/root _ENV["_"] => /usr/src/php-5.2.2RC1/sapi/cli/php _ENV["PWD"] => /usr/src/php-5.2.2RC1 _ENV["INPUTRC"] => /etc/inputrc _ENV["TEST_PHP_EXECUTABLE"] => /usr/src/php-5.2.2RC1/sapi/cli/php _ENV["ORACLE_TERM"] => xterm _ENV["HOME"] => /root _ENV["SHLVL"] => 3 _ENV["LD_ASSUME_KERNEL"] => 2.4.21 _ENV["CFLAGS"] => -I/usr/include -O3 -march=pentium4 -pipe -mfpmath=sse -fomit-frame-pointer -funroll-loops -prefer-non-pic _ENV["LOGNAME"] => root _ENV["SSH_CONNECTION"] => deleted _ENV["LESSOPEN"] => |/usr/bin/lesspipe.sh %s _ENV["ORA_NLS33"] => /opt/oracle/9iR2/ocommon/nls/admin/data _ENV["CC"] => gcc _ENV["ORACLE_HOME"] => /opt/oracle/9iR2 _ENV["G_BROKEN_FILENAMES"] => 1 PHP License This program is free software; you can redistribute it and/or modify it under the terms of the PHP License as published by the PHP Group and included in the distribution in the file: LICENSE This program is distributed in the hope that it will be useful, but WITHOUT ANY WARRANTY; without even the implied warranty of MERCHANTABILITY or FITNESS FOR A PARTICULAR PURPOSE. If you did not receive a copy of the PHP license, or have any questions about PHP licensing, please contact license@php.net.

« previous php.qa (#28149) next »